##TITLE=4 e-com $$ Begin of the data block
##JCAMP-DX=5.00 $$ ACD/SpecManager v 10.08
##SPECTROMETER/DATA SYSTEM=Alpha
##DATE=16 Oct 2013 13:51:24
##DATA TYPE=INFRARED SPECTRUM
##DATA CLASS=XYDATA
##ORIGIN=
##OWNER=
##NPOINTS=1765
##FIRSTX=399.75695801
##LASTX=3997.56933594
##MAXX=3997.56933594
##MINX=399.75695801
##MAXY=0.82434613
##MINY=0.31413984
##XFACTOR=1.0000000000
##YFACTOR=1.000000000000000e-9
##FIRSTY=0.60335529
##DELTAX=2.03957629
##XUNITS=1/CM
##YUNITS=ARBITRARY UNITS
##XYDATA=(X++(Y..Y))
399.8F03355289j821638l922462m011452j035750J787722J463294p79867j350940O86706
418.1E94370902J970350n56707l479123l237248m06801O61015j427412l528476k829730
436.5E81536770L37601K501368J569808j71423L97801K407372K822638P63833j347780
454.8E90817988r81391O83070L41773k071739l549277k411366n26726p21097k947390
473.2E78633845l932357k278030j85132l7491j655936k413810r75072N93006k7120
491.5E67721903k108454k902568j499593p6652q98718l050685l761173k579748j552165
509.9E49292147k314150l932893m299582l065586j923143k058924k700150k400279
526.2E26597440o23464J094341J242697O05524J139760L302574M825234L812313J402438
$$ plain form
399.8 603355289 601533651 597611189 593599737 592563987 594351709 595815003 595035136 593684196 594370902
418.1 594370902 596341252 595784545 592305422 589068174 588661373 589322388 587894976 584366500 581536770
436.5 581536770 581874371 584375739 585945547 585774124 586171925 588579297 591401935 592165768 590817988
454.8 590817988 589836597 590519667 590861440 588789701 585240424 582829058 582302332 581581235 578633845
473.2 578633845 574701488 572423458 572238326 572200835 570544899 568131089 567156017 567749023 567721903
491.5 567721903 565613449 562710881 561211288 561134636 560235918 557185233 553424060 550844312 549292147
509.9 549292147 546977997 543045104 538745522 535679936 533756793 531697869 528997719 526597440
526.2 526597440 525973976 527068317 528311014 528916538 530056298 533358872 538184106 541996419 543398857
544.6E43398857q2970K71142R11474j3292j803875k484679j802027j288116k202630
562.9E34903884m105270n244374m673481l454447k756357k208173o06180K195239M510165
581.3E18561006M998385M098356L345967L465890L402710J959920p8618q14080Q0049
599.6E39019585J008749O51300m82500q06272M60446J973927K016425R50158O90937
618E45482755K244711M040122M056573K583861J768529K616287L629267L011286J289010
636.3E70722401N49019J615047K882659K535940R76443J98245J101971K201497J735568
654.7E84518790N3346p32898K59638J502573J723945J218200o3658J44720J787484
673.1E90412140K159893Q11756N6922J158059K386570J819134N5432p45237P9751Q35598
$$ plain form
544.6 543398857 543315887 543587029 544498503 544485211 542681336 540196657 538394630 537106514 534903884
562.9 534903884 530798614 525554240 520880759 517426312 514669955 512461782 511855602 514050841 518561006
581.3 518561006 523559391 527657747 531003714 534469604 537872314 539832234 539753616 538939536 539019585
599.6 539019585 540028334 540679634 540197134 539390862 539851308 541825235 543841660 544791818 545482755
618 545482755 547727466 551767588 555824161 558408022 560176551 562792838 566422105 569433391 570722401
636.3 570722401 571271420 572886467 575769126 578305066 579281509 579479754 580581725 582783222 584518790
654.7 584518790 584572136 583839238 584098876 585601449 587325394 588543594 588479936 588624656 590412140
673.1 590412140 592572033 593383789 593440711 594598770 596985340 598804474 598859906 598114669 598194420 599030018
693.5E99030018P570j797378k570689j545668j90377j18434r46582q37326R73344K987802
713.8E94992280L405809K634883K505899L767133N245149N307615L858208K753079
730.2F24470055L284156M174710L578365J787543O23107Q99911J516223O98685j430451
748.5F39602304k749026k279222j457751j834571l059924l429294j953423L15964J682342
766.9F24837399J980304K541065M128695N856812O148160M713654L381610L585219
783.2F57172918M363537M073024K649486J568198J994133L237367L706872K914131
799.5F81679666K068043K350449L054381K774477J343608j9372o4254Q91626J106441
817.9F95185065p9453j305639j375795p98941r42111k113938l209650l250242k549648
$$ plain form
693.5 599030018 599037588 597240210 594669521 593123853 592933476 592815042 591868460 591031134 592004478 594992280
713.8 594992280 598398089 601032972 603538871 607306004 612551153 617858768 621716976 624470055
730.2 624470055 627754211 631928921 635507286 637294829 637917936 638817847 640334070 641032755 639602304
748.5 639602304 636853278 634574056 633116305 631281734 628221810 624792516 622839093 623155057 624837399
766.9 624837399 626817703 629358768 633487463 639344275 645492435 650206089 653587699 657172918
783.2 657172918 661536455 665609479 668258965 669827163 671821296 675058663 678765535 681679666
799.5 681679666 683747709 686098158 689152539 691927016 693270624 693251252 693186998 694078624 695185065
817.9 695185065 695105612 693799973 692424178 691625237 690683126 688569188 685359538 682109296 679559648
836.2F79559648k258539k899349l579616l184259j959324j192212j612902k430379
852.5F60443068k457262j714527r36151k01642J230478L693819O363869P894635P533729
870.9F81850016N962134M507660L609121K514243M82858j864016l235460l357053l154754
889.3F87314749l520429m203916m241884l400504k613664k877176l947317m695237
905.6F57814622m704774m717826n466700o557047o931007o191910m942476l928244
921.9F14374638l219664k344251j088441Q6010O18398N98014P91966J771272L031730
940.2F14619672L438592K459765O90520r75728k471626m311204o407023p910669q416771
958.6E90715528q552969r224892j0594844j1924804j2690425j3307273j4391840j5910625
$$ plain form
836.2 679559648 677301109 674401760 670822144 667637885 665678561 664486349 662873447 660443068
852.5 660443068 657985806 656271279 655335128 655133486 656363964 660057783 666421652 674316287 681850016
870.9 681850016 687812150 692319810 695928931 698443174 698926032 697062016 693826556 690469503 687314749
889.3 687314749 683794320 679590404 675348520 671948016 669334352 666457176 662509859 657814622
905.6 657814622 653109848 648392022 642925322 636368275 629437268 623245358 618302882 614374638
921.9 614374638 611154974 608810723 607722282 607808292 608426690 609024704 609816670 611587942 614619672
940.2 614619672 618058264 620518029 621208549 620232821 617761195 613449991 607042968 599132299 590715528
958.6 590715528 582162559 572937667 562342823 550418019 537727594 524420321 510028481 494117856
974.9D94117856j7196059j7725080j7632097j7266959j6634345j5425563j3511271
989.2C78726482j1230290r126544p405132n868494m351884l040701k355010k469480
1005.5C32878947l065198l556759l580778l222287k659142j793325n00590J111240
1021.8C15612108K663940L761291M354716M601627M572511M062116K883852J405507
1038.1C43917668M14103L00348P12544J133740J589447K579242M327088O303132P703811
1056.5C68981123Q399010Q880526R271234Q700102N916685O83814n352765r539157
1072.8C95940572j0252804p987320m445612q02637K567530N295158O918847P450730
1089.1C94684464P331639O824643N845844M250169K358020R79423P47174J569390K693326
$$ plain form
974.9 494117856 476921797 459196717 441564620 424297661 407663316 392237753 378726482
989.2 378726482 367496192 358369648 350964516 345096022 340744138 337703437 335348427 332878947
1005.5 332878947 329813749 326256990 322676212 319453925 316794783 315001458 314500868 315612108
1021.8 315612108 318276048 322037339 326392055 330993682 335566193 339628309 342512161 343917668
1038.1 343917668 344331771 344632119 345344663 346478403 348067850 350647092 354974180 361277312 368981123
1056.5 368981123 377380133 386260659 395531893 404231995 410148680 410832494 405479729 395940572
1072.8 395940572 385687768 377700448 373254836 372452199 375019729 380314887 387233734 394684464
1089.1 394684464 402016103 408840746 414686590 418936759 421294779 422274202 423021376 424590766 427284092
1107.5D27284092L380418L591209L705621L755003L402203K596170J912594J970291
1123.8D51597601K687603L333897L315598K582788J355290k31891k201826m377723
1140.1D58061337o147295o871462o526380n680025m719675l439366j523465R11563
1156.4D24065232L339559N392760P262558R295434J1371970J2876451J3366550J3071448
1172.7E00041962J2601435J2214959J1584639J0348260Q684159P245004O344318N490542
1189.1E74555278M114449K459526J372158J166642J241565J036346P19011Q56697J627207
1207.4E89148879K434373K536118J980484J455426J256644R57787Q7679j161873k026201
1225.8E96669316k077579j777351j788676k096355k080202j386225m28856J17720K17259
$$ plain form
1107.5 427284092 430664510 434255719 437961340 441716343 445118546 447714716 449627310 451597601
1123.8 451597601 454285204 457619101 460934699 463517487 464872777 464640886 462439060 458061337
1140.1 458061337 451914042 445042580 438516200 432836175 428116500 424677134 423153669 424065232
1156.4 424065232 427404791 432797551 440060109 449355543 460727513 473603964 486970514 500041962
1172.7 500041962 512643397 524858356 536442995 546791255 555475414 562720418 569064736 574555278
1189.1 574555278 578669727 581129253 582501411 583668053 584909618 585945964 586664975 587521672 589148879
1207.4 589148879 591583252 594119370 596099854 597555280 598811924 599769711 599857390 598695517 596669316
1225.8 596669316 594591737 592814386 591025710 588929355 586849153 585462928 585034072 585151792 585369051
1244.1E85369051M83751J216054J975775K124726J659870J243890J332044J659453
1260.4E97064614J654685J277089J075864J409769J866996J725376R60290K88248K48492
1278.8F07571423O26445Q00669N47886K12133J48475K46882K2650o81102j294673j210689
1299.2F06990099o53744l55840o57439j128435j093328o55591n37575r44733j394987
1317.6E99568427j434744j160443j185059j832426k594948k720952k189338j625836
1333.9E84824681j414656j340092r60350k21789L15846J79529l32952n68092m11987
1352.2E80070138l86298q33273j345098j434803j284301j246989j314699j356900j024664
1370.6E69843113m62412m22657q45730j010061p66396j60217O46591R55999M09066
$$ plain form
1244.1 585369051 585852802 587068856 589044631 591169357 592829227 594073117 595405161 597064614
1260.4 597064614 598719299 599996388 601072252 602482021 604349017 606074393 607034683 607322931 607571423
1278.8 607571423 608197868 608998537 609546423 609758556 609907031 610153913 610176563 609495461 608200788 606990099
1299.2 606990099 606336355 605980515 605323076 604194641 603101313 602445722 601908147 600963414 599568427
1317.6 599568427 598133683 596973240 595788181 593955755 591360807 588639855 586450517 584824681
1333.9 584824681 583410025 582069933 581109583 580887794 581203640 581383169 581050217 580482125 580070138
1352.2 580070138 579683840 578850567 577505469 576070666 574786365 573539376 572224677 570867777 569843113
1370.6 569843113 569380701 568958044 568112314 567102253 566335857 566175640 566822231 567778230 568187296
1388.9E68187296l6895j669j52647n97775j024127r16601j83761K88308O8605l75748
1409.3E65254986n51521j40965O84142J212775J001895Q36193J374722J794457J618743
1427.7E73085427R66728L87788N62131Q05557K51234k38717r9957K76148N80550J67608
1448.1E76744497q29101j381874r23157K5928M58420P43985J680732L116846M858494
1466.4E84494770O934821R465993J1489212J0503590Q371413P125497N978644M759967
1482.8F49123907L886163L537417K626002O39379o28531o76930q46923j495599j877785
1501.1F54287100j653671j728952l478766m530668m326344m236877l566086k326965
1517.4F28438771j175463j315594k217055k402365k290368j788318j489699k117216
$$ plain form
1388.9 568187296 568150401 568148732 567996085 567398310 566374183 565457582 565273821 565562129 565630734 565254986
1409.3 565254986 564703465 564562500 565246642 566459417 567461312 568297505 569672227 571466684 573085427
1427.7 573085427 574052155 574439943 575002074 575807631 576058865 575820148 575720191 575996339 576576889 576744497
1448.1 576744497 575915396 574533522 573610365 573636293 574094713 574838698 576519430 579636276 584494770
1466.4 584494770 591429591 600895584 612384796 622888386 631259799 638385296 644363940 649123907
1482.8 649123907 653010070 656547487 659173489 659812868 659184337 658507407 657660484 656164885 654287100
1501.1 654287100 652633429 650904477 647425711 642895043 638568699 634331822 630765736 628438771
1517.4 628438771 627263308 625947714 623730659 621328294 619037926 617249608 615759909 613642693
1533.7F13642693j956702o07907k61307j368821j668930j080394l0935Q89242J215160
1552.1F08772099J286447J672506J984895O76572j82390J13070L84331O69539N97298
1570.5F15974367M24027M65632o6698m06384O2584J64509k76744p10786p90536p92623
1590.9F14047348j112937j840771k493441k688944k763212l196537l956139m650057
1607.2E91345310n129277n169690m866123n430639o954432o217956n086839n936802
1623.5E46553552o791055p057726o996394n726397m772782n718291n522847l315032
1639.8E00653028j410394l0518M93169K57432O45727J649320J759291J252115J770079
1658.2E07039249K804935L819823M320562M378676M826904N113959M929841N491733
$$ plain form
1533.7 613642693 611685991 611078084 610816777 609447956 607779026 606698632 606667697 607556939 608772099
1552.1 608772099 610058546 611731052 613715947 614392519 614210129 614323199 614707530 615377069 615974367
1570.5 615974367 616398394 616864026 616797328 616390944 616453528 616618037 616341293 615630507 614839971 614047348
1590.9 614047348 612934411 611093640 608600199 605911255 603148043 599951506 595995367 591345310
1607.2 591345310 586216033 581046343 576180220 570749581 563795149 557577193 552490354 546553552
1623.5 546553552 539762497 532704771 525708377 519981980 515209198 509490907 503968060 500653028
1639.8 500653028 499242634 499212116 499705285 499962717 500608444 502257764 504017055 505269170 507039249
1658.2 507039249 509844184 513664007 517984569 522363245 527190149 532304108 537233949 542725682
1674.5E42725682N776108N223453N282938O309688P304251O099403N246163N814850
1690.8E89782536O529272Q183300R068787Q130551P395148N815923N139351M769146
1707.1F44814014L650904L295541L825664M641235M698277L212273K051413J845062
1723.4F72034383J571655Q68321p4029r56059k294898l401637k943158k925217k694846
1741.8F59184515p67111K227664N427181Q158505R649098R866655J0420382J0312617
1758.1G14479506Q682728P062554N546034M930019M863143M167914K963662J968027
1774.4G54663587J972377K386510K196729J511634J229107J523197J974106J943648
1790.7G69400895J155316O27280J114070J622200J358390O66559M68910R64045J444817
$$ plain form
1674.5 542725682 548501790 553725243 559008181 565317869 572622120 578721523 583967686 589782536
1690.8 589782536 596311808 604495108 613563895 621694446 629089594 634905517 640044868 644814014
1707.1 644814014 648464918 651760459 655586123 660227358 664925635 668137908 670189321 672034383
1723.4 672034383 673606038 674474359 674400330 673444271 671149373 667747736 664804578 661879361 659184515
1741.8 659184515 658417404 660645068 666072249 674230754 683879852 693746507 704166889 714479506
1758.1 714479506 723162234 730224788 735770822 740700841 745563984 749731898 752695560 754663587
1774.4 754663587 756635964 759022474 761219203 762730837 763959944 765483141 767457247 769400895
1790.7 769400895 770556211 771183491 772297561 773919761 775278151 775944710 776413620 777377665 778822482
1809.1G78822482J246631O03258M20213Q07464J212955J200378Q50260N57840P49528
1827.4G86471009J063645P27773K43306J82152M58956R15527J185417P41661n4896
1845.8G91934550j9133N03838O69718L70681N7399J72973N92887P20322M69148L13759
1866.2G95786142L32117L22879L31998K36690p689P0750N06759P28488M79698J79708
1886.6G98967540J99914M05252N47767L48091q0705j02162L41892O15359M10854J5140
1907H01668942j08063J86443N05209M57108P9334j60635J33753M57108K48730j43587
1927.4H03324342k08020J18494M49597L65317m112j22130J86503M37617K58624j42872
1947.8H04663360k80082P3075M97043M63307N2691j80543M7505M36187M35471m470
$$ plain form
1809.1 778822482 780069113 780672371 781092584 781900048 783113003 784313381 785163641 785721481 786471009
1827.4 786471009 787534654 788262427 788505733 788687885 789146841 790062368 791247785 791989446 791934550
1845.8 791934550 791915417 792419255 793088973 793459654 793517053 793690026 794282913 795003235 795472383 795786142
1866.2 795786142 796118259 796441138 796773136 797009826 797002137 797072887 797579646 798308134 798787832 798967540
1886.6 798967540 799167454 799572706 800120473 800468564 800387859 800285697 800627589 801242948 801653802 801668942
1907 801668942 801560879 801747322 802252531 802709639 802788973 802628338 802762091 803219199 803467929 803324342
1927.4 803324342 803116322 803234816 803684413 804049730 804045618 803923488 804109991 804547608 804806232 804663360
1947.8 804663360 804383278 804456353 804953396 805416703 805469394 805288851 805336356 805772543 806208014 806203544
1968.2H06203544k77936l7730L52740L93629N9426k22027r5368K59161L62218P9930
1988.6H07077587k07007j68979J15335K62677J5974l14474k64764R1076K34068n2929
2009H06788564m07517l80635l1353J23919j74582n12302m15087p5638M3094j67728
2029.4H04790735m29928m19557j31965P4983p2956l61562l91841j16944J10328K2709
2049.8H03074002k11417k26498K5332K35915J44899j05858j53959N6684K43366J61886
2070.2H03244352p4148j56283J9729K31922K06232k9862j64986O259K78592K78711
2090.5H03840518Q166j38402J6391K56896K73526M4286j16706N186K47419K78234O5267
2113H04780781j06454n6624J07586J76251L8803j33813p6413J24753J82569L0339j25051
$$ plain form
1968.2 806203544 805925608 805887878 806240618 806634247 806693673 806471646 806376278 806635439 806997657 807077587
1988.6 807077587 806870580 806701601 806816936 807079613 807095587 806781113 806516349 806607425 806841493 806788564
2009 806788564 806381047 806000412 805969059 806092978 805918396 805406094 804991007 804915369 804958463 804790735
2029.4 804790735 804360807 803941250 803809285 803884268 803811312 803449750 803057909 802940965 803051293 803074002
2049.8 803074002 802862585 802636087 802661419 802897334 803042233 802936375 802782416 802839100 803082466 803244352
2070.2 803244352 803170204 803013921 803033650 803265572 803471804 803441942 803276956 803283215 803561807 803840518
2090.5 803840518 803848684 803710282 803726673 803983569 804257095 804301381 804184675 804189861 804437280 804715514 804780781
2113 804780781 804674327 804617703 804725289 804901540 804940343 804806530 804730117 804854870 805037439 805067778 804942727
2135.4H04942727q8811P7069J67549R3758o9261j00374P8797K22504J65761O676l5644
2157.9H05460751J16527K54810K18272J00732P4685K22921L95596L69370J87755R1195
2178.2H07492614J95384L33667L05652J52648P2181J71661L41952L56853J71423K3544
2198.6H09617579R4891K87771L45886J77860R298P0155K81870L67999K07722q940p987
2221.1H11444104J85787K93613J57893o1036p2360J10388K14279J13368o0737p9692
2241.5H12245607J01626K36452J26719p7247j00494P5996K17974J55092j9908p2479
2261.9H12889338P3134K20776J21772j16169j57774J0133J42634O4373j42693j84536
2282.3H12920988K7895K41637K32041N4061l8743J16825L37780L31640J43409Q8274
$$ plain form
2135.4 804942727 804853916 804930985 805098534 805192292 805123031 805022657 805101454 805323958 805489719 805496395 805460751
2157.9 805460751 805577278 805832088 806050360 806151092 806225777 806448698 806844294 807213664 807401419 807492614
2178.2 807492614 807687998 808021665 808327317 808479965 808552146 808723807 809065759 809422612 809594035 809617579
2198.6 809617579 809712470 810000241 810346127 810523987 810533285 810603440 810885310 811253309 811461031 811452091 811444104
2221.1 811444104 811629891 811923504 812081397 812020361 811948001 812058389 812272668 812386036 812325299 812245607
2241.5 812245607 812347233 812583685 812710404 812633157 812532663 812608659 812826633 812981725 812961817 812889338
2261.9 812889338 812962472 813183248 813305020 813188851 813031077 813041210 813183844 813248217 813105524 812920988
2282.3 812920988 812948883 813190520 813422561 813476622 813437879 813554704 813892484 814224124 814367533 814455807
2302.7H14455807L17872O30617O77526L94583J49965K72095O44505R16660Q44419N20408
2323.1H19824457M00365N96106O11245J34051k99990j31130K77102L75151m6312r01461
2343.5H20839584j802147j554548q5831J371682J984000J803994J336396M52995n83947
2361.8H23762178j255631j567960j760661j986206k177000k073109j736164j487911
2378.1H09717536j419544j381040j196027q08835l86059k06828k94030l83973l22461
2396.5H03318739j90198j57953l04222m71532m45903k80737k19405l34084m57883m48406
2416.9H00008416l44872l11792m34101n66959n41032m26530m07875n01931n66244n29349
2437.3G95377731m51028m30286n10871n99921n70119m68790m57704n33104n59449n11170
$$ plain form
2302.7 814455807 814773679 815404296 816081822 816476405 816626370 816898465 817542970 818459630 819304049 819824457
2323.1 819824457 820224822 820820928 821432173 821566224 821266234 821135104 821412206 821787357 821741045 820839584
2343.5 820839584 819037437 817482889 817397058 818768740 820752740 822556734 823893130 824346125 823762178
2361.8 823762178 822506547 820938587 819177926 817191720 815014720 812941611 811205447 809717536
2378.1 809717536 808297992 806916952 805720925 804912090 804526031 804319203 804025173 803641200 803318739
2396.5 803318739 803128541 802970588 802666366 802194834 801748931 801468194 801248789 800914705 800456822 800008416
2416.9 800008416 799663544 799351752 798917651 798350692 797809660 797383130 796975255 796473324 795907080 795377731
2437.3 795377731 794926703 794496417 793985546 793385625 792815506 792346716 791889012 791355908 790796459 790285289
2457.7G90285289m44233m12226m62711n51223n77212n21183m56571m77493n41449n11467
2478.1G85329521m15802l80278m22358m96448n31315m64976l86834m07517m38452l97146
2498.5G80988395l60429l52681l51786l96669m31419m06980l84569l83675m12047m41730
2518.9G77066410m21286m03404m32313m73201n05686n23805n31495n12719m62353m52400
2539.2G72347748m95851n29945n30839n29885n54383n69701n41508n06222n19634n52117
2559.6G67017663n52059n18679m86374n18859n89132n87761n38469n41925n63979n51582
2580G61568844n20527m82917m72367n14388n64456n70953n39302m90845m67360m95434
2600.4G56450295n46813n82277n91696n99146o37352o96898p14480p07925p40111p85350
$$ plain form
2457.7 790285289 789841056 789428830 788966119 788414896 787837684 787316501 786859930 786382437 785840988 785329521
2478.1 785329521 784913719 784533441 784111083 783614635 783083320 782618344 782231510 781823993 781385541 780988395
2498.5 780988395 780627966 780275285 779923499 779526830 779095411 778688431 778303862 777920187 777508140 777066410
2518.9 777066410 776645124 776241720 775809407 775336206 774830520 774306715 773775220 773262501 772800148 772347748
2539.2 772347748 771851897 771321952 770791113 770261228 769706845 769137144 768595636 768089414 767569780 767017663
2559.6 767017663 766465604 765946925 765460551 764941692 764352560 763764799 763226330 762684405 762120426 761568844
2580 761568844 761048317 760565400 760093033 759578645 759014189 758443236 757903934 757413089 756945729 756450295
2600.4 756450295 755903482 755321205 754729509 754130363 753493011 752796113 752081633 751373708 750633597 749848247
2620.8G49848247q15690q30352q27551q39055q96573r48191r39905r06348q98540r24647
2641.2G41021395r33290r02116q85725r05097r37104r84907j013398r51112q65995
2659.6G32642651q65996q84354q61824q40008q26836q39472q56936q01682p21634p12573
2680G24431336p57635p83920p61092p10308o64413o83367p53403p62999p30574p59423
2700.4G17064202q05557q25703q46326q27611q04365q52823r29355r35555q55982q00848
2720.8G08580077q27790q58783q25942p59363p00891o80864p14123p51317p26819o51002
2741.2G01083183o50823p10666o67989n99563o19054o38843o42597o78659p05183o76095
2761.6F94493711o26802o25551o54638o57737o52790o96481p89702q52048q54373q68857
$$ plain form
2620.8 749848247 749032557 748202205 747374654 746535599 745639026 744690835 743750930 742844582 741946042 741021395
2641.2 741021395 740088105 739185989 738300264 737395167 736458063 735473156 734459758 733508646 732642651
2659.6 732642651 731776655 730892301 730030477 729190469 728363633 727524161 726667225 725865543 725143909 724431336
2680 724431336 723673701 722889781 722128689 721418381 720753968 720070601 719317198 718554199 717823625 717064202
2700.4 717064202 716258645 715432942 714586616 713759005 712954640 712101817 711172462 710236907 709380925 708580077
2720.8 708580077 707752287 706893504 706067562 705308199 704607308 703926444 703212321 702461004 701734185 701083183
2741.2 701083183 700432360 699721694 699053705 698454142 697835088 697196245 696553648 695874989 695169806 694493711
2761.6 694493711 693866909 693241358 692586720 691928983 691276193 690579712 689790010 688937962 688083589 687214732
2782F87214732r25720r78767j000464j005233j031697j103520j186788j244903j279831
2800.3F77457809j324296j412570j504064j562416j614571j690447j807034j939833
2816.6F64602578k045691k137423k250373k415777k645194k846122k958953l134728
2832.9F44168317l523469m118621m944503o117881p647276r330391j0725677j1097372
2849.3E86663127r719133o541372k451956J195252L357112L814757K970874J407385
2865.6E80696046k73525j514435j908183j632631j364112j408219j649082j955628
2881.9E68990231k230287k472937k681792k773166k756714k754689k858162l072440
2898.2E47390044l337503l656983m112363m788280n716800o787658p927358r075761
$$ plain form
2782 687214732 686289012 685310245 684309781 683304548 682272851 681169331 679982543 678737640 677457809
2800.3 677457809 676133513 674720943 673216879 671654463 670039892 668349445 666542411 664602578
2816.6 664602578 662556887 660419464 658169091 655753314 653108120 650261998 647303045 644168317
2832.9 644168317 640644848 636526227 631581724 625463843 617816567 608486176 597760499 586663127
2849.3 586663127 576943994 570402622 567950666 569145918 572503030 576317787 579288661 580696046
2865.6 580696046 580422521 578908086 576999903 575367272 574003160 572594941 570945859 568990231
2881.9 568990231 566759944 564287007 561605215 558832049 556075335 553320646 550462484 547390044
2898.2 547390044 544052541 540395558 536283195 531494915 525778115 518990457 511063099 501987338
2914.5E01987338r866565r817362q713782o663531m035771j214415J484275L815115
2930.8D66975302N789428P389188Q425921Q842111Q749396Q181989P093489N639732
2947.2E27086556M153430K996862K355695K228499K642095L475666M440784N318582
2963.5E54698169N991400O393373O530523O404459N976677N375088M813909M320920
2979.8F00504518L829836L341437K860486K373278J909554J438320Q84771K66195m52697
2998.1F16955698j212299j789451k124786k151013j733422r32813k9504O45876R83238
3016.5F08611524J003087P10964K53320k00212o09160r10759j070380j165032j289368
3034.9F05333984j441121j537085j596153j675546j759648j826704j865506j882553
$$ plain form
2914.5 501987338 492120773 482303411 473589629 466926098 462890327 461675912 463160187 466975302
2930.8 466975302 472764730 480153918 488579839 497421950 506171346 514353335 521446824 527086556
2947.2 527086556 531239986 534236848 536592543 538821042 541463137 544938803 549379587 554698169
2963.5 554698169 560689569 567082942 573613465 580017924 585994601 591369689 596183598 600504518
2979.8 600504518 604334354 607675791 610536277 612909555 614819109 616257429 617142200 617408395 616955698
2998.1 616955698 615743399 613953948 611829162 609678149 607944727 607011914 606982410 607628286 608611524
3016.5 608611524 609614611 610325575 610578895 610378683 609769523 608858764 607788384 606623352 605333984
3034.9 605333984 603892863 602355778 600759625 599084079 597324431 595497727 593632221 591749668
3051.2E91749668j867533j818478j833915j913131j877069j753211j706422j732468
3067.5E77247441j782179j801789j724839j546979j440525j583457j752555j733125
3083.8E63881993j694262j714825j737059j781582j795709j748324j720309j742602
3100.1E49947321j800656j847982j818002j812160j933932j967609j820385j761735
3116.4E35184860j908600k115607k209485k137124k044380k062917k138317k183020
3132.8E18385410k142548k033174k018035k174318k287030k210498k113461k103388
3149.1E01302958k123952k185762k257258k245009k232015k246827k164602k070219
3165.4D83777314k108216k201378k241343k225906k158821k082079k058357k099842
$$ plain form
3051.2 591749668 589882135 588063657 586229742 584316611 582439542 580686331 578979909 577247441
3067.5 577247441 575465262 573663473 571938634 570391655 568951130 567367673 565615118 563881993
3083.8 563881993 562187731 560472906 558735847 556954265 555158556 553410232 551689923 549947321
3100.1 549947321 548146665 546298683 544480681 542668521 540734589 538766980 536946595 535184860
3116.4 535184860 533276260 531160653 528951168 526814044 524769664 522706747 520568430 518385410
3132.8 518385410 516242862 514209688 512191653 510017335 507730305 505519807 503406346 501302958
3149.1 501302958 499179006 496993244 494735986 492490977 490258962 488012135 485847533 483777314
3165.4 483777314 481669098 479467720 477226377 475000471 472841650 470759571 468701214 466601372
3181.7D66601372k149970k125114k055168k024174k034098k033293j996189j950234
3198D50233132j927048j918018j891911j844436j836717j860231j849533j805812j739919
3216.4D33559507j719832j767397j776993j726807j665800j639545j653731j677513
3232.7D19931889j718998j725704j697332j703739j693308j645386j616717j621753
3249D06508952j616299j581311j552075j546413j537472j502484j465946j442761j392543
3267.4C92871648j301527j306146j416713j429588j327276j225799j194358j235992
3283.7C82434249j259089j180172j021444r70632j081675j136750j103729j073540
3300C73607218j022219r72927r80616j061558j163245j199781j168371j139283j153350
$$ plain form
3181.7 466601372 464451402 462326288 460271120 458246946 456212848 454179555 452183366 450233132
3198 450233132 448306084 446388066 444496155 442651719 440815002 438954771 437105238 435299426 433559507
3216.4 433559507 431839675 430072278 428295285 426568478 424902678 423263133 421609402 419931889
3232.7 419931889 418212891 416487187 414789855 413086116 411392808 409747422 408130705 406508952
3249 406508952 404892653 403311342 401759267 400212854 398675382 397172898 395706952 394264191 392871648
3267.4 392871648 391570121 390263975 388847262 387417674 386090398 384864599 383670241 382434249
3283.7 382434249 381175160 379994988 378973544 378002912 376921237 375784487 374680758 373607218
3300 373607218 372584999 371612072 370631456 369569898 368406653 367206872 366038501 364899218 363745868
3318.4C63745868j163691j139850j140117j223445j282662j213312j165182j219958
3334.7C54197651j269370j292557j330256j340538j327008j317740j274645j282990
3351C43762547j408220j499652j421631j304805j328945j367092j289368j236588j285165
3369.3C31621081j373172j400650j286775j142889j093685j093090j030922r16183
3385.7C22283715p46787n52356n85019q05378q28922n72950l87162n60075p73758o00844
3406.1C15870464l28511k68579k86281l03507k78294j46538n0872o8039O974K22802
3426.5C14369619M12941M48614M80265O08265N60045L59536L64333O05643Q47012R13202
3446.8C19969475Q62509R14693J050443J175433J273632J303226J244545J258343J496405
$$ plain form
3318.4 363745868 362582177 361442327 360302210 359078765 357796103 356582791 355417609 354197651
3334.7 354197651 352928281 351635724 350305468 348964930 347637922 346320182 345045537 343762547
3351 343762547 342354327 340854675 339433044 338128239 336799294 335432202 334142834 332906246 331621081
3369.3 331621081 330247909 328847259 327560484 326417595 325323910 324230820 323199898 322283715
3385.7 322283715 321536928 320984572 320399553 319594175 318765253 318192303 317805141 317245066 316471308 315870464
3406.1 315870464 315541953 315273374 314987093 314683586 314405292 314258754 314207882 314139843 314146817 314369619
3426.5 314369619 314782560 315231174 315711439 316319704 316879749 317239285 317603618 318209261 319056273 319969475
3446.8 319969475 320831984 321746677 322797120 323972553 325246185 326549411 327793956 329052299 330548704
3465.2C30548704J689016J519532J252382J292766J482218J662374J747489J610785
3481.5C42805266J535356J699984J797051J737803J780093J902878J944363J916170
3497.8C57118964J985431K072394J953810J843691J952171K117962K254307K272934
3514.2C73571664K172321K194911K369583K538771K482622K323121K329648K422362
3530.5C92405003K555490K761960K833485K733559K843648L113479L155201K922595
3546.8D15324420K846449L042996L174126L218741L348589L507167L604680L694803
3563.1D41761971L816336L956795L937661L862560L938019M103482M290939M481345
3579.4D74149108M610747M674882M716843M637152M519939M537881M651070M734337
$$ plain form
3465.2 330548704 332237720 333757252 335009634 336302400 337784618 339446992 341194481 342805266
3481.5 342805266 344340622 346040606 347837657 349575460 351355553 353258431 355202794 357118964
3497.8 357118964 359104395 361176789 363130599 364974290 366926461 369044423 371298730 373571664
3514.2 373571664 375743985 377938896 380308479 382847250 385329872 387652993 389982641 392405003
3530.5 392405003 394960493 397722453 400555938 403289497 406133145 409246624 412401825 415324420
3546.8 415324420 418170869 421213865 424387991 427606732 430955321 434462488 438067168 441761971
3563.1 441761971 445578307 449535102 453472763 457335323 461273342 465376824 469667763 474149108
3579.4 474149108 478759855 483434737 488151580 492788732 497308671 501846552 506497622 511231959
3595.7E11231959M836500M913091M815877M708171M745364M837811M774809M696011
3612.1E49559593M704237M690647M780293M768550M419267M236997M418313M636169
3628.4E86214066M349649L848373L762842L807187L810286L825128L838182L965199
3644.7F17420912M201352M108787L368378K825617K938152L146171L033996K836823
3661F43880188K752126K824485K978683K968132K701342K533972K313197J818955J684964
3679.4F66456044J848280K072871K398670K651453K232670J404941J215637J451016
3695.7F81731582J602113J633644J540780J317024J267314J417518J419723R56833
3712F92886531O05822Q50737J179874J267254J195968J062691Q36134Q12769J137018
$$ plain form
3595.7 511231959 516068459 520981550 525797427 530505598 535250962 540088773 544863582 549559593
3612.1 549559593 554263830 558954477 563734770 568503320 572922587 577159584 581577897 586214066
3628.4 586214066 590563715 594412088 598174930 601982117 605792403 609617531 613455713 617420912
3644.7 617420912 621622264 625731051 629099429 631925046 634863198 638009369 641043365 643880188
3661 643880188 646632314 649456799 652435482 655403614 658104956 660638928 662952125 664771080 666456044
3679.4 666456044 668304324 670377195 672775865 675427318 677659988 679064929 680280566 681731582
3695.7 681731582 683333695 684967339 686508119 687825143 689092457 690509975 691929698 692886531
3712 692886531 693492353 694343090 695522964 696790218 697986186 699048877 699885011 700697780 701834798
3730.3G01834798J417994J178861N06520J98841N39780R60290Q96097O79552P54655
3748.7G08967388N01334P0870K67864O37173O08981L86536M98891P47561P40826N03898
3769.1G13931322K49922K63274N22614P57992O36756L26217L33011M54485M27604M04179
3789.5G18307376M57287N69820O49691O75499P07865M62234K33650L25203J84953L7492
3809.9G22611070L16739O65128O50644N71549M98116K7418j02639J90079L52621M12465
3830.3G26193190M50849N84603O17861L00229K2292q34P092P1049L99530Q92043P59304
3852.7G30297208k22266l91245P1943L79264L99769J83940K10583L44753J41323o7771
3873.1G31347501q1837J63436M17769K95162K41518J65045n5789J20759J91032j17778
$$ plain form
3730.3 701834798 703252792 704431653 704938173 705137014 705676794 706637084 707533181 708212733 708967388
3748.7 708967388 709468722 709539592 709807456 710444629 711053610 711440146 711939037 712686598 713427424 713931322
3769.1 713931322 714181244 714444518 714967132 715725124 716361880 716688097 717021108 717475593 717903197 718307376
3789.5 718307376 718764663 719334483 719984174 720659673 721367538 721829772 722063422 722388625 722573578 722611070
3809.9 722611070 722927809 723592937 724243581 724815130 725313246 725340664 725238025 725428104 725780725 726193190
3830.3 726193190 726644039 727228642 727846503 728146732 728169024 728168190 728175282 728246331 728645861 729537904 730297208
3852.7 730297208 730074942 729683697 729755640 730134904 730534673 730718613 730929196 731273949 731415272 731347501
3873.1 731347501 731265664 731429100 731846869 732142031 732383549 732548594 732492805 732613564 732804596 732686818
3893.5G32686818m9532L80516N58853L52264n96l15905l48449j04844J32680K26378
3913.9G33518183K39313J75357Q5413Q3149M8458n6743M0888K54035J80543p8201j42038
3936.3G34348357J6272J90675J41084J3054N6147P7367N0724J01745J08301K4915q702
3958.8G35119939P3135J22547L8683n1677k5093R1433J57237P9215j4842M351J26958
3981.2G35721886J91093M0948m5419J11342K08378J31309J2219o3539
3997.5G36308217
$$ plain form
3893.5 732686818 732637286 733017802 733576655 733928919 733928323 733612418 733263969 733159125 733291805 733518183
3913.9 733518183 733757496 733932853 734018266 734101415 734149873 734093130 734134018 734388053 734568596 734490395 734348357
3936.3 734348357 734364629 734555304 734696388 734709442 734765589 734842956 734893680 734995425 735103726 735128641 735119939
3958.8 735119939 735193074 735315621 735354304 735302627 735277534 735368967 735526204 735605419 735590577 735594928 735721886
3981.2 735721886 735912979 735953927 735908508 736019850 736228228 736359537 736371756 736308217
3997.5 736308217
##END=$$ End of the data block
