##TITLE=4 $$ Begin of the data block
##JCAMP-DX=5.00 $$ ACD/SpecManager v 10.08
##SPECTROMETER/DATA SYSTEM=Alpha
##DATE=16 Apr 2014 10:35:00
##DATA TYPE=INFRARED SPECTRUM
##DATA CLASS=XYDATA
##ORIGIN=
##OWNER=
##NPOINTS=1765
##FIRSTX=399.75695801
##LASTX=3997.56933594
##MAXX=3997.56933594
##MINX=399.75695801
##MAXY=0.85269958
##MINY=0.45233837
##XFACTOR=1.0000000000
##YFACTOR=1.000000000000000e-9
##FIRSTY=0.70988399
##DELTAX=2.03957629
##XUNITS=1/CM
##YUNITS=ARBITRARY UNITS
##XYDATA=(X++(Y..Y))
399.8 709883988 706624687 706034541 705598891 703593671 703067482 704237759 703869164 703500152 705438554
418.1 705438554 705683291 703389406 702749968 702878773 701311946 699947417 700007617 698754549 696063399
436.5 696063399 694883406 694250584 691469908 688256681 686539710 684187591 681159794 680079579 680035651
454.8 680035651 678765416 677484751 677118242 675971508 674685061 675326407 676491678 676323235 676205575
473.2 676205575 676678836 675956070 674626708 674631536 674505770 672848582 671966434 672412515 671859860 670728087
493.6 670728087 670843840 670818806 669498503 668495417 667892694 665929019 663443089 662185311 660787463
511.9 660787463 658342063 656935394 656597197 655146241 653630495 653923869 654367387 653716803 653821230
530.3 653821230 654682457 654219866 653105080 653129637 653032780 651721120 650939047 650982797 649988949 648666918
550.7 648666918 648819804 649011195 647995651 647556901 648022830 647501945 646612704 647029817 647340536 646508753
571.1 646508753 646463871 647350788 647163808 646654367 647444546 648118854 647631884 647777617 648946404 649174929
591.5 649174929 648779571 649481714 650211096 649852276 649980366 651001692 651177466 650827050 651607454 652498782
611.9 652498782 652238011 652340591 653572202 654313207 654667914 656243205 658027411 658610046 659564734
630.2 659564734 661692679 663104117 663721800 665320754 667194307 668033600 669129372 671068609 672179043
648.6 672179043 672565579 673923910 675527334 675987363 676648736 678403974 679558933 679413259 679378152
666.9 679378152 681030869 682933509 684597254 686773181 688500881 689518929 691353202 693709373
683.3 693709373 695069909 696165740 697866559 698585212 697548866 696390808 695572078 694430828 694426119
701.6 694426119 697123647 701117635 705031455 709675193 714714289 718330204 720923305 723974288
717.9 723974288 726761401 728584468 730739415 733514488 735565484 737191856 739571452 741700292
734.2 741700292 742622316 743580520 745051920 745709419 745829403 747016191 748717606 749793708 751315355
752.6 751315355 753856003 755962074 757474542 759721458 762258232 763859928 765359581 767518818
768.9 767518818 769183755 770153940 771765292 773775399 774968982 776066899 778052330 779883146 780985832
787.3 780985832 782583773 784669161 785987616 787014008 788657308 789885044 790147901 790776312 791994631
805.6 791994631 792693913 793355405 795100510 797053695 798278570 799608111 801196694 801910162 801964045
824 801964045 802456915 803029716 803210914 804114759 806242406 808406234 810367525 812902391 815306127
842.3 815306127 816408575 816855431 817511320 817868769 817950308 818667948 819666803 819943964 819977880 820440114
862.7 820440114 820594549 820087194 819764495 819596589 818813086 817973733 817919970 818095684 818046868 818465948
883.1 818465948 819383144 819883943 820136011 820898175 821670949 821888506 822240114 822989166 823358476 823363483
903.5 823363483 823652864 823809206 823191583 822262406 821319401 819821298 817990184 816909432 816766560
921.9 816766560 817028403 817738652 818853915 819564760 819691420 820045829 820688605 820935845 820958614 821163297
942.3 821163297 821004570 820233405 819560051 819140971 818453968 817718148 817435384 817140341 816388130 815663695
962.7 815663695 815088868 814048529 812630415 811462700 810358167 808916032 807510734 806393862 805118501
981 805118501 803712726 802822351 802331209 801681399 801169515 801160336 801093340 800589561 799952507 799117029
1001.4 799117029 797756135 796121180 794454813 792330444 789560974 786704063 783913195 780698776
1017.7 780698776 777207732 774094999 771395802 768824935 766609430 764970064 763478518 761780500
1034.1 761780500 759922087 757700443 754907429 752007604 749464095 747070312 744828403 743288040
1050.4 743288040 742498636 742012918 741834760 742092192 742300928 742034674 741557479 740979016 739907146
1068.7 739907146 738369226 736802459 735170841 733387530 731978893 731251240 730833054 730473101 730252028
1087.1 730252028 729936838 729147732 728080571 727055132 725864053 724483609 723489404 723166168 723239899
1105.4 723239899 723514438 723830342 723668277 722731411 721457720 720138490 718506336 716735005 715567052
1123.8 715567052 715272427 715751767 717236757 719559014 721760511 723361433 724580288 725183070 724631190
1142.2 724631190 723071992 720921338 718086302 714666128 711392462 708606303 706025898 703746676
1158.5 703746676 702094972 700737774 699250221 697886407 696994603 696793497 697930276 700773716 704240203
1176.8 704240203 706842244 708356023 709153533 709164798 708657503 708381236 708293140 707751215 706773043 705584884
1197.2 705584884 703797638 701403677 699244797 697623670 696070731 694583297 693327725 691719413
1213.5 691719413 689358592 686821163 684441328 681790769 678937614 676437140 674136400 671698093
1229.9 671698093 669594228 668157697 666931987 665867746 665508747 665725291 665971935 666465819 667497575
1248.2 667497575 668502986 669127464 669785798 670464218 670701861 670748055 671100795 671448886 671542704 671972871
1268.6 671972871 672876596 673614025 674205720 675119936 676020205 676508248 677078545 678017497 678781092 679224014
1289 679224014 679771066 680180013 679956675 679470420 679176807 678781748 678269982 678224862 678582728 678885400
1309.4 678885400 679485500 680840790 682505548 684095085 685861111 687699318 689088464 690140605
1325.7 690140605 691288710 692189395 692484617 692773342 693514168 694202244 694515765 694980025 695789576
1344.1 695789576 696614683 697636724 699000061 700065136 700559676 700888634 701037347 700325429 698010564
1362.4 698010564 694203615 690473437 688787878 690053761 692653418 693506598 691730440 688764572
1378.7 688764572 685009658 680731118 677859604 677796423 679486811 681564391 683676600 684692442 683525324
1397.1 683525324 680758417 677543283 674377501 670901895 667563140 664920449 662550092 660651922
1413.4 660651922 660070240 660315096 659622610 658125579 656699419 654594123 651656032 648052394 643706560
1431.8 643706560 639336348 634895802 630130112 626184881 623284459 621277928 620069563 619107962
1448.1 619107962 618728340 620013535 623549700 629979014 637371898 642337799 646164179 649807990
1464.4 649807990 652944446 656556249 662635803 671556711 679282010 682607949 682391703 679662883
1480.7 679662883 674598992 667624414 659306228 649010181 636465549 624862552 615276396 605960250
1497 605960250 596905589 589502037 584401011 579862297 572150111 563578725 557034314 551884413 548636079
1515.4 548636079 547584116 547848344 547586203 546051860 544160962 541937649 540026426 539267838 538931549
1533.7 538931549 538717806 539978683 542717338 544573367 545901954 548530817 552926779 558885038
1550.1 558885038 566152036 575116217 585659623 598888099 611984730 620591104 629086673 638849139
1566.4 638849139 649235070 658962846 665902019 671881795 677242041 679028511 678187728 676120698
1582.7 676120698 672504008 666814387 659439802 650951922 641503513 631262004 620937169 610680103
1599 610680103 599898696 588780761 578111768 567750275 557159781 547164977 538842857 530980647
1615.3 530980647 521904588 514139771 507898271 500807881 493424088 486678302 480246216 475032449
1631.6 475032449 471156090 466658443 461580604 457782894 455463916 454288423 453465700 452475369 452338368
1650 452338368 453151703 453149438 452701181 453330725 455061376 457396984 459752887 462123603 464968413
1668.4 464968413 467847079 470250815 472604036 474926949 477409989 480493516 484242857 487894267
1684.7 487894267 490554690 493260652 496880054 501472473 507649660 514795959 522348464 530945778
1701 530945778 538594842 546318233 554972887 563220084 571253836 579615414 588392258 596810937 603093684
1719.3 603093684 607983530 613139391 618407845 623570681 629027843 634611666 640005827 644183457
1735.7 644183457 647711694 651821196 656136036 660603285 665672600 671181142 676852107 682154119
1752 682154119 686940372 691887200 696976483 701807916 706184089 709845603 713594556 717790484 721851110
1770.3 721851110 725319028 727749467 729728043 732118309 734930217 737671733 740120649 742509842
1786.7 742509842 745339990 748582542 751253366 753109515 755103946 757377505 759450197 761214077
1803 761214077 762887180 764685154 766732514 768729925 770266056 771681070 773360610 775102377 776801586
1821.3 776801586 778721273 780747533 782539129 784024060 785048127 785948575 787051916 788283050
1837.6 788283050 789788365 791679382 793433070 794389665 794964552 795629144 796466529 797559142 798705280
1856 798705280 799681544 800637603 801686466 802819610 804210246 805553913 806085646 806133211 806524634
1874.4 806524634 807235777 807874739 808441818 809179425 810033560 810874939 811719060 812369585 812846899 813372910
1894.7 813372910 813956857 814583957 815219343 815854013 816576302 817330837 817945063 818427145 818955600 819683433
1915.1 819683433 820478916 821056426 821478188 821814179 822030902 822342038 822781682 823200107 823588192 823950112
1935.5 823950112 824319780 824848533 825482845 825807035 825800180 825820148 826009631 826317132 826626122 826908052
1955.9 826908052 827194750 827497542 827812970 828199863 828620076 828891933 829061210 829326153 829638481 829871297
1976.3 829871297 830092371 830367029 830631375 830871522 831205845 831631541 831997275 832182765 832266569 832402885
1996.7 832402885 832592845 832826972 833055437 833208740 833355248 833583117 833805203 833964527 834210575 834520876
2017.1 834520876 834647834 834631026 834728837 834907234 835003376 835104227 835338712 835565925 835683286 835841715
2037.5 835841715 836081803 836258650 836382151 836558759 836701155 836770415 836914301 837130547 837248027 837339401
2057.9 837339401 837574244 837809026 837899685 837982178 838146448 838270545 838366747 838569880 838774741 838852584
2078.3 838852584 838966012 839199781 839394510 839555204 839808702 840037644 840111911 840211630 840447664 840650916
2098.7 840650916 840776801 840977132 841226399 841362894 841462970 841691792 841930628 842062414 842240214 842494309
2119.1 842494309 842661142 842765808 842970014 843214810 843367815 843542516 843807817 844004631 844119132 844308376
2139.5 844308376 844526172 844667017 844837964 845079780 845234394 845310271 845484018 845708191 845859408 846016228
2159.9 846016228 846231222 846385062 846450150 846558928 846739292 846902668 847056389 847237945 847366929 847420156
2180.3 847420156 847513795 847679853 847815752 847906709 848048866 848226428 848355889 848458827 848590732 848721802
2200.7 848721802 848842382 849013567 849197149 849297166 849349916 849463582 849632919 849783242 849920332 850066543
2221.1 850066543 850180805 850274503 850405455 850543976 850634098 850717366 850852728 850983500 851056278 851127386
2241.5 851127386 851238549 851352394 851455927 851587713 851711988 851752520 851771057 851852298 851933122 851991653
2261.9 851991653 852094829 852219760 852296472 852352023 852428794 852486730 852515042 852563858 852647245 852699578 852671564
2284.3 852671564 852583408 852450252 852273285 852107763 851998270 851865113 851657689 851448417 851213515 850837231
2304.7 850837231 850374103 849917769 849426210 848938525 848548234 848081172 847322702 846487761 845885575 845425427
2325.1 845425427 844896317 844362319 844003856 843780935 843543112 843290508 843021035 842788398 843042195 844203055
2345.5 844203055 845489025 845708251 844646752 842856705 841058254 839769781 839245677 839336812 839893937
2363.8 839893937 840919018 842230499 843600690 845035970 846488357 847790122 848987460 850182533
2380.2 850182533 851200402 851844192 852192044 852388978 852405190 852301419 852286041 852285743 852115571 851921976
2400.6 851921976 851845086 851718187 851514280 851424277 851372123 851172984 850960732 850865781 850738704 850505173
2421 850505173 850317299 850224257 850070298 849866211 849756420 849645615 849435747 849290788 849241912 849084854
2441.3 849084854 848845601 848716617 848633707 848438203 848226786 848103464 847924888 847652912 847458303 847307801
2461.7 847307801 847046375 846783936 846636534 846454322 846172631 845933318 845721483 845423043 845162809 845051408
2482.1 845051408 844893157 844604015 844390631 844266593 844076216 843900383 843853533 843792319 843603611 843428314
2502.5 843428314 843336701 843197763 843029797 842989743 842979908 842829943 842668653 842600167 842477381 842306793
2522.9 842306793 842250645 842231154 842070699 841849446 841707170 841544747 841318250 841174662 841075718 840845287
2543.3 840845287 840560496 840355277 840113282 839799702 839562893 839375257 839082599 838733256 838458657 838195145
2563.7 838195145 837871373 837579191 837333441 837011576 836646736 836379170 836133838 835772455 835409224 835158169
2584.1 835158169 834879100 834505558 834174812 833897710 833551526 833178103 832877576 832577348 832216859 831870556
2604.5 831870556 831557930 831235111 830963492 830812097 830661297 830407977 830165386 830001414 829816282 829589128
2624.9 829589128 829417944 829295278 829131365 828952014 828822434 828693151 828536987 828438818 828381777 828248918
2645.3 828248918 828067839 827936113 827793658 827573538 827366114 827205479 826994598 826722503 826474428 826229751
2665.7 826229751 825926244 825626135 825381041 825096428 824725509 824374020 824072003 823727608 823347747 823016703
2686.1 823016703 822695315 822307527 821894407 821501970 821111917 820717216 820330024 819905221 819385171 818821073
2706.5 818821073 818271279 817681670 817011237 816316247 815612793 814868569 814162314 813569486 813024044 812454224
2726.9 812454224 811896563 811397851 810907841 810391366 809883893 809376478 808852494 808389604 808019161 807624161
2747.3 807624161 807109535 806496382 805832148 805144489 804469764 803799689 803076684 802312732 801588595 800923824
2767.7 800923824 800259888 799603045 798993111 798340380 797554076 796714544 795915902 795107782 794271111 793492913
2788.1 793492913 792719781 791842282 790937841 790104151 789280057 788407981 787542760 786674976 785743237 784812093
2808.5 784812093 783934951 783061087 782195568 781406224 780649483 779803097 778864384 777916372 776952267 775911212
2828.9 775911212 774768770 773455679 771851182 769866347 767335117 763974071 759649277 754494965
2845.2 754494965 748791635 742979527 737682462 733436942 730368972 728136718 726007164 723114073
2861.5 723114073 718973517 713838398 708610892 704370379 701885521 701361716 702479303 704688549
2877.8 704688549 707394719 710041702 712207675 713612020 714137912 713814139 712721825 710942388 708572984
2896.2 708572984 705788910 702833593 699856758 696778595 693385303 689528525 685206771 680468261
2912.5 680468261 675366521 670113146 665010571 660248995 655981064 652408361 649741828 648070335
2928.8 648070335 647352099 647593021 648790538 650774539 653224647 655702353 657572985 658115268 656950116
2947.2 656950116 654249370 650496840 646295309 642444015 639790595 638827085 639562547 641723037 644974172
2965.5 644974172 648990750 653526783 658450246 663627326 668906331 674270451 679767609 685256898
2981.8 685256898 690584183 695775032 700764418 705389023 709549427 713100672 715920925 718017995
2998.1 718017995 719490111 720450163 720970571 721203208 721338511 721421182 721361756 721095383 720641792 719974935
3018.5 719974935 719041467 717867970 716520786 715125620 713898182 712930024 712097824 711286962 710491598
3036.9 710491598 709705532 708882391 708010018 707099915 706160426 705228686 704328656 703434587 702525139 701647520
3057.3 701647520 700890720 700339139 700044930 700004399 700144887 700386643 700721502 701134682 701579869 702046275
3077.7 702046275 702477217 702795208 703044295 703322709 703665853 704033196 704367161 704664648 704924107 705062807
3098.1 705062807 705002248 704748631 704335928 703811765 703224540 702560663 701814115 701004624 700074136 698945761
3118.5 698945761 697598696 696087778 694500327 692846835 691120684 689329326 687440813 685486555
3134.8 685486555 683546960 681563795 679402232 677092195 674755931 672419906 670085549 667766809
3151.1 667766809 665346742 662697732 659923494 657179117 654496372 651841581 649188697 646535993
3167.4 646535993 643852711 641130328 638408482 635719001 633065999 630477130 627976477 625535727
3183.7 625535727 623138845 620806336 618560076 616402626 614381492 612520933 610716224 608931601
3200.1 608931601 607271254 605762899 604349732 603016734 601762056 600528419 599255383 597967982
3216.4 597967982 596706986 595457077 594185233 592847049 591449440 590039909 588595271 587030709
3232.7 587030709 585276425 583366394 581396699 579391062 577318013 575161517 572909236 570591271
3249 570591271 568296611 566037595 563746631 561418891 559095740 556790411 554524779 552319586 550185382
3267.4 550185382 548143685 546146154 544128895 542113006 540148973 538260460 536439002 534663379
3283.7 534663379 532958567 531378925 529903948 528448522 526976407 525534093 524162352 522856057
3300 522856057 521605134 520430088 519296825 518107235 516859353 515626431 514422357 513221025 512043297
3318.4 512043297 510915399 509806395 508670270 507507563 506342411 505177379 504015863 502869844
3334.7 502869844 501730919 500567794 499356270 498122692 496900707 495678991 494476050 493306190
3351 493306190 492110610 490841419 489542216 488284707 487059653 485845983 484662682 483472556 482216448
3369.3 482216448 480938017 479733050 478634119 477643073 476722389 475824714 474984467 474216133 473523647
3387.7 473523647 472916454 472288728 471537292 470769972 470166087 469691306 469133556 468443602 467795700 467261404
3408.1 467261404 466823041 466474593 466158688 465890139 465749532 465695679 465667039 465734363 465973198 466380656
3428.5 466380656 466881812 467483252 468213052 468936175 469587356 470347792 471335351 472498804 473741651
3446.8 473741651 474882275 475964457 477198005 478600383 480137408 481767297 483319253 484820068
3463.2 484820068 486530185 488407612 490159154 491716057 493304074 495090991 497089237 499185771
3479.5 499185771 501216769 503237188 505390823 507573247 509709239 511960924 514400125 516941071
3495.8 516941071 519433737 521911085 524482012 526946366 529205084 531553507 534101486 536706924
3512.1 536706924 539259911 541733205 544261098 546964645 549833477 552621782 555164695 557622135
3528.4 557622135 560127318 562734962 565505207 568309128 571005464 573859155 577067971 580332398
3544.7 580332398 583208025 585822225 588651597 591667235 594626844 597642958 600861073 604234517
3561.1 604234517 607771993 611557841 615325212 618509412 621394157 624633670 628296733 632131517
3577.4 632131517 636027336 640009224 644222856 648766398 653133631 656794071 660320818 664302588
3593.7 664302588 668468952 672550082 676600993 680565298 684545636 688846707 693424582 697760105
3610 697760105 701764226 705632806 709400773 713256419 716811478 719714820 722778738 726712644 731212735
3628.4 731212735 734650373 736907065 739320338 742020726 744797826 747695386 750723183 754137814
3644.7 754137814 758189857 762069821 764074981 764768898 766018987 768020153 769738913 771130681
3661 771130681 772693753 774649799 777078986 779733062 781910837 783662379 785253048 785908341 786033571
3679.4 786033571 786630392 787989199 790197909 793096423 795409083 796046376 796096385 796538591 797398746
3697.7 797398746 798536956 799571931 800131738 800823808 802285671 804012239 804779172 804439902 804118276
3716.1 804118276 804351926 804972470 805646658 806062102 806146085 806344092 807282984 808968365 810366631
3734.4 810366631 810460031 809812009 809682608 810572028 811748326 812181473 812512994 812811136 812142372 811271250
3754.8 811271250 811097682 811209083 810984969 810810983 811160982 811631799 811757267 811451912 811042607 811071575
3775.2 811071575 811667442 812248886 812179446 811862230 811717987 811589420 811550558 811806679 812405825 813200295
3795.6 813200295 813880861 814477742 814835608 814576566 814217865 813814402 813211083 813109159 813846350 814844608
3816 814844608 815445125 815727413 815395772 814541817 814010441 813907683 814125836 814651430 815368235 816147149
3836.4 816147149 816457033 815952778 815101743 814276040 813803732 814191818 815545738 816915929 816541255
3854.8 816541255 815121055 814285398 814331174 814773262 814953864 814992011 815223157 815186262 814641297 814018905
3875.2 814018905 813761652 814122438 814548135 814581513 814432979 814071298 813831031 813796222 813476264 813256502
3895.5 813256502 813724995 814459264 814736485 814373314 813469291 812507689 811969042 811857402 812037766 812380910
3915.9 812380910 812577963 812457681 812260211 812197447 812149346 812133014 812278271 812336743 812094569 811760485
3936.3 811760485 811631799 811811984 812101543 812197268 812184453 812213421 812114894 811938107 811910868 811970234 811992764
3958.8 811992764 812040865 812090158 812071204 812091470 812190652 812267840 812293947 812302828 812289894 812278092 812299192 812325776
3983.2 812325776 812337935 812378526 812467158 812532246 812550902 812554061 812540889
3997.5 812540889
##END=$$ End of the data block
