##TITLE=3-nitro - Diogo $$ Begin of the data block
##JCAMP-DX=5.00 $$ ACD/SpecManager v 10.08
##SPECTROMETER/DATA SYSTEM=Alpha
##DATE=12 Nov 2014 09:25:08
##DATA TYPE=INFRARED SPECTRUM
##DATA CLASS=XYDATA
##ORIGIN=
##OWNER=
##NPOINTS=1765
##FIRSTX=399.76428223
##LASTX=3997.64306641
##MAXX=3997.64306641
##MINX=399.76428223
##MAXY=0.78950393
##MINY=0.03733224
##XFACTOR=1.0000000000
##YFACTOR=1.000000000000000e-9
##FIRSTY=0.74446756
##DELTAX=2.03961372
##XUNITS=1/CM
##YUNITS=ARBITRARY UNITS
##XYDATA=(X++(Y..Y))
399.8G44467556m797339r182692j1278927r786248r663165j4846325k0315468j9736826
$$ 744467556 739670217 730487525 719208598 709422350 699759185 684912860 664597392 644860566
416.1F44860566k0285607k8436184l1424462k0011366J0150790M2728424N5575371
$$ 644860566 624574959 596138775 564714313 544702947 554853737 597582161 653157532
430.4F53157532M6498060L0008734J9650757J4326751R245575M058957J719594L414392
$$ 653157532 699655592 729664326 749315083 763641834 772887409 776946366 778665960 782080352
446.7G82080352M560829K050161j517177j710713J322985K717495k01225k906859j682103
$$ 782080352 786641181 788691342 787174165 785463452 786786437 789503932 789302707 786395848 784713745
465G84713745J515031K110124j012803l217041r12547K144813J487434j910865l232360
$$ 784713745 786228776 788338900 787326097 784109056 783196509 785341322 786828756 784917891 781685531
483.4G81685531m16517K227604N14627l040016l302038o4015J690149m60744l375709
$$ 781685531 781269014 783496618 784011245 780971229 777669191 777605176 779295325 778834581 775458872
501.7G75458872k893805J82688J324475j035452l446460k397716M16219P25151k151073
$$ 775458872 772565067 772747755 774072230 773036778 769590318 767192602 767608821 768333972 766182899
520.1G66182899m024863k410173J05023m14789l488302n017042l488243k157151m354000
$$ 766182899 762158036 759747863 759852886 759438097 755949795 750932753 747444510 745287359 740933359
538.5G40933359q436323j0756790j1268258j3382077j9319475k7654350l4824610l4822941
$$ 740933359 732497036 721740246 710471988 697089911 677770436 650116086 615291476 580468535
554.8E80468535j9416987J0101139L6120594M3624520L5286963K1629214R028554O75857
$$ 580468535 561051548 571152687 607273281 650897801 686184764 707813978 716842532 717518389
571.1G17518389j961410j222491q74937k069175k360463K02239M100382O424784O810487
$$ 717518389 715556979 714334488 713459551 711390376 709029913 709232152 713332534 719757318 726567805
589.4G26567805P218599Q257389Q216143N398989J252055o99282M85301J669705L95536
$$ 726567805 733786404 742043793 750259936 755658925 756910980 756211698 756696999 758366704 758762240
607.8G58762240j967847k307057m41611N95271r21905k900004k527237q05616o96361
$$ 758762240 756794393 754487336 754045725 754640996 753719091 750819087 748291850 747486234 746789873
626.2G46789873l350377o545842q398116j1018812j8187225k3513615j1194110J3264715
$$ 746789873 743439496 736893654 728495538 717476726 699289501 675775886 664581776 677846491
642.5F77846491K3395956J4292180K118588m347503n383253n074263p115781j1419237
$$ 677846491 701242447 715534627 717653215 713305712 707922459 702848196 695732415 684313178
658.8F84313178j5296340j7545760j9709110l6921322p4826777q0204725n8635146
$$ 684313178 669016838 651471078 631761968 594840646 520013869 439809144 381173998
673.1C81173998p75248P9902977J10455483Q2614541M2619288J6098798K34842j1310577
$$ 381173998 380398750 460301727 570757210 653371751 695991039 712089837 712324679 701014102
689.4G01014102j8268943j4627636K676666K0240128K2251129J3630927O513834K354622
$$ 701014102 682745159 668117523 670794189 691034317 713285446 726916373 733430207 735784829
705.7G35784829j466871m650116o001711n890011o011606p340788r721280j2289404
$$ 735784829 734317958 729667842 723666131 717776120 711764514 704423726 694702446 682413042
722F82413042j5570581k1752179l2165647m6220302o3165069q0046594q4077448o0642033
$$ 682413042 666842461 645090282 612924635 566704333 503539264 423492670 339415222 278773189
738.3B78773189q961440N7192505J05305970J05659365P1186424L7412345J8866360
$$ 278773189 269811749 327004254 432310224 537969589 609156013 646568358 665434718
752.6F65434718J0525167N480945R66847k372503l669202m108251n378246p396698
$$ 665434718 675959885 681440830 682407677 680035174 676365972 672257721 666879475 659482777
768.9F59482777q667827q834004r441256j2086213j6419828k0485640k2567331k2225976
$$ 659482777 650814950 641980946 632539690 620453477 604033649 583548009 560980678 538754702
785.3E38754702k0961166k2545636l2789915n1845730n7702571l0504882R44942N516321
$$ 538754702 517793536 495247900 462457985 410612255 352909684 322404802 323349744 328866065
801.6C28866065J0653436M7448039Q9915246R5217019O5964877L4224272J4095724
$$ 328866065 339519501 386967540 476882786 572099805 638064682 672288954 686384678
815.8F86384678J696765o933927j3705731k1638393l1177461l3330560j7417967J0722577
$$ 686384678 688081443 681147516 667441785 645803392 614625931 581295371 563877404 574599981
832.2E74599981L2806814L8187385K9654383J6697407O921828J743853j389921m180848
$$ 574599981 607406795 645594180 675248563 691945970 698867798 700611651 699221730 695040882
848.5F95040882o052435o182194n487382n735934p097125q099079p851005p411301
$$ 695040882 688988447 682806253 677318871 671582937 664485812 656386733 648535728 641124427
864.8F41124427q285880j0336816j2084484j2975633j3925732j5801012j8199384k0036519
$$ 641124427 632838547 622501731 610417247 597441614 583515882 567714870 549515486 529478967
881.1E29478967k0945012k1409303k1867454k1975190k1244317j9821078j8316209
$$ 529478967 508533955 487124652 465257198 443282008 422037691 402216613 383900404
895.4C83900404j6893953j5124112j2526840q915753m730880p54118K545029N222887
$$ 383900404 367006451 351882339 339355499 330439746 325708866 324954748 327499777 332722664
911.7C32722664P345110Q879393J0132909J1794657J4060318J6429872J8129259J8574327
$$ 332722664 340067774 348947167 359080076 370874733 384935051 401364923 419494182 438068509
928D38068509J8066973J7649084J8094599J9029319J9585669J9357980J8618703J7611622
$$ 438068509 456135482 473784566 491879165 510908484 530494153 549852133 568470836 586082458
944.3E86082458J6053021J3657749J0931790Q864462P673443O730914N481422M259050
$$ 586082458 602135479 615793228 626725018 635589480 643262923 649993837 655475259 659734309
960.7F59734309L545284K580643j640499j4118612l2933414l7399947j2645185J8130481
$$ 659734309 663279593 665860236 664219737 650101125 617167711 579767764 567122579 585253060
977E85253060K7363181K0205855J2344301Q103073N617261L495514J799464P97570
$$ 585253060 612616241 632822096 645166397 653269470 658886731 662382245 664181709 664979279
993.3F64979279l15309l451824j0864496k3515344l2223105j8038392J3661504L0743956
$$ 664979279 664663970 661212146 650347650 626832306 594609201 576570809 590232313 620976269
1009.6F20976269K4621964J3375103O943226L838241J890183Q46862Q00431J017571
$$ 620976269 645598233 658973336 665916562 669754803 671644986 672491848 673292279 674309850
1025.9F74309850O09278l50058j058995j216352j351595k015353k815485k995193k631127
$$ 674309850 674919128 674569070 673510075 672293723 670942128 668926775 666111290 663116097 660484970
1044.3F60484970k736807m031837o148398q133114r644925j1531294j4985978k1233857
$$ 660484970 657748163 653716326 647567928 639434814 629789889 618258595 603272617 582038760
1060.6E82038760l2261550n0015569p1139395q2365304n3255469L0726939J10231460
$$ 582038760 549777210 499761641 428622246 346256942 293001473 323728412 433959872
1074.9D33959872J19811624Q1306219M5690596K5474548J2968421M613877j72198k702475
$$ 433959872 553771496 635077715 680768311 706242859 719211280 723825157 723652959 720950484
1091.2G20950484l672540l766537l943503m804372n723179n842864n217254m627884
$$ 720950484 717277944 713511407 709567904 704763532 699040353 693197489 687980235 683352351
1107.5F83352351m350304l935695l233373k676308k819956l465533m075408m318714
$$ 683352351 679002047 675066352 671832979 669156671 666336715 662871182 658795774 654477060
1123.8F54477060m593551n237639o385207q674801j3135254j9296468k2062718j3425827
$$ 654477060 649883509 644645870 638260663 629585862 616450608 597154140 575091422 561665595
1140.1E61665595M432022J4623404Q259356o809473k3270548l0098557m858732L9429009
$$ 561665595 566097617 580721021 588980377 582170904 558900356 528801799 523943067 563372076
1156.5E63372076N1251947K6467443M180849k976180m096806m566669n123317n050242
$$ 563372076 614624023 641091466 645272315 642296135 638199329 633632660 628509343 623459101
1172.8F23459101m002571k715469k173900k599240l411174l993868m430294m942716
$$ 623459101 619456530 616741061 614567161 611967921 608556747 604562879 600132585 595189869
1189.1E95189869n403637n623758n809665o310701p187307q137644q988678r785473
$$ 595189869 589786232 584162474 578352809 572042108 564854801 556717157 547728479 537943006
1205.4E37943006j0265470r674489p654012n100250l460824l377766m322052n489409
$$ 537943006 527677536 518003047 510349035 505248785 501787961 498410195 494088143 488598734
1221.7D88598734o542951p615119q809358j0003418j0911375j1386037j1579364j1727929
$$ 488598734 482055783 474440664 465631306 455627888 444716513 433330476 421751112 410023183
1238.1D10023183j2077302j2830049j3991177j5345514j6805410j8398106k0086885
$$ 410023183 397945881 385115832 371124655 355779141 338973731 320575625 300488740
1252.3C00488740k1751940k3139149k3832396k3630142k2866234k2066012k0579785
$$ 300488740 278736800 255597651 231765255 208135113 185268879 163202867 142623082
1266.6A42623082j6566307q690267l24078n73635r682946j4016710p121705L851317
$$ 142623082 126056775 117366508 117042430 116468795 106785849 92769139 85647434 89498751
1282.9H9498751J3295986K0791895K6372962K9431283K9677451K7415916K3491934
$$ 89498751 102794737 123586632 149959594 179390877 209068328 236484244 259976178
1297.2B59976178J8880487J3961375Q932531M952043M334748Q510917J6844034K6604504
$$ 259976178 278856665 292818040 301750571 306702614 311037362 319548279 336392313 362996817
1313.5C62996817L3706128L6183268L4238845K8965235K3108423J8441498J4937937
$$ 362996817 396702945 432886213 467125058 496090293 519198716 537640214 552578151
1327.8E52578151J2292624J0225296Q557737P258653O262481N230964L531217J648426
$$ 552578151 564870775 575096071 583653808 590912461 597174942 602405906 605937123 607585549
1344.1F07585549K27690p05838j396060j943410k285778k522111k987146m166305n894840
$$ 607585549 607813239 607107401 605711341 603767931 601482153 598960042 595972896 591806591 585911751
1362.5E85911751p172883p782399q739770r752214j1301160j3244807j3911546j4595091
$$ 585911751 578738868 570956469 562216699 552464485 541163325 527918518 514006972 499411881
1378.8D99411881j6527057j8626183k0936131k5574893l0162454l2036900l6696345
$$ 499411881 482884824 464258641 443322510 417747617 387585163 355548263 318851918
1393.1C18851918m3574482m3687731l9076850k8847605j2863264N502105K4217904
$$ 318851918 275277436 231589705 192512855 163665250 150801986 156304091 180521995
1407.3A80521995L9216429N0050288N4082871N1799953N0675809N0632000L8754135
$$ 180521995 219738424 269788712 323871583 375671536 426347345 476979345 515733480
1421.6E15733480K7170957K0811796J4558851J1316181J0635137J0782540J4020264
$$ 515733480 542904437 563716233 578275084 589591265 600226402 611008942 625029206
1435.9F25029206J6531408J2877643R250164O345093K480209l153324p993757p447243
$$ 625029206 641560614 654438257 663688421 670033514 672513723 669360399 661366642 653919399
1452.2F53919399k834857P745922K1116257J6294956O717741K045572m7386j047968
$$ 653919399 651084542 658830464 679946721 696241677 702959418 705004990 704957604 703909636
1468.5G03909636j941026k798617l254652l590345m564464o447077r416759j3148606
$$ 703909636 701968610 699169993 695915341 692324996 687760532 681313455 671896696 658748090
1484.9F58748090j7981231k2466600k1118700j4121116j0157585n352616J1317909
$$ 658748090 640766859 618300259 597181559 583060443 572902858 567550242 578868151
1499.1E78868151K6423335K6450932K0372152J5170336O892741J596152l41475j469254
$$ 578868151 605291486 631742418 652114570 667284906 674177647 675773799 675432324 673963070
1515.4F73963070j927197k185345k669036l104687l934026n570709o940186q403659
$$ 673963070 672035873 669850528 667181492 664076805 660142779 654572070 647631884 639228225
1531.8F39228225q876741n556047k032042K44975J159490j37687j772702l214061m525244
$$ 639228225 630351484 624795437 622763395 623008370 624167860 624030173 622257471 619043410 614518166
1550.1F14518166n177617n524874n603433o462574o452083m705072n878687q332193
$$ 614518166 609340549 603815675 598212242 591749668 585297585 580592513 574713826 566381633
1566.4E66381633j1830687j5967071j6651392k1334887l4614384l8803101l7225157
$$ 566381633 554550946 538583875 521932483 500597596 465983212 427180111 389954954
1580.7C89954954l9486527l2112449m940540K2769034K7958184K6952029L7388175
$$ 389954954 350468427 318355978 313415438 336184472 364142656 391094685 428482860
1595D28482860M3818236L5020023K0828903R827197K965510j306177m241883o184876
$$ 428482860 472301096 507321119 528150022 537977219 540942729 539636552 535394669 529209793
1611.3E29209793p485032r524107j1808038j0275841r352267j0724663j0824770j0819882
$$ 529209793 521724761 512200654 500392616 490116775 480764508 470039845 459215075 448395193
1627.6D48395193j1347145j0680050j1279255j4840245j4512241j2154460j2445420
$$ 448395193 437048048 426367998 415088743 400248498 385736257 373581797 361136377
1641.9C61136377j3581216j7103762j9047856j4657438j7973125k7160347k0307630
$$ 361136377 347555161 330451399 311403543 296746105 278772980 251612633 231305003
1656.2B31305003j6849473j9685596k3796618k4449781k0818129k0732537k0963229
$$ 231305003 214455530 194769934 170973316 146523535 125705406 104972869 84009640
1670.5H4009640j5043572j0938499q673966n166337l062535k079021j359332l42455
$$ 84009640 68966068 58027569 49353603 44187266 41124731 39045710 37686378 37343923
1686.8C7343923j1683J56180L67939J047052K196588M288033P996533R643607J2804426
$$ 37343923 37332240 37488420 37856359 38903411 41099999 45388032 53384565 63028172 75832598
1705.1G5832598J7917909K0832568K3162350K6049808L0549124L8197666L7260875
$$ 75832598 93750507 114583075 137745425 163795233 194344357 232542023 269802898
1719.4B69802898K8838545K6911676K6844770K4774372K2873581K1065891K3392260
$$ 269802898 298641443 325553119 352397889 377172261 400045842 421111733 444503993
1733.7D44503993K2707492J6747147J6633183J7101049J4878392J3494075J2549698
$$ 444503993 467211485 483958632 500591815 517692864 532571256 546065331 558615029
1748E58615029J2513399J1890411R511769Q026004O895602N052447L588438J821339
$$ 558615029 571128428 583018839 592530608 600556612 607452214 612504661 616093099 617914438
1764.3F17914438j23322j033723J31845M075051O695091N700469M600704M439175M531384
$$ 617914438 617791116 616757393 616889238 620964289 627659380 633359849 637960553 642399728 646931112
1782.6F46931112M506826M116059L096163K764821L197789K664626J617014J220048
$$ 646931112 651437938 655553997 658650160 661414981 664612770 667277396 668894410 670114458
1799F70114458J356840J501322J453995J349688J325905J305878J186192J056373J228512
$$ 670114458 671471298 672972620 674426615 675776303 677102208 678408086 679594278 680650651 681879163
1817.3F81879163J424134J228809R72152R60350Q21888Q14498Q96453M14014j4722
$$ 681879163 683303297 684532106 685504258 686464608 687286496 688100994 688997447 689411461 689396739
1835.7F89396739j46866m31657r94444j281142r99927p12872o97076r66072j359701
$$ 689396739 689249873 688818216 687823772 686542630 685542703 684829831 684132755 683166683 681806982
1854F81806982j666069j652420j058817K00570J606941K621174L364801L322601K286435
$$ 681806982 680140913 678488493 677429676 677630246 679237187 681858361 685223162 688545763 690832198
1872.4F90832198J479387J265705J200735J056314P90774N24819K76506J13964q2552
$$ 690832198 692311585 693577290 694778025 695834339 696625113 697149932 697426438 697540402 697457850
1890.7F97457850m76837o68705m62174k14458j66297k38716l52264m65929o32048q68261
$$ 697457850 696981013 696312308 695850134 695635676 695469379 695230663 694878399 694412470 693780422 692912161
1911.1F92912161j170337j398563j331389j132488j154244j116872q29578o20544n39898
$$ 692912161 691741824 690343261 689011872 687879384 686725140 685608268 684778690 684158146 683618248
1929.5F83618248n62728n76913k87474L76106J010537J376808J469075J296997J091600
$$ 683618248 683055520 682478607 682191133 682567239 683577776 684954584 686423659 687720656 688812256
1947.9F88812256Q85486O30260L63529J02102l43442j117706k169490l273725l915012
$$ 688812256 689697742 690328002 690691531 690793633 690450191 689332485 687162995 683889270 679974258
1966.2F79974258l272474j085639J601756L403008L767192L168941K200067J273334
$$ 679974258 676701784 675616145 677217901 680620909 684388101 687557042 689757109 691030443
1982.5F91030443N74588J08719k59637o56128j067222j497864j952768k353131k486527
$$ 691030443 691605031 691713750 691454113 690797985 689730763 688232899 686280131 683927000 681440473
2000.9F81440473k025545p87854O72459J450181J282096O20604n722l80635o61016
$$ 681440473 679414928 678627074 679299533 680749714 682031810 682652414 682646692 682266057 681605041
2019.2F81605041j035690j418174j712620j911938k078891k245903k337456k245962
$$ 681605041 680569351 679151177 677438557 675526619 673447728 671201825 668864369 666618407
2035.6F66618407k028465j833499j678884j518130j291275r51529n44667j72675J30892
$$ 666618407 664589942 662756443 661077559 659559429 658268154 657316625 656771958 656599283 656730175
2053.9F56730175M03106O83666R01758R57072R15348R02772Q65162P26700N02705K04861
$$ 656730175 657133281 657816947 658718705 659675777 660591125 661493897 662359059 663085759 663588464 663793325
2074.3F63793325q0943k95400m83275o87957q64386r37462q70049p05898n47647m51684
$$ 663793325 663712382 663416982 662933707 662245750 661381364 660443902 659573853 658867955 658320308 657868624
2094.7F57868624l80159k28226l874K23517M90070Q27551J131773J273989J197577
$$ 657868624 657488465 657260239 657256365 657479882 657969952 658797503 659929276 661203265 662400842
2113.1F62400842R68754P27057N37873L34084O2167j78337k92599l15666l62992m32134
$$ 662400842 663369596 664096653 664634526 664968610 665030777 664852440 664559841 664244175 663881183 663449049
2133.5F63449049m30346l45051k49266k42115l67939n47707o19173n59449n33402o56009
$$ 663449049 663018703 662673652 662424386 662182271 661814332 661266625 660647452 660088003 659554601 658898592
2153.9F58898592q09669q63612q65460q99374r70602j045227j056969j000166r85384
$$ 658898592 658088923 657225311 656359851 655460477 654489875 653444648 652387679 651387513 650402129
2172.2F50402129j019001r96232q90077q31902r07957j009226j040816j050294j102268
$$ 650402129 649383128 648386896 647496819 646664917 645756960 644747734 643706918 642656624 641554356
2190.6F41554356j222551j368225j431823j381993j307905j299679j320362j307786
$$ 641554356 640331805 638963580 637531757 636149764 634841859 633542180 632221818 630914032
2206.9F30914032j250028j137555r33289o29485l17216j11461m9054l9041J4364J29819
$$ 630914032 629664004 628526449 627593160 626963675 626646459 626534998 626485944 626446903 626461267 626591086
2227.3F26591086K34008K46525J74463K6762j87277l90053n71311p90000r77337j009345
$$ 626591086 626825094 627071619 627246082 627272844 627085567 626695514 626124203 625334203 624356866 623347521
2247.7F23347521q89242p49469o58273n70834m68314m07636m23729n04792o20127o77585
$$ 623347521 622458279 621708810 621050537 620479703 620011389 619603753 619180024 618675232 618055105 617377520
2268.1F17377520o60658o83606p80940q80241r57370j018882j076341j167118j258970
$$ 617377520 616716862 616033256 615252316 614372075 613414705 612395823 611319482 610152364 608893394
2286.4F08893394j247644j152933j099109j105011j128077j175523j245081j273454
$$ 608893394 607645750 606492817 605393708 604288697 603160620 601985097 600740016 599466562
2302.7E99466562j255870j263976j332879j405775j439631j486898j539230j551211
$$ 599466562 598210692 596946716 595613837 594208062 592768431 591281533 589742303 588191092
2319.1E88191092j513660j414061j299083j175761r18925o22034n94795p99715r39608
$$ 588191092 586677432 585263371 583964288 582788527 581869602 581247568 580652773 579853058 578913450
2337.4E78913450r60052r63330r53972j068652j436949j833916k036094j834095j166582
$$ 578913450 577953398 576990068 576036096 574967444 573530495 571696579 569660485 567826390 566659808
2355.8E66659808m19259j728l5882l16143n55039o70731o79553p14719q76009j058996
$$ 566659808 566240549 566238821 566202939 565886796 565331757 564661026 563981473 563266754 562390745 561331749
2376.2E61331749j172543j256346j354873j477302j621246j742125j817822j878738
$$ 561331749 560159206 558902860 557547987 556070685 554449439 552707314 550889492 549010754
2392.5E49010754j928568j956225j962781j930713j868785j787364j721800j725375
$$ 549010754 547082186 545125961 543163180 541232467 539363682 537576318 535854518 534129143
2408.8E34129143j765907j787186j740873j623451j480997j337826j243949j215160
$$ 534129143 532363236 530576050 528835177 527211726 525730729 524392903 523148954 521933794
2425.1E21933794j190841j179278j224339j301468j386582j495242j631082j770258
$$ 521933794 520742953 519563675 518339336 517037868 515651286 514156044 512524962 510754704
2441.4E10754704j876771j950800j996041k008021k011895k007156k042711k160996
$$ 510754704 508877933 506927133 504931092 502923071 500911176 498904020 496861309 494700313
2457.8D94700313k306641k459079k613663k780438k971708l125102l187924l149569
$$ 494700313 492393672 489934593 487320930 484540492 481568784 478443682 475255758 472106189
2474.1D72106189l040016k952576k922803k931356l025443l238320l522039l815680
$$ 472106189 469066173 466113597 463190794 460259438 457233995 453995675 450473636 446657956
2490.4D46657956m076153m256934m326344m357785m479021m695564m949331n207658
$$ 446657956 442581803 438324869 433998525 429640740 425161719 420466155 415516824 410309166
2506.7D10309166n435467n583733n605996n474567n136371m564285l751874k640874
$$ 410309166 404873699 399289966 393683970 388209403 383073032 378508747 374756873 372115999
2523C72115999j256406K33740J641482K833784L697842M136860M150450L894538L570467
$$ 372115999 370859593 371093333 372734815 375568599 379266441 383403301 387553751 391448289 395018756
2541.4C95018756L276855L039718K856195K729803K690107K695918K641111K447069
$$ 395018756 398295611 401335329 404191524 406921327 409611434 412307352 414948463 417395532
2557.7D17395532K120316J763523J431227J093149P48336M29660J35452j68980n08576
$$ 417395532 419515848 421279371 422710598 423803747 424552083 424981743 425117195 424948215 424439639
2576D24439639q86887j268000j597792j838386j970768k020687k012342j957029j877606
$$ 424439639 423552752 422284752 420686960 418848574 416877806 414857119 412844777 410887748 409010142
2594.4D09010142j799583j763225j755893j744837j751542j821250j984566k184510
$$ 409010142 407210559 405447334 403691441 401946604 400195062 398373812 396389246 394204736
2610.7C94204736k373040k602756k877831l149391l393769l599733l759921l900289
$$ 394204736 391831696 389228940 386351109 383201718 379807949 376208216 372448295 368548006
2627C68548006m056931m164457m143149m034012l906757l781289l626108l371566k983153
$$ 368548006 364491075 360326618 356183469 352149457 348242700 344461411 340835303 337463737 334480584
2645.4C34480584k455771j748234q34674K81066J569301K909720M115730N042434N593628
$$ 334480584 332024813 330276579 329441905 329722971 331292272 334201992 338317722 343360156 348953784
2663.7C48953784N711317N434870M941941M440724L996283L620476L340274L093302
$$ 348953784 354665101 360099971 365041912 369482636 373478919 377099395 380439669 383532971
2680.1C83532971K823383K568900K328426K062172J775145J505226J317918J201868
$$ 383532971 386356354 388925254 391253680 393315852 395090997 396596223 397914141 399116009
2696.4C99116009J068742Q89569P29740O15984M65929K50876J789k34008l82185n22465
$$ 399116009 400184751 401074320 401804060 402420044 402885973 403136849 403138638 402904630 402522445 401999980
2716.8D01999980p92116j125991j360446j453698j525938j572550j459092j240015
$$ 401999980 401207864 400081873 398721427 397267729 395741791 394169241 392710149 391470134
2733.1C91470134j055598r50456r37760j003921j076281j136183j249284j428306j576781
$$ 391470134 390414536 389464080 388526320 387522399 386446118 385309935 384060651 382632345 381055564
2751.4C81055564j635522j675755j764446j843632j854717j843661j857996j919329
$$ 381055564 379420042 377744287 375979841 374136209 372281492 370437831 368579835 366660506
2767.8C66660506k009511k078861k123237k189338k331674k515257k670288k817005
$$ 366660506 364650995 362572134 360448897 358259559 355927885 353412628 350742340 347925335
2784.1C47925335k966761l086448l175110l209948l167391l057212k881735k659917
$$ 347925335 344958574 341872126 338697016 335487068 332319677 329262465 326380730 323720813
2800.4C23720813k394855k038002j594842j126617o41644j48356K83867N62072O17445
$$ 323720813 321325958 319287956 317693114 316566497 315924853 315776497 316060364 316622436 317239881
2818.8C17239881M39256Q8722l79295r24229j457364j909375k272725k548516k718627
$$ 317239881 317679137 317767859 317388564 316464335 315006971 313097596 310824871 308276355 305557728
2837.1C05557728k854109l024548l121198l067761k968580k898961k784222k601862
$$ 305557728 302703619 299679071 296557873 293490112 290521532 287622571 284838349 282236487
2853.4B82236487k448768k350777k310872k297610k186269k000153j846254j668334
$$ 282236487 279787719 277436942 275126070 272828460 270642191 268642038 266795784 265127450
2869.7B65127450j435220j327246j351387j258969j075506r51737q37982p08878n78612
$$ 265127450 263692230 262364984 261013597 259754628 258679122 257727385 256889403 256180525 255601913
2888.1B55601913m18425k10345M5598K82854N24342R08911J345873J640022J835346
$$ 255601913 255183488 254973143 255018741 255301595 255825937 256734848 258080721 259720743 261556089
2906.5B61556089K054363K264351K371401K343714K220899K062469J902015J790463
$$ 261556089 263610452 265874803 268246204 270589918 272810817 274873286 276775301 278565764
2922.8B78565764J669646J421839J004308M23968j41054n52386q85308j182884j366705
$$ 278565764 280235410 281657249 282661557 283085525 282944471 282392085 281506777 280323893 278957188
2941.1B78957188j467794j676709j977860k151907k127975k075643k021193j812786
$$ 278957188 277489394 275812685 273834825 271682918 269554943 267479300 265458107 263645321
2957.4B63645321j539022j298308j070797q90017p27415n38260l55989k51084k59727
$$ 263645321 262106299 260807991 259737194 258847177 258119762 257581502 257225513 256974429 256714702
2975.8B56714702k83480l13014m86284p24465q78453r73881j030534j100898j229822
$$ 256714702 256431222 256118208 255631924 254907459 254029006 253055125 252024591 250923693 249693871
2994.2B49693871j259819j163021j072928r46000p25061m33654q3372K30611L50997
$$ 249693871 248434052 247271031 246198103 245252103 244527042 244093388 244010016 244240627 244591624
3012.5B44591624L03089L02255M54933O82726R39057J114666J134828J204088J377165
$$ 244591624 244894713 245196968 245651901 246334627 247273684 248388350 249523178 250727266 252104431
3030.9B52104431J521200J580745J619816J791775J887381J602233J118958P00891
$$ 252104431 253625631 255206376 256826192 258617967 260505348 262107581 263226539 263927430
3047.2B63927430L61532p2092n78284q27730q02934p65413q23826r82105j247347j653582
$$ 263927430 264288962 264216870 263638586 262810856 262007922 261242509 260418683 259436578 258189231 256535649
3067.6B56535649k055943k048284j443982n30958J79321L65674K21521J97589M94272
$$ 256535649 254479706 252431422 250987440 250456482 250635803 251001477 251222998 251420587 251914859
3085.9B51914859Q86679R89228R65446J465649K453982L221095L450543L345161L200472
$$ 251914859 252801538 253790766 254756212 256221861 258675843 261896938 265347481 268692642 271893114
3104.3B71893114L186434L235370L186941L178180L291547L270626L093362K892464
$$ 271893114 275079548 278314918 281501859 284680039 287971586 291242212 294335574 297228038
3120.6B97228038K680183K587199K666503K690494K533168K364129K326131K343624
$$ 297228038 299908221 302495420 305161923 307852417 310385585 312749714 315075845 317419469
3136.9C17419469K300412K198964K172321K283722K468050K693951K896875K981156
$$ 317419469 319719881 321918845 324091166 326374888 328842938 331536889 334433764 337414920
3153.2C37414920L005267L082156L155976L147185L078163K993852K890169K750069
$$ 337414920 340420187 343502343 346658319 349805504 352883667 355877519 358767688 361517757
3169.6C61517757K657712K662956K698690K786934K924473K997636L040642L093034
$$ 361517757 364175469 366838425 369537115 372324049 375248522 378246158 381286800 384379834
3185.9C84379834L083765L020078K942562K883256K899051K957880K985180K992153
$$ 384379834 387463599 390483677 393426239 396309495 399208546 402166426 405151606 408143759
3202.2D08143759L013760L035664L049255L043174K988935K938509K920240K888024
$$ 408143759 411157519 414193183 417242438 420285612 423274547 426213056 429133296 432021320
3218.5D32021320K830654K762527K706557K717376K758354K762466K766937K740682
$$ 432021320 434851974 437614501 440321058 443038434 445796788 448559254 451326191 454066873
3234.8D54066873K704918K744943K816826K862453K875329K847224K806157K808332
$$ 454066873 456771791 459516734 462333560 465196013 468071342 470918566 473724723 476533055
3251.1D76533055K826572K808094K802610K846122K854258K804667K743899K683878
$$ 476533055 479359627 482167721 484970331 487816453 490670711 493475378 496219277 498903155
3267.5D98903155K671600K660632K565443K478600K435565K357721K247930K120256
$$ 498903155 501574755 504235387 506800830 509279430 511714995 514072716 516320646 518440902
3283.8E18440902J997888J897395J797438J706600J612723J509249J425624J299977
$$ 518440902 520438790 522336185 524133623 525840223 527452946 528962195 530387819 531687796
3300.1E31687796J110315R16660P98106Q36134Q76666P55310N96881N16176M70638
$$ 531687796 532798111 533714771 534512877 535349011 536225677 536980987 537577868 538094044 538564682
3318.4E38564682M29869L43263K54512L10957M09126L78132K62976J38640P8082J62185
$$ 538564682 538994551 539337814 539592326 539903283 540312409 540690541 540953517 541092157 541170239 541332424
3338.8E41332424K35557J44184L517j35482k66790k66493j94847k62380m89473p02620
$$ 541332424 541567981 541712165 541715682 541580200 541313410 541046917 540852070 540589690 540100217 539397597
3359.2E39397597p74920q43167j028597j132608j006543q34883q60214j006722j035273
$$ 539397597 538622677 537779510 536750913 535618305 534611762 533776879 532916665 531909943 530874670
3377.6E30874670r67503q98302q50379q78751r43721r82165r19938p67052p17223q41022
$$ 530874670 529907167 529008865 528158486 527279735 526336014 525353849 524433911 523666859 522949636 522108614
3398E22108614q88347o65963m49419m95195o34373o74426o15358n11110m49777m46618
$$ 522108614 521220267 520554304 520104885 519609690 518975317 518300891 517685533 517174423 516724646 516278028
3418.4E16278028m01854l15130k89559l03626k37882r8050O259M7862J38104K97725
$$ 516278028 515876174 515561044 515271485 514967859 514729977 514631927 514638186 514686048 514824152 515121877
3438.8E15121877M28915M37498M31657N95927P34449P06672O71566P12454P71344Q16405
$$ 515121877 515550792 515988290 516419947 517015874 517750323 518456995 519128561 519841015 520612359 521428764
3459.2E21428764Q90136R10103Q38697Q55148R66191R73225R09447Q92043Q76725Q96692
$$ 521428764 522318900 523229003 524067700 524922848 525889039 526862264 527771711 528663754 529540479 530437171
3479.6E30437171R79424R44614Q56162R05156R61244R29117Q94010R08494R06110Q77261
$$ 530437171 531416595 532361209 533217371 534122527 535083771 536012888 536906898 537815392 538721502 539598763
3500E39598763R55045J020849R11117R26554J131892J216650J137733J033009R77695
$$ 539598763 540553808 541574657 542485774 543412328 544544220 545760870 546898603 547931612 548909307
3518.3E48909307R94145J104594J180589J149356J175225J234949J202166J199424
$$ 548909307 549903452 551008046 552188635 553337991 554513216 555748165 556950331 558149755
3534.6E58149755J231909J150548J081348J133442J309096J421094J243592J177787
$$ 558149755 559381664 560532212 561613560 562747002 564056098 565477192 566720784 567898571
3551E67898571J358748J329482J169741J170754J145482R04262J052201J919627K101839
$$ 567898571 569257319 570586801 571756542 572927296 574072778 574977040 576029241 577948868 580050707
3569.3E80050707J458108J265109J476347J604557J610935J448035J141131J343370
$$ 580050707 581508815 582773924 584250271 585854828 587465763 588913798 590054929 591398299
3585.6E91398299K140760K109170J431048J422644J707911J723588J760781J706004
$$ 591398299 593539059 595648229 597079277 598501921 600209832 601933420 603694201 605400205
3601.9F05400205J244187J041889J520157J729429J506507J316309J037896J435578
$$ 605400205 606644392 607686281 609206438 610935867 612442374 613758683 614796579 616232157
3618.3F16232157K007067J287579K43664K02298J649201K214074J027942P14004P93457
$$ 616232157 618239224 619526803 619770467 619972765 621621966 623836040 624863982 625577986 626371443
3636.6F26371443O49810N11110J20401m30762k40624J283645J916170N17011O7472
$$ 626371443 627021253 627532363 627652764 627222002 626981378 628265023 630181193 630698204 630765676
3655F30765676O93679O02603J66059q4281n45204p57694j00434P9632m21763M34041
$$ 630765676 631459355 632061958 632228017 632143736 631598532 630840838 630740404 630820036 630398273 630832314
3675.4F30832314Q66354K3484l09765n96821q47042k52008P58171O92963J72317j1325
$$ 630832314 631698668 631722152 631412387 630815566 629968524 629716516 630474687 631167650 631339967 631328642
3695.8F31328642r9420J2576L49820J10090n86629q24153k45393O72698L64185n04137
$$ 631328642 631229222 631241798 631591618 631701708 631115079 630290926 630045533 630718231 631082416 630578279
3716.2F30578279p57992o16431m53472k62857j55031o09041j110017q97229m0292M38749
$$ 630578279 629820287 629203856 628750384 628487527 628332496 627723455 626613438 625716209 625675917 626114666
3736.5F26114666l71754j422584j125872J05679k16544n02646Q60334J203716J15454
$$ 626114666 625742912 624320328 623194456 623300135 623083591 622580945 623441279 624644995 624760449
3754.9F24760449k45571J78337K14755k01106k50458j63436J02520L02434j19210n24461
$$ 624760449 624514878 624693215 624907970 624706864 624456406 624292970 624395490 624697924 624578714 624054253
3775.3F24054253m49240j02759j27673k65717j25230j72674l24547m80950o53327o24180
$$ 624054253 623605013 623502254 623374581 623108864 622983634 622810960 622486413 622005463 621352136 620727956
3795.7F20727956p33077n53608J79291K265j32323K26796l46720j081467r55522l57866
$$ 620727956 619994879 619441271 619620562 619622827 619490504 619717300 619370580 618289113 617333591 616975725
3816.1F16975725m20511j49906M15504j44779m48943m20987n03063m54188m25339j91748
$$ 616975725 616555214 616405308 616820812 616676033 616227090 615806103 615303040 614848852 614423513 614231765
3836.5F14231765J24514N7400N2035J9848n25057j227499j261115L31879J489282O675
$$ 614231765 614356279 614413679 614465714 614485562 613960505 612733006 611471891 611803770 613293052 613299727
3856.9F13299727q79705p58588k92420j19806n19573l50893J13428l7134l30031p04944
$$ 613299727 612420022 611661434 611369014 611249208 610729635 610378742 610492170 610455036 610125005 609420061
3877.3F09420061o03437k54393k63750K205k12073o31094j98007j20878p95186j098633
$$ 609420061 608816624 608562231 608298481 608300686 608088613 607457519 607259512 607138634 606343448 605244815
3897.7F05244815q67068n04792j30117j9193k18272k06172l6657P0691L46303N80072
$$ 605244815 604377747 603872955 603742838 603723645 603505373 603299201 603262544 603333235 603679538 604259610
3918.1F04259610L32296L159o854j9491k21849j93417O8605N6088j77026l37541l27348
$$ 604259610 604591906 604595065 604588211 604568720 604346871 604153454 604222059 604278147 604101121 603763580 603436232
3940.5F03436232j53006j60336l05951k40385j40846j39654j85132k70068k64168j68324
$$ 603436232 603283226 603122890 602816939 602576554 602435708 602296054 602110922 601840854 601576686 601408362
3960.9F01408362j76251k78234k90990k27451k53499l13580k62499k06828k14875k05338
$$ 601408362 601232111 600953877 600662887 600435436 600181937 599868357 599605858 599399030 599184155 598978817
3981.3E98978817j87516k39968l06666k61664j70648j43946j40130j43409
$$ 598978817 598791301 598551333 598244667 597983003 597812355 597668409 597528279 597384870
3997.6E97384870
$$ 597384870
##END=$$ End of the data block
