##TITLE=3-5M-11 $$ Begin of the data block
##JCAMP-DX=5.00 $$ ACD/SpecManager v 10.08
##SPECTROMETER/DATA SYSTEM=Alpha
##DATE=02 Jun 2015 08:56:44
##DATA TYPE=INFRARED SPECTRUM
##DATA CLASS=XYDATA
##ORIGIN=
##OWNER=
##NPOINTS=1765
##FIRSTX=399.76428223
##LASTX=3997.64306641
##MAXX=3997.64306641
##MINX=399.76428223
##MAXY=1.00159848
##MINY=0.73834771
##XFACTOR=1.0000000000
##YFACTOR=0.000000010000000
##FIRSTY=1.00000000
##DELTAX=2.03961372
##XUNITS=1/CM
##YUNITS=ARBITRARY UNITS
##XYDATA=(X++(Y..Y))
399.8A00000000M1223m1223o2907p9936L0929M405j40661k13236j55329m6671N675
422.2I9342269O2716R6231j8608j41603q1593J1891m1633j10192n6445J0824l0863
444.6I9042994o6066K8044P3832l3617j16366n5528M7583K0444l1227J4806L7104m5145
469.1I8916858j02508o336N8544l9595q0002J2058M5157l1871o3491Q995N1963j6534
493.6I8753238n7519J3083L8964m7296q0920n18L8922l9816q7673k8485k1571r3346
518.1I8387063p4912K5130K6816p2587q4668K032K5189m0024o9523j8460J228n7780
542.5I8049504p7498j4639J2612l7873o5541j8394J3167m0531p9519l1400l922n7095
567I7648871p8732j5390K0063l4910p6527k5957K1475k2340o4528k1058J2952k9486
$$ y = [100000000, 100041223, 100000000, 99937093, 99857157, 99888086, 99892491, 99751830, 99538594, 99383265, 99336594, 99342269, 99404985, 99501216, 99482608, 99341005, 99259412, 99271303, 99229670, 99119478, 99063033, 99073857, 99042994, 98976928, 99004972, 99078804, 99045187, 98928821, 98873293, 98920876, 98941320, 98910093, 98924899, 98962003, 98916858, 98814350, 98808014, 98866558, 98826963, 98746961, 98759019, 98804176, 98772305, 98708814, 98717809, 98769772, 98753238, 98695719, 98708802, 98747766, 98700470, 98619550, 98619032, 98657954, 98618138, 98530465, 98501980, 98480409, 98387063, 98312151, 98337281, 98364097, 98291510, 98206842, 98208874, 98234063, 98194039, 98124516, 98106056, 98107284, 98049504, 97972006, 97957367, 97969979, 97932106, 97866565, 97848171, 97861338, 97820807, 97741288, 97709888, 97705966, 97648871, 97570139, 97554749, 97574812, 97539902, 97463375, 97437418, 97458893, 97436553, 97372025, 97350967, 97363919, 97334433]
591.5I7334433n8824j2261L1459j591m1229m619M7952K4372k2238q94K4462k1482m1419
618I7258121L7563R4765N4520J2494M2563P7081M4215K825L0094P0691M8304Q541L0131
644.5I7811908O8599L8588L856M8584R8532P3874L7390N8115Q6897K3407j21140m4489
669I8184121J86717J37735L4070L0690O8235O0404K4533K7961N7143N6642K8664K2262
693.5I8919177M4334M0728J0443R703L6335L8964J2886N848L0821L7003N179j7172
717.9I9174249R674M3964K7401O193K5010L3551J210j7279Q684K3013n912j8466J7011
744.5I9328303L6049M906j1850K1220L9804Q034r739K1583L7342N501r834J7398K6429
771I9515146l904j4138J8811L8111J4675L660L1495M1061J2476k242J3954K6452K2424
$$ y = [97334433, 97275609, 97263348, 97294807, 97293216, 97251987, 97247368, 97295320, 97319692, 97297454, 97296560, 97321022, 97299540, 97258121, 97295684, 97390449, 97444969, 97457463, 97500026, 97577107, 97621322, 97624147, 97654241, 97724932, 97773236, 97781777, 97811908, 97880507, 97919095, 97922951, 97971535, 98070067, 98143941, 98181331, 98239446, 98326343, 98349750, 98228610, 98184121, 98370838, 98508573, 98542643, 98573333, 98641568, 98701972, 98726505, 98754466, 98811609, 98868251, 98896915, 98919177, 98963511, 99004239, 99014682, 99024385, 99060720, 99099684, 99112570, 99118418, 99149239, 99186242, 99191421, 99174249, 99183923, 99227887, 99255288, 99261481, 99286491, 99320042, 99321252, 99303973, 99312657, 99335670, 99329758, 99311292, 99328303, 99364352, 99369258, 99357408, 99378628, 99418432, 99426466, 99416727, 99438310, 99475652, 99481153, 99471319, 99488717, 99515146, 99511242, 99497104, 99515915, 99554026, 99568701, 99572361, 99603856, 99644917, 99657393, 99655151, 99669105, 99695557, 99717981]
797.5I9717981K0510K9689L1399J7906J2064K6500M0608L1180J1456P260J4907J9443
822I9980903J6319P010l34m124j0896j0854M542J3482J580q488M47J0783l70p516p27
852.6I9991757J0496L421q690m327P343J8644K206K849Q058p510j8227K790K3222J6248
881.1A00048280L683R644K0409P796j0645j717J3602K503j4150k372J4591o55k2066
907.6A00068903j4508l016j7607l3772j7816J37r042j9675k903J7428J1665l815J783
934.1I9977762J4847P439p719m655P426K09j9145j9079p415j2130k7954l1436k1058
960.7I9857092k2340l8022m2641l2878l3849n1123n3865l8576l9977n7971n5909l3671
985.1I9356270k9421m6760n2655l8552l5316n5652o6448n4675n1212o7532p3654n6648
$$ y = [99717981, 99738491, 99768180, 99799579, 99817485, 99829549, 99856049, 99896657, 99927837, 99939293, 99946553, 99961460, 99980903, 99997222, 100004232, 100003898, 99999774, 99988878, 99978024, 99982566, 99996048, 99997628, 99989140, 99989587, 100000370, 100000000, 99992484, 99991757, 100002253, 100005674, 99996984, 99992657, 100000000, 100018644, 100020850, 100023699, 100031757, 100024247, 100006020, 100008810, 100032032, 100048280, 100051963, 100061607, 100082016, 100089812, 100079167, 100077450, 100091052, 100093555, 100079405, 100077033, 100091624, 100090969, 100068903, 100054395, 100051379, 100033772, 100000000, 99982184, 99982321, 99973279, 99953604, 99950701, 99968129, 99979794, 99975979, 99977762, 99992609, 100000048, 99992329, 99987674, 99995100, 99995309, 99976164, 99957085, 99949670, 99937540, 99909586, 99878150, 99857092, 99834752, 99796730, 99754089, 99721211, 99687362, 99636239, 99582374, 99543798, 99503821, 99445850, 99389941, 99356270, 99326849, 99280089, 99227434, 99188882, 99153566, 99097914, 99031466, 98976791, 98925579, 98858047, 98784393, 98727745]
1009.6I8727745m6617n5236n2547k4259o02n937j4281l862j574k4873m2951l1948j9908
1036.1I8403150l2842m5145l2371k1064l1639l5011j0586J5581J4942K838P194J5890
1060.6I8250937P242L82J4740K5714R858j1259o551Q691M959m786M017J6767O556j1909
1089.2I8315358q523N758k862k4765k8157k3044l3021m7552m3154k8872k9451l3140
1113.6I8018575j4508J2422J9240Q565J478p724r823M6235J22649J34807R8777O7550
1138.1I8498243N9509O0463M5628K8693L3981M4197L6591K0677J8460K7203K4045R900
1162.6I8907590J2982L7515N0914M6391N2768O9409O8903N4973M9729N3143N1534M1390
1187.1I9497241L5912M0304L6735J9198R507J6761K1613J3548R155J4299J4740J0133
$$ y = [98727745, 98681128, 98625892, 98573345, 98549086, 98548484, 98542547, 98528266, 98524404, 98522830, 98497957, 98455006, 98423058, 98403150, 98370308, 98325163, 98292792, 98271728, 98240089, 98205078, 98194492, 98210073, 98225015, 98227853, 98235047, 98250937, 98258179, 98258561, 98273301, 98299015, 98308873, 98297614, 98291063, 98299754, 98304713, 98299927, 98303944, 98320711, 98327267, 98315358, 98306835, 98312593, 98309731, 98284966, 98256809, 98233765, 98200744, 98153192, 98110038, 98081166, 98051715, 98018575, 98004067, 98016489, 98035729, 98044294, 98045772, 98038048, 98028225, 98074460, 98197109, 98331916, 98430693, 98498243, 98557752, 98618215, 98663843, 98692536, 98726517, 98770714, 98807305, 98827982, 98846442, 98873645, 98897690, 98907590, 98920572, 98958087, 99009001, 99055392, 99108160, 99177569, 99246472, 99301445, 99351174, 99404317, 99455851, 99497241, 99533153, 99573457, 99610192, 99629390, 99638897, 99655658, 99677271, 99690819, 99699974, 99714273, 99729013, 99739146]
1211.5I9739146J0741J6510J7369J0258M179L480K289l189p838o520k975k718k658
1238.1I9778074j246l671q709o020M179P945J109n770o497o449o980p075r555j4203
1266.6I9715132j9628k0558j0794K747O736K664j508r751k3157l1161k7972j6672L976
1293.1I9570054L4213N8901O4880N6070M2981K9176J4717J681q798j1504j1438j1372
1317.6I9829561O115K9379L0530K0170J4716R829P87j5491m1712n6505k2477K6649
1342.1I9831551K6030m822k5374k8378k4289k2787k3979m1425p5435o6710r191k778
1366.6I9532413l7843o1273q6540p2146k5481l5828r4581j21074n5069P1478J44899
1389I9158955Q4483l1501o1726j0455K8461M0311P599r000J3715K15k6906m3541r7573
$$ y = [99739146, 99749887, 99766397, 99783766, 99794024, 99798203, 99801683, 99803972, 99800783, 99792945, 99786425, 99783450, 99780732, 99778074, 99776828, 99773157, 99764448, 99758428, 99762607, 99770552, 99771661, 99765891, 99759394, 99752945, 99745965, 99738890, 99729335, 99715132, 99695504, 99674946, 99664152, 99666899, 99673635, 99676299, 99674791, 99665040, 99641883, 99610722, 99582750, 99566078, 99570054, 99604267, 99663168, 99728048, 99784118, 99827099, 99856275, 99870992, 99872673, 99863875, 99852371, 99840933, 99829561, 99835676, 99865055, 99895585, 99915755, 99930471, 99940300, 99941087, 99925596, 99883884, 99827379, 99804902, 99831551, 99857581, 99852759, 99827385, 99799007, 99774718, 99751931, 99727952, 99686527, 99611092, 99544382, 99535191, 99532413, 99494570, 99433297, 99346757, 99274611, 99249130, 99213302, 99118721, 98997647, 98942578, 99014056, 99158955, 99243438, 99211937, 99150211, 99139756, 99168217, 99208528, 99216127, 99207127, 99220842, 99221057, 99194151, 99150610, 99053037]
1415.5I9053037j58548q7959L7664M4507K4599P999j317J3464m1085r6762J4353J02853
1440I8912805M5520j6212m1646k0450J9026k1148j48088k35170m4525J44476O5261
1462.4I8659849j067P7451Q9192k0236l3790R9695J62429J20669N8824J7422l8582
1484.9I9191856j14935j02908K9803P1662l0583n5849N8174Q6248m8811k32106j35911
1507.3I8716640J64390J70410L9774o3837r1987r0391n2124N1969P1722N6953L5047
1529.7I9008566n4717p3397l8415j60164k42084j3375J50942J37085M8643m5466q8751
1552.2I8628867j34981k33275k73716N4592K37298P5251p2980j40626q7326l7480j42008
1574.6I7873616j69426l6561l0917j13625j63573j88064k07359k34348k61831k74914
$$ y = [99053037, 98894489, 98806530, 98844194, 98888701, 98913300, 98921299, 98919982, 98933446, 98892361, 98795599, 98809952, 98912805, 98958325, 98942113, 98900467, 98880017, 98899043, 98877895, 98729807, 98494637, 98450112, 98594588, 98659849, 98658782, 98736233, 98825425, 98805189, 98771399, 98871094, 99033523, 99154192, 99213016, 99230438, 99191856, 99076921, 98974013, 99003816, 99075478, 99044895, 98989046, 99047220, 99133468, 99084657, 98852551, 98716640, 98881030, 99051440, 99091214, 99027377, 98935390, 98844999, 98792875, 98844844, 98916566, 98973519, 99008566, 98953849, 98880452, 98842037, 98681873, 98439789, 98426414, 98577356, 98714441, 98763084, 98717618, 98628867, 98493886, 98260611, 97986895, 98041487, 98278785, 98354036, 98281056, 98140430, 98053104, 98015624, 97873616, 97704190, 97667629, 97636712, 97523087, 97359514, 97171450, 96964091, 96729743, 96467912, 96192998]
1595I6192998k77776k94173l20553l32386l36682l56061l74633l76904m06051m77296
1615.4I2640483m18758k31880k18683k54369j93483j46913j06311q5807j23060k4855
1635.8I0836364K29919K98506K29615J45656J63931L27700L01236J95831M53395O07639
1656.2I3789792M43047L10046L06064L68082L02011K13772K85137L35973L12078L42816
1676.6I7008818L06094J65820O5309K15900L91942L12036K12867R6404k6625l7945
1697I8710620J2684J48666K26379J44040J22553J15478K8742p4226j27512l0363J61898
1719.4I9438959J81884R2179L9339l732n2905r8103o2329J07313J23804M8107N2613
1741.9I9867129M6838n764m1062p468Q2630Q7523K4045L028j5247n508M3404M685p3564
$$ y = [96192998, 95915222, 95621049, 95300496, 94968110, 94631428, 94275367, 93900734, 93523830, 93117779, 92640483, 92221725, 91989845, 91771162, 91516793, 91323310, 91176397, 91070086, 90984279, 90861219, 90836364, 91066283, 91364789, 91594404, 91740060, 91903991, 92231691, 92532927, 92728758, 93182153, 93789792, 94232839, 94542885, 94848949, 95217031, 95519042, 95732814, 96017951, 96353924, 96666002, 97008818, 97314912, 97480732, 97546041, 97761941, 98153883, 98465919, 98678786, 98775190, 98748565, 98710620, 98723304, 98871970, 99098349, 99242389, 99364942, 99480420, 99509162, 99434936, 99307424, 99277061, 99438959, 99620843, 99713022, 99752361, 99748629, 99695724, 99597621, 99535292, 99642605, 99766409, 99814516, 99867129, 99913967, 99908203, 99867141, 99859673, 99942303, 100029826, 100053871, 100056899, 100041652, 100036144, 100079548, 100084233, 100010669]
1768.4A00010669j00177l2592Q8876R0683J5557q166P892P379Q70l9852r3919l9333
1792.8I9907887N4568L7545j3292j3298L0929M4203J4102j9812j4186K3389K7418N84
1817.3A00080037j0145j9633m4060m4727l4959j7678M8423O1041P784o938j1539o9893
1841.8I9937713q6105J9676P9572M3529N615J156M125K098m458o342k0153o2024o0278
1868.3I9854124K8383P6986L7902j991p772j365j216q738k2209k6851K68J4078J747
1894.8I9943346O276J0336j711r251j0276j6295j7900l141M518k1809m0817j1039J0681
1921.3I9842918Q613J4901J0931q70o050r632j0335j0240k3455l5280j2082J5384J4913
1947.9I9799716K975q208j1134p284o902q935p128j0580j8484j0395K712j96q458j1075
$$ y = [100010669, 99910492, 99877900, 99966776, 100057459, 100073016, 100064850, 100072742, 100080121, 100080991, 100041139, 99947220, 99907887, 99962455, 100000000, 99986708, 99973410, 100004339, 100048542, 100062644, 100042832, 100028646, 100052035, 100079453, 100080037, 100069892, 100050259, 100006199, 99961472, 99926513, 99908835, 99957258, 100018299, 100026083, 100019145, 100007606, 99937713, 99851608, 99871284, 99950856, 99994385, 100000000, 100001156, 100005281, 100007379, 100002921, 99996579, 99976426, 99914402, 99854124, 99882507, 99959493, 99997395, 99995404, 99987632, 99986267, 99985051, 99976313, 99954104, 99927253, 99927521, 99941599, 99943346, 99949622, 99959958, 99958247, 99948996, 99938720, 99922425, 99904525, 99901384, 99905902, 99884093, 99843276, 99832237, 99842918, 99851531, 99866432, 99877363, 99876493, 99870443, 99860811, 99850476, 99840236, 99816781, 99781501, 99769419, 99784803, 99799716, 99802691, 99794483, 99783349, 99776065, 99769163, 99760228, 99753100, 99742520, 99724036, 99713641, 99716353, 99716157, 99707699, 99696624]
1976.4I9696624o705j407n054j2941j5533j5956j6677n221Q440L874n591q786q881
2002.9I9606186m947k646m942o294r066j6105j8531j5777k5565n6845n7620J5062O7550
2029.4I9470460M1414J0347N311N698L523J847K343J335j562m142l106R12M322L469
2058I9542171J383p04m029k390M947P904K789k247j323K998N931O580M411J317K521
2088.6I9572259N287N663O741Q148O926O074N972K253K15N370R870P111K253J437K783
2119.2I9648362L463L225K778L999O503P176N836O020P462O455L732L636M476L034
2147.7I9716157J520R47r65l100m214q702j4001j4848j5264r382J5223M0167M2010
2174.3I9745548L2300K6518K2602J6707J2088J5586K0922J6510J0020R197Q779L887
$$ y = [99696624, 99689919, 99688512, 99683458, 99670517, 99654984, 99639028, 99622351, 99617130, 99625570, 99629444, 99623853, 99615067, 99606186, 99601239, 99598593, 99593651, 99587357, 99578291, 99562186, 99543655, 99527878, 99502313, 99445468, 99387848, 99402910, 99470460, 99511874, 99522221, 99527532, 99533230, 99536753, 99538600, 99540943, 99542278, 99540716, 99536574, 99533468, 99534380, 99538702, 99542171, 99543554, 99542850, 99538821, 99536431, 99541378, 99549282, 99552071, 99549824, 99548501, 99551499, 99557430, 99564010, 99568421, 99569738, 99572259, 99577546, 99583209, 99589950, 99598098, 99605024, 99611098, 99617070, 99619323, 99619538, 99624908, 99634778, 99641889, 99644142, 99645579, 99648362, 99651825, 99655050, 99657828, 99661827, 99668330, 99675506, 99681342, 99687362, 99694824, 99701279, 99705011, 99708647, 99713123, 99716157, 99717677, 99718624, 99717659, 99714559, 99710345, 99701643, 99687642, 99672794, 99657530, 99648148, 99663371, 99703538, 99745548, 99777848, 99804366, 99826968, 99843675, 99855763, 99871349, 99892271, 99908781, 99918801, 99927998, 99936777, 99940664]
2198.7I9940664J013P129R357K593L76M589N448J08j896M906P504n72l380L815N376
2229.3I9987030M59K170P414K927o372o193N740Q899L22l129J782K587k444k479K574
2259.9A00001287J479n746o306J192K330l069j502N334N919J669K205K682p480k0510
2288.5I9979484k2036j7649j7041j8799j9914k1732l0881m6027n3805m9764m6515m7052
2312.9I9588269m6891n8424q1319q7613o7306n2058n7841n8138l7622j9187k5910m2409
2337.4I8953551m0787j4413M2802J26589J30307J2511j30492k03288j79845j24103
2357.8I8572832o5744L857P2634J21576J49172J61553J62518J53297J44243J40691
2378.2I9616629J31059J07646P6222M5544K2000P766O32k026k384k170j192K74K384
$$ y = [99940664, 99941677, 99948806, 99958163, 99960756, 99961132, 99965721, 99971169, 99971277, 99969381, 99974287, 99981791, 99981219, 99977839, 99981654, 99987030, 99987489, 99989659, 99997073, 100000000, 99993628, 99987435, 99993175, 100002074, 100002396, 99999267, 100001049, 100003636, 100001192, 99998713, 100001287, 100002766, 99997020, 99990714, 99991906, 99994236, 99991167, 99989665, 99994999, 100000918, 100002587, 100004792, 100007474, 99999994, 99979484, 99957448, 99939799, 99922758, 99903959, 99884045, 99862313, 99831432, 99785405, 99731600, 99681836, 99635321, 99588269, 99541378, 99482954, 99401635, 99314022, 99246716, 99194658, 99136817, 99078679, 99041057, 99021870, 98995960, 98953551, 98912764, 98898351, 98941153, 99067742, 99198049, 99210560, 99080068, 98876780, 98696935, 98572832, 98507088, 98510945, 98583579, 98705155, 98854327, 99015880, 99178398, 99331695, 99475938, 99616629, 99747688, 99855334, 99931556, 99977100, 99999100, 100006866, 100007498, 100005472, 100003088, 100000918, 99999726, 100000000, 100002384]
2404.7A00002384j430k432J442M149J824j872q70O67k718l463K355O377K659j288r29
2435.3A00006855l231p141l105O479P117k599o610j222K545J437n25R66Q82j097N25
2465.9A00001276M494K622l445k861M065M006k075j096K765k4n638m894J783N292K242
2496.5A00008512k337k527j133k277k110ON61J305M661N376M054K193p27l362n317
2527.1A00006878o282k783L248K992o91J311L457p75m470j812j478o301o032k56M024
2557.7I9991030L504j293j866L427N198M53n358m352K57K986L880L10l821k718p86
2588.3I9990851O14o0l862l595P81m1l177k098P62J866j103m583k808Q11o5k385k789
2623I9969119k647j585J341J538l690p355n001M65J002m358m655O20j55m673m893n222
$$ y = [100002384, 100000954, 99998522, 99999964, 100004113, 100005937, 100004065, 100003195, 100003862, 100001144, 99997681, 100000036, 100006413, 100009072, 100007784, 100006855, 100003624, 99996483, 99993378, 99999857, 100006974, 100004375, 99997765, 99996543, 99999088, 100000525, 100000000, 100000966, 100001848, 100000751, 100001276, 100005770, 100008392, 100004947, 100002086, 100006151, 100010157, 100008082, 100006986, 100009751, 100009727, 100004089, 99999195, 100000978, 100006270, 100008512, 100006175, 100003648, 100002515, 100000238, 99998128, 99998134, 99998695, 100000000, 100004661, 100010037, 100014091, 100016284, 100015557, 100012195, 100006878, 100000596, 99997813, 100001061, 100004053, 100003362, 100004673, 100008130, 100007355, 100002885, 100001073, 99999595, 99993294, 99987262, 99987006, 99991030, 99994534, 99993241, 99991375, 99994802, 100000000, 100000453, 99995095, 99990743, 99991000, 99993986, 99997866, 99998176, 99994355, 99991637, 99990851, 99991465, 99991405, 99987543, 99983948, 99984729, 99984688, 99981511, 99979413, 99980175, 99982041, 99980938, 99976355, 99973547, 99974358, 99974293, 99971908, 99969119, 99966472, 99964887, 99966228, 99967766, 99964076, 99956721, 99951720, 99952185, 99953187, 99948829, 99944174, 99944794, 99944639, 99939966, 99935073, 99929851]
2655.6I9929851o365l380P33k15n72P75m256p361k348J472k38k379m017m792m369m000
2688.2I9888539l934q201j0079l279Q71m489j0556o151M95j574o717p910l260R5j931
2718.8I9821919j043J860K26p009j2958q476k348l255n722o097o235n096L987J1075
2747.4I9780828k033k0945j9264l302J371p421j2839p832j264k431l225K837L553j0300
2775.9I9697733k1875j5652o986q380m959M482l493k0009j8013k467n55j7714k5827
2802.4I9556285j7589q995o353j2529k1684k3336k1469j7846j0705q303j6856k6894
2826.9I9363726k5862j7744j1248r233j1026l2038p1257q3757o6989o0141o5113n9080
2851.4I8850238m0751j6547J1623J9759K861n549l892j0276o986J4919J4657j9526
$$ y = [99929851, 99923486, 99920106, 99920839, 99920624, 99920052, 99920827, 99916571, 99909210, 99906862, 99908334, 99908096, 99905717, 99901700, 99896908, 99892539, 99888539, 99884605, 99876404, 99866325, 99863046, 99863917, 99859428, 99848872, 99842721, 99843216, 99841642, 99834925, 99827015, 99823755, 99823850, 99821919, 99820876, 99822736, 99822962, 99815953, 99802995, 99794519, 99792171, 99788916, 99783194, 99777097, 99770862, 99765766, 99769753, 99780828, 99778795, 99757850, 99738586, 99735284, 99736655, 99729234, 99716395, 99708563, 99707299, 99704868, 99701643, 99704480, 99708033, 99697733, 99675858, 99660206, 99653220, 99644840, 99639881, 99644363, 99640870, 99620861, 99602848, 99600381, 99599826, 99582112, 99556285, 99538696, 99529701, 99523348, 99510819, 99489135, 99465799, 99444330, 99426484, 99415779, 99407476, 99390620, 99363726, 99337864, 99320120, 99308872, 99299639, 99288613, 99256575, 99185318, 99101561, 99034572, 98974431, 98909318, 98850238, 98809487, 98792940, 98804563, 98824322, 98827183, 98821634, 98817742, 98807466, 98800480, 98815399, 98830056, 98810530]
2875.9I8810530l6663k4110j2702j1754j5998j9657k3610k2250j3995j8496l4362l8689
2900.3I8538244l1287k7191l2634l4058j7989j1980m3929q3756r2352p6598n0217j8751
2924.8I8017502J5855M3589L6776K0855L2652M5639M3875M9365N8102L9846k909k6339
2949.3I8374808j7232j9359l3808k5469m870J0252J6642J8251K3132K5529L0660L8630
2973.8I8437166K9725K4486L3188K0688L52L248J4019K6536K9213N209r137j0056j9055
3000.3I8585582j8126j4091j0913J2439L9435K9450j2791m4882n0151m2057k9815k5314
3024.7I8418766l3700k9165q315K116j3590l5959k0075R871p189m8071n7626l6680
3049.2I8140383k4545l4929m1389l9315l6842k7090j5510q249k0176m9138n5057l0380
$$ y = [98810530, 98773867, 98749757, 98737055, 98725301, 98709303, 98689646, 98666036, 98643786, 98629791, 98611295, 98576933, 98538244, 98506957, 98479766, 98447132, 98413074, 98395085, 98383105, 98339176, 98255420, 98163068, 98086470, 98036253, 98017502, 98033357, 98076946, 98113722, 98134577, 98167229, 98212868, 98256743, 98306108, 98364210, 98404056, 98401147, 98374808, 98357576, 98338217, 98304409, 98278940, 98274070, 98284322, 98300964, 98319215, 98342347, 98367876, 98398536, 98437166, 98466891, 98491377, 98524565, 98545253, 98545605, 98548853, 98562872, 98589408, 98618621, 98623830, 98614693, 98604637, 98585582, 98567456, 98553365, 98542452, 98554891, 98594326, 98623776, 98610985, 98566103, 98515952, 98473895, 98444080, 98418766, 98385066, 98355901, 98347586, 98349702, 98336112, 98300153, 98280078, 98289949, 98282760, 98234689, 98177063, 98140383, 98115838, 98080909, 98039520, 98000205, 97963363, 97936273, 97920763, 97912514, 97892338, 97843200, 97788143, 97757763]
3073.7I7757763J824J4787j1307m1329m8143n5730n5844m4519n3912o4159m4536k2566
3098.2I7332329k9105n2727n4544k7275j5724m0131m7005j2529J413l0386p6789j07730
3122.6I6839797r5731n6648l8546n2363o4903n2953l0720l2330o8199r3961q3030o3157
3147.1I6107256m4089k7394n0009r9253j11729r1064p4202o9743p6455q5020q8668
3169.6I5289630q8090q5980q7583r1445r1052q9103r3287j00786j01477r9265j05161
3192I4256401j16926j23924j18274j07604j02961j03289j11908j22189j16760j07354
3212.4I3125212j07294j09941j15013j20854j23227j21939j16617j06126q4716p6520
3232.8I2042965j16372j56659j45865j18047r8735q1980q8859j21909j29944r9987
$$ y = [97757763, 97759587, 97774374, 97763067, 97721738, 97673595, 97617865, 97562021, 97517502, 97463590, 97399431, 97354895, 97332329, 97303224, 97250497, 97195953, 97168678, 97152954, 97112823, 97065818, 97053289, 97054702, 97024316, 96947527, 96839797, 96744066, 96687418, 96648872, 96596509, 96531606, 96478653, 96447933, 96415603, 96347404, 96253443, 96170413, 96107256, 96063167, 96035773, 95985764, 95886511, 95774782, 95683718, 95609516, 95539773, 95463318, 95378298, 95289630, 95201540, 95115560, 95027977, 94936532, 94845480, 94756377, 94663090, 94562304, 94460827, 94361562, 94256401, 94139475, 94015551, 93897277, 93789673, 93686712, 93583423, 93471515, 93349326, 93232566, 93125212, 93017918, 92907977, 92792964, 92672110, 92548883, 92426944, 92310327, 92204201, 92119485, 92042965, 91926593, 91769934, 91624069, 91506022, 91407287, 91325307, 91236448, 91114539, 90984595, 90884608]
3253.2I0884608p9250q9026r7149r2435q9747q1784o3800m8000o8706j08266j18756
3275.6H9947689j16355j09696r9629j04475j17356j15996r4176q2654j09905j54900
3296H8842547j79958j70511j33640j00595j22720j93143k43336k44897k21718k11644
3316.4H7020385k19071k19583k09558k10136k41196k73330k75301k64669k50477k36564
3336.8H4620500k55090k96641l16566l21257l12126k87884l05027l55518l65972l41309
3357.2H1463110l24100l30740l36510l04139k71517l02416l67284l77261l34364l01135
3377.6G8213644k83104k74044k64091k37101k03133j67936j71149k26801k35421j60652
3398G5990212j20759j87308k52562k25050j73241j55282j45649j41639j49608j40524
$$ y = [90884608, 90805358, 90716332, 90619183, 90526748, 90437001, 90355217, 90291417, 90243417, 90174711, 90066445, 89947689, 89831334, 89721638, 89622009, 89517534, 89400178, 89284182, 89190006, 89107352, 88997447, 88842547, 88662589, 88492078, 88358438, 88257843, 88135123, 87941980, 87698644, 87453747, 87232029, 87020385, 86801314, 86581731, 86372173, 86162037, 85920841, 85647511, 85372210, 85107541, 84857064, 84620500, 84365410, 84068769, 83752203, 83430946, 83118820, 82830936, 82525909, 82170391, 81804419, 81463110, 81139010, 80808270, 80471760, 80167621, 79896104, 79593688, 79226404, 78849143, 78514779, 78213644, 77930540, 77656496, 77392405, 77155304, 76952171, 76784235, 76613086, 76386285, 76150864, 75990212, 75869453, 75682145, 75429583, 75204533, 75031292, 74876010, 74730361, 74588722, 74439114, 74298590]
3418.4G4298590j16473r8997q2899n4031k1052j1969n049J2547m864m4065l6967J3763
3442.9G3848534N1957O6507Q0234R2959R5850J03093J24448J42908J43516J54525J94365
3465.3G5098896K12574J64944J03539J04779J48219J87093J93060J64175J59734J85883
3485.7G6722896J84739J68925J79792K00355K08270K01291J95718J98901J86175J70052
3506.1G8617114J81442K17897K53099K40445J97679J86593K08461K32166K22742J96660
3526.5H0754298K11591K51138K67094K65932K53183K34794K39987K55471K54679K40439
3546.9H3228606K33114K46489K72065K87354K81149K72513K62916K29716K11525K87771
3567.3H5813218L92515L89135L26121K99769L17496L50476L61877L28630K81299L02213
$$ y = [74298590, 74182117, 74083120, 74000221, 73946190, 73925138, 73913169, 73908120, 73920667, 73915803, 73871738, 73834771, 73848534, 73900491, 73966998, 74047232, 74140191, 74236041, 74339134, 74463582, 74606490, 74750006, 74904531, 75098896, 75311470, 75476414, 75579953, 75684732, 75832951, 76020044, 76213104, 76377279, 76537013, 76722896, 76907635, 77076560, 77256352, 77456707, 77664977, 77866268, 78061986, 78260887, 78447062, 78617114, 78798556, 79016453, 79269552, 79509997, 79707676, 79894269, 80102730, 80334896, 80557638, 80754298, 80965889, 81217027, 81484121, 81750053, 82003236, 82238030, 82478017, 82733488, 82988167, 83228606, 83461720, 83708209, 83980274, 84267628, 84548777, 84821290, 85084206, 85313922, 85525447, 85813218, 86205733, 86594868, 86920989, 87220758, 87538254, 87888730, 88250607, 88579237, 88860536, 89162749]
3587.7H9162749L79342L82298L55053L81339M04375L86996L69620L41582K89369K87783
3608.1I2740506L32135L45874L37022L08669L08794L79222L81989K65795J39886J57344
3628.5I5697236L37023L95149L27640K67738K24096J96195J61081P3403j0186P6038
3648.8I7745413K76953K90077J83905J73968K14141J67895Q7607K5010m6647p5632
3669.2I9042690j1993K969J0854J41793J96988J42109P4494N60m5204p773R1130J40184
3693.7I9778801R7770J8292k8103P7N1511J5837p8154r9468J7148J28305R3388K93
3718.2I9995697m9127m8542k4819R626J0014o1333j25474o4385Q6558J32042j615j56474
3742.7I9702168j18113K5147m852j5956J21600J45089N2977J5187L9756K2984k4390
$$ y = [89162749, 89542091, 89924389, 90279442, 90660781, 91065156, 91452152, 91821772, 92163354, 92452723, 92740506, 93072641, 93418515, 93755537, 94064206, 94373000, 94752222, 95134211, 95400006, 95539892, 95697236, 96034259, 96429408, 96757048, 97024786, 97248882, 97445077, 97606158, 97679561, 97669375, 97745413, 98022366, 98312443, 98496348, 98670316, 98884457, 99052352, 99139959, 99164969, 99118322, 99042690, 99030697, 99033666, 99044520, 99186313, 99383301, 99525410, 99599904, 99600464, 99555260, 99547487, 99638617, 99778801, 99876571, 99894863, 99866760, 99866837, 99918348, 99934185, 99856031, 99756563, 99773711, 99902016, 99995404, 99995697, 99946570, 99898028, 99873209, 99882835, 99892849, 99831516, 99706042, 99641657, 99728215, 99860257, 99858642, 99702168, 99584055, 99609202, 99604350, 99588394, 99709994, 99855083, 99908060, 99923247, 99963003, 99985987, 99961597]
3765.1I9961597l3468p701M6742O9809J7905l1102k3782Q607J2910J1909J7035Q810
3789.6A00059271j4258m7725p0000o5809p2462m1008L8261M0918N0861Q6242J9312
3812I9983603r0099j11508o0439l3528M4817J16342O9994l46m6050n2834l7062n4270
3836.5I9728620m2641L5506Q2010Q7220N5879n6362k07144k14010O0147K24256J28716
3858.9I9882197j0746p4256m7588l1364l5536L3044R4939O6012L880m3011k2554J3888
3883.4I9828905J3322K3984R096m321L0732J6045o3502j00202n1582L0995J05345J16217
3907.9I9955034O1167M220m0222o4408k8104K8747K8408K831J0640J0132j2350o20
3932.3I9955475L2348L9059J7500j4151k3937o294k176j865K0337K9564J5104N018
$$ y = [99961597, 99928129, 99920428, 99967170, 100036979, 100054884, 100023782, 100000000, 100008607, 100021517, 100033426, 100050461, 100059271, 100045013, 99997288, 99927288, 99861479, 99789017, 99748009, 99786270, 99827188, 99878049, 99964291, 99983603, 99893504, 99781996, 99721557, 99688029, 99732846, 99849188, 99919182, 99918836, 99872786, 99819952, 99782890, 99728620, 99685979, 99721485, 99803495, 99890715, 99946594, 99890232, 99683088, 99469078, 99529225, 99753481, 99882197, 99871451, 99797195, 99749607, 99718243, 99682707, 99715751, 99810690, 99876702, 99880582, 99837571, 99815017, 99828905, 99842227, 99866211, 99875307, 99870986, 99901718, 99917763, 99854261, 99754059, 99702477, 99733472, 99838817, 99955034, 100016201, 100020421, 99980199, 99915791, 99887687, 99916434, 99944842, 99947673, 99958313, 99968445, 99956095, 99955475, 99987823, 100026882, 100044382, 100030231, 100006294, 100000000, 99997824, 99995959, 100016296, 100045860, 100060964, 100065982]
3956.8A00065982O426O687K182J466L10k658N24Q655J8048J2612l123M041J9336R608
3985.4A00150096m422P27Q261N186m423j0729
3997.6A00144696
$$ y = [100065982, 100072408, 100079095, 100081277, 100082743, 100083053, 100080395, 100080919, 100089574, 100107622, 100120234, 100117111, 100121152, 100140488, 100150096, 100145674, 100146401, 100154662, 100159848, 100155425, 100144696]
##END=$$ End of the data block
