##TITLE=3 meg Kay $$ Begin of the data block
##JCAMP-DX=5.00 $$ ACD/SpecManager v 10.08
##SPECTROMETER/DATA SYSTEM=Alpha
##DATE=16 Oct 2013 13:51:24
##DATA TYPE=INFRARED SPECTRUM
##DATA CLASS=XYDATA
##ORIGIN=
##OWNER=
##NPOINTS=1765
##FIRSTX=399.75695801
##LASTX=3997.56933594
##MAXX=3997.56933594
##MINX=399.75695801
##MAXY=0.85289741
##MINY=0.38921747
##XFACTOR=1.0000000000
##YFACTOR=1.000000000000000e-9
##FIRSTY=0.61292565
##DELTAX=2.03957629
##XUNITS=1/CM
##YUNITS=ARBITRARY UNITS
##XYDATA=(X++(Y..Y))
399.8F12925649k932549k651989k465070q61108J065314K193451K271294J556993R8705
418.1F11200690j798331k168179j942039k132117k117455k030135j761376j133144
434.4E96117914q74162n64456Q73625K747417L552556L067314K098680J239538O66380
452.8F08924806L76284J2458j062096k033174k201438k092242k262831k534866k590179
471.1E94536722k831579k744495j848102r79900o52135l84986p5340q7381j15156j72436
491.5E84645212p72536j560509j676083j316786j358390j788318k280473k828598l053129
509.9E68010390k866149k757907l044367l462493l391207k540826j212538k61485j8656
528.3E48454762L72171J448214K852738L987908M320622L864288L103674K261638J241148
$$ plain form
399.8 612925649 609993100 607341111 604876041 604014933 605080247 607273698 609544992 611101985 611200690
418.1 611200690 609402359 607234180 605292141 603160024 601042569 599012434 597251058 596117914
434.4 596117914 595243752 594679296 595552921 598300338 601852894 604920208 607018888 608258426 608924806
452.8 608924806 609301090 609313548 608251452 606218278 604016840 601924598 599661767 597126901 594536722
471.1 594536722 591705143 588960648 587112546 586132646 585480511 585095525 585020185 584932804 584817648 584645212
491.5 584645212 583872676 582312167 580636084 579319298 577960908 576172590 573892117 571063519 568010390
509.9 568010390 565144241 562386334 559341967 555879474 552488267 549947441 548734903 548473418 548454762
528.3 548454762 548826933 550275147 553127885 557115793 561436415 565300703 568404377 570666015 571907163
546.6E71907163r5129j314104j885474j958668k088606k696336l555476m314542m767120
565E49231708m911303m747808m050911k647996n99563J638174L631353N031288N566478
583.3E48141420N430341M949510M157662L018975J526535K64585k23935j60157J40071
601.7E67245007L20911K02060J54316O29723J374066J939416K266645K457202K733707
620E79323053L257692L755212L746331L236592K475082J936675K017200K247035J912356
638.4F03907228J134455O56187Q48353J380623J675069J309931O32763N29289J018823
656.7F13092721J378476J190364O77705L08991L49402J270235J866758J473426J023055
675.1F22631133J002252J481712J855909J594603Q69692M36187N49614N99265J58906
$$ plain form
546.6 571907163 571812034 570497930 568612456 566653788 564565182 561868846 558313370 553998828 549231708
565 549231708 544320405 539572597 535521686 532873690 532274127 533912301 537543654 542574942 548141420
583.3 548141420 553571761 558521271 562678933 565697908 567224443 567489028 567265093 567104936 567245007
601.7 567245007 567565918 567767978 567922294 568552017 569926083 571865499 574132144 576589346 579323053
620 579323053 582580745 586335957 590082288 593318880 595793962 597730637 599747837 601994872 603907228
638.4 603907228 605041683 605697870 606546223 607926846 609601915 610911846 611544609 612073898 613092721
656.7 613092721 614471197 615661561 616339266 616648257 616997659 618267894 620134652 621608078 622631133
675.1 622631133 623633385 625115097 626971006 628565609 629435301 629871488 630421102 631020367 631179273
693.5F31179273o81341j624107k069831j814127j368463j103163p48097O1213J324356
711.8F23155713K712905L705979M004776M037202M396260M992842N259514M789054
728.1F57054245L830493K993107K619445K488434K086640J185536K7836q39532j364708
746.5F70081496j919925k688289l526747m063487l918111l139973k200842j323759
762.8F47300363j88649J553178L676772N559683O591975O675065O255865N805016N440175
781.2F88669443M882813M001855L079355K564371K604961K917350L083527L096997
797.5G14900672L161133L180265K983809K519607J843035J109660O19173M20273K18570
815.8G30956197j95682p72834j388848j954675k470076l019988l596127m092932m412055
$$ plain form
693.5 631179273 630497932 628873825 626803994 624989867 623621404 622518241 621770144 621831357 623155713
711.8 623155713 625868618 629574597 633579373 637616575 642012835 647005677 652265191 657054245
728.1 657054245 660884738 663877845 666497290 668985724 671072364 672257900 672285736 671446204 670081496
746.5 670081496 668161571 665473282 661946535 657883048 653964937 650824964 648624122 647300363
762.8 647300363 647111714 648664892 652341664 657901347 664493322 671168387 677424252 683229268 688669443
781.2 688669443 693552256 697554111 700633466 703197837 705802798 708720148 711803675 714900672
797.5 714900672 718061805 721242070 724225879 726745486 728588521 729698181 730317354 730737627 730956197
815.8 730956197 730760515 729987681 728598833 726644158 724174082 721154094 717557967 713465035 709052980
834.2G09052980m486799m248083l855765l506958l248692l045261k648055k081335
850.5F81932032j884639k219618k507746k001881j86086K686202N512596P323444P986366
868.9F96640670P885814P199585N673171L245890N79774j614869l158927m229247n155802
887.2G07066059n978763o314874n848348m975080m555405m860937n422235n770087
903.5F63340330n971610o372631p119834p986486q440853q121907p106066n720198
919.8F06500745m226387k732813j356304j99437O31392J046538J230777J551985K203882
938.2F04650378K972603L095985J683056j302719m861713p998287j0411144j2208879
954.5E75619280j3530373j4431060j4945805j5181243j5328348j5522986j5627385
$$ plain form
834.2 709052980 704566181 700318098 696462333 692955375 689706683 686661422 684013367 681932032
850.5 681932032 680047393 677827775 675320029 673318148 673132062 675818264 681330860 688654304 696640670
868.9 696640670 704526484 711726069 717399240 720645130 721224904 719610035 716451108 712221861 707066059
887.2 707066059 701087296 694772422 688924074 683948994 679393589 674532652 669110417 663340330
903.5 663340330 657368720 650996089 643876255 635889769 627448916 619327009 612220943 606500745
919.8 606500745 602274358 599541545 598185241 597985804 598617196 599663734 600894511 602446496 604650378
938.2 604650378 607622981 610718966 612402022 611099303 606237590 598239303 587828159 575619280
954.5 575619280 562088907 547657847 532712042 517530799 502202451 486679465 471052080
968.8D71052080j5345811j4565766j3364315j1822701r934872p664353n194545k901762
985.1C90257955j040489K93076J131356J634985J960158K126843K104253J883805J470834
1003.5D01822776R26643M09037N7161j41233j70380M1514M65096J008749J597285K090066
1023.9D08106714K385080K551198K634913K589434K337933J842290J237542Q10265
1040.2D24495369P28876Q93265J070976J224846J534134K157837L113419M156410N080313
1058.5D44455445N949497O762505P144987O202519K998322j923859o110340p356614
1074.8D58122462n738765k948463m68880J209051K346843L249764M003168M503429
1091.2D64278609M440695L779322K856850J972020J285195Q63671P57784J066536J764744
$$ plain form
968.8 471052080 455706269 441140503 427776188 415953487 406018615 398354262 393159717 390257955
985.1 390257955 389217466 389510542 390641898 392276883 394237041 396363884 398468137 400351942 401822776
1003.5 401822776 402749419 403158456 403215617 403074384 402904004 402945518 403410614 404419363 406016648 408106714
1023.9 408106714 410491794 413042992 415677905 418267339 420605272 422447562 423685104 424495369
1040.2 424495369 425224245 426117510 427188486 428413332 429947466 432105303 435218722 439375132 444455445
1058.5 444455445 450404942 457167447 464312434 470514953 473513275 471589416 465479076 458122462
1074.8 458122462 452383697 449435234 448966354 450175405 452522248 455772012 459775180 464278609
1091.2 464278609 468719304 472498626 475355476 477327496 478612691 479476362 480234146 481300682 483065426
1109.5D83065426K588600L158659L229797K844691K322763K068907K176106K433539
1125.8E03888488K726793L079593L217876K670288J290024p48337k989471m743516
1142.2E08391738n545616n515903n116880m618824l980905l094703j934915p07120
1158.5D77876872L08096J172513K207696L573388N166322O786079Q188575R265363
1174.8E14544904J0116995J0834097J1275411J1134565J0358632R231329Q067905O909967
1191.1E92473805N555749L952563K428472J477599J286685J547993J873076K183079
1207.4F12779021K606750L192544L753781L936410L492534K553702J534104P60198
1223.7F34609044J94013m20630j120210j623571j666069j311481r08554p01248n43237
$$ plain form
1109.5 483065426 485654026 488812685 492042482 494887173 497209936 499278843 501454949 503888488
1125.8 503888488 506615281 509694874 512912750 515583038 516873062 516124725 513135254 508391738
1142.2 508391738 502846122 497330219 492213339 487594515 483613610 480518907 478583992 477876872
1158.5 477876872 478184968 479357481 481565177 485138565 490304887 497090966 505279541 514544904
1174.8 514544904 524661899 535495996 546771407 557905972 568264604 577495933 585563838 592473805
1191.1 592473805 598029554 601982117 604410589 605888188 607174873 608722866 610595942 612779021
1207.4 612779021 615385771 618578315 622332096 626268506 629761040 632314742 633848846 634609044
1223.7 634609044 634803057 634382427 633262217 631638646 629972577 628661096 627752542 627051294 626508057
1242.1F26508057j19686O93738J609564K129078K094448J809478J667022J717925J711548
1260.4F39821172J519799J309991J302957J484633J604378J385987Q51452L33846N1916
1278.8F49666131k9207m6730r9182k03311l30925m14610n19395p89046j124859j248718
1299.2F44860148j068651p58350n61536o09755q01086r64582j061142j101613j180828
1317.6F36752605j449763j803816k091884k411485k797663l074646l049553k660751
1333.9F17413044k022266j407087j043797p86781m78149k90453l13580m94242p27832
1352.2F09848857r31859j110196j174152j133382j256884j436770j309752j009703
1368.5F00486159o03437j96815j09613j75595p2241K0325J97113Q19802J477242J432478
$$ plain form
1242.1 626508057 626388371 627082109 628691673 630820751 632915199 634724677 636391699 638109624 639821172
1260.4 639821172 641340971 642650962 643953919 645438552 647042930 648428917 649280369 649614215 649666131
1278.8 649666131 649636924 649590194 649491012 649287701 648956776 648542166 648022771 647233725 646108866 644860148
1299.2 644860148 643791497 643033147 642471611 641861856 641060770 640096188 639035046 637933433 636752605
1317.6 636752605 635302842 633499026 631407142 628995657 626197994 623123348 620073795 617413044
1333.9 617413044 615390778 613983691 612939894 612153113 611674964 611384511 611070931 610576689 609848857
1352.2 609848857 608916998 607806802 606632650 605499268 604242384 602805614 601495862 600486159
1368.5 600486159 599882722 599685907 599576294 599400699 599328458 599348783 599545896 600365698 601842940 603275418
1388.9F03275418J085520Q91745M44174j51515n58257p22587o52969p23720r11116
1407.3F01976693r29475q69930o96599k79904N3466j42873k69234R0301M05610O18994
1427.7E99957049O59287O00755Q67248J126110P58648M47989O55114Q36790Q15332
1446F06724322L84152k95103n81443l61622l95059j123548q88645K75790J421273K424956
1466.4F07585073L764092N756140P622719P365584O259859N978346N954385N615711
1482.8F55901909M926979M504085M247904L757059L320635L433287L314078K340734
1499.1F85746670J783550K096235K658904J721859l09110n19216J69933Q00490J079858
1517.4F95229173J168072J088619N95987L22461J37806Q4460L85165K78652J75655
$$ plain form
1388.9 603275418 604360938 605252683 605696857 605545342 604987085 604264498 603611529 602887809 601976693
1407.3 601976693 601047218 600177288 599480689 599200785 599254251 599111378 598842144 598932445 599338055 599957049
1427.7 599957049 600616336 601217091 602084339 603210449 603969097 604417086 605072200 605908990 606724322
1446 606724322 607108474 606813371 606231928 605870306 605475247 604351699 603463054 603738844 605160117 607585073
1466.4 607585073 611349165 617105305 624728024 632093608 638353467 644331813 650286198 655901909
1482.8 655901909 660828888 665332973 669580877 673337936 676658571 680091858 683405936 685746670
1499.1 685746670 687530220 689626455 692285359 694007218 693698108 693178892 693348825 694149315 695229173
1517.4 695229173 696397245 697485864 698081851 698404312 698542118 698626578 699011743 699290395 699466050
1535.8F99466050Q53955R36687o30498j420259j207471p51316m99249m97281l38316
1554.1F95912302J42395j80483k456069k752900j869261j421690j282990j649618j553476
1572.5F82888210j151443j679420k026677j468182j142979j188457j376032j514614
1588.8F71340406j528084j442314j547336j910806k236187k426207k579391k769769
1605.1F54900312l085494l568410l765464l391862l313005m051507l757775l039181
1621.4F26927614l318131l574013l545523l574312k938211k148092k330005k287566
1637.8F03211761j111627J71244J322568K238869K311051K214491L283859L641844
1654.1F17284060K290725K584279L733694M467726M419208M260838M931628N284906
$$ plain form
1535.8 699466050 700320005 701256692 700626194 699205935 697998464 697247148 696747899 696250618 695912302
1554.1 695912302 696054697 695874214 693418145 690665245 688795984 687374294 686091304 684441686 682888210
1572.5 682888210 681736767 680057347 678030670 676562488 675419509 674231052 672855020 671340406
1588.8 671340406 669812322 668370008 666822672 664911866 662675679 660249472 657670081 654900312
1605.1 654900312 651814818 648246408 644480944 641089082 637776077 633724570 629966795 626927614
1621.4 626927614 623609483 620035470 616489947 612915635 609977424 607829332 605499327 603211761
1637.8 603211761 602100134 602271378 603593946 605832815 608143866 610358357 613642216 617284060
1654.1 617284060 619574785 622159064 625892758 630360484 634779692 639040530 643972158 649257064
1670.4F49257064M706085M915058N130291M752100N017996N882203O230593M773199
1686.7F90664589M198194M766405N084991N981863O352782N610943M885018L421545
1703G30966330K832412K718747K360463K494693K876460L171921K992571J988172J391173
1721.4G53792942J397311J307905J220107J378059J507104J118541R4056P6830Q12948
1739.7G62705803J345396J856804K546251L257692L686964L553331L252804L306568
1756.1G85511613L196478K890646K647102K171457K060533K188205K053142J599908
1772.4H04319084R56833Q01981J029372J064598R45926R15349Q90731J061201J311362
1790.7H13296437R90570M39167N36859Q50320Q27193N62310M83692O62386Q17001P52926
$$ plain form
1670.4 649257064 653963149 658878207 664008498 668760598 673778594 679660797 685891390 690664589
1686.7 690664589 694862783 699629188 704714179 710696042 717048824 722659767 727544785 730966330
1703 730966330 733798742 736517489 738877952 741372645 744249105 747421026 750413597 752401769 753792942
1721.4 753792942 755190253 756498158 757718265 759096324 760603428 761721969 761816025 761892855 762705803
1739.7 762705803 764051199 765908003 768454254 771711946 775398910 778952241 782205045 785511613
1756.1 785511613 788708091 791598737 794245839 796417296 798477829 800666034 802719176 804319084
1772.4 804319084 805275917 806077898 807107270 808171868 809117794 810033143 810923874 811985075 813296437
1790.7 813296437 814287007 814726174 815263033 816113353 816940546 817502856 817986548 818648934 819465935 820218861
1811.1H20218861N43952M91500N26905N30899O66141Q83937Q28624O11245M43995J75357
1831.5H25921416J87457M22001M23968L62217N63562O55889K71678j3113q940M3273
1851.9H28829408J63257L35276L91364K67684J26422K20895N50270O26445J43587k13265
1872.3H31441343p3016J90318L70204M06087L11494K22027L12388M59254L66270J98901
1892.7H34205270J09792R596M6670K36750L07679K11954J21236R5248J09136J91808
1913.1H35645139L21627K63572J2695l218J40130J19210N2809N722k265Q6725J93417
1935.5H36835563K40863K11000J25587J4007L2604J48654J48475N9962N2274J50620
1955.9H38019609K21432J97112J04785O0141J10567J64807J62661Q7440j5736l0458
$$ plain form
1811.1 820218861 820762813 821254313 821781218 822312117 822978258 823862195 824690819 825302064 825746059 825921416
1831.5 825921416 826108873 826530874 826954842 827317059 827880621 828536510 828808188 828795075 828786135 828829408
1851.9 828829408 828992665 829327941 829719305 829986989 830113411 830334306 830884576 831511021 831654608 831441343
1872.3 831441343 831368327 831558645 831928849 832334936 832646430 832868457 833180845 833640099 834006369 834205270
1892.7 834205270 834315062 834324658 834371328 834608078 834915757 835127711 835248947 835344195 835453331 835645139
1913.1 835645139 835966766 836230338 836243033 836239815 836379945 836499155 836551964 836557686 836555421 836642146 836835563
1935.5 836835563 837076426 837287426 837413013 837427020 837459624 837608278 837756753 837816715 837868989 838019609
1955.9 838019609 838241041 838438153 838542938 838603079 838713646 838878453 839041114 839128554 839112818 839082360
1976.3H39082360P1466J65701J65224P2301j2160K5034J33097J35839J7941r6857j37210
1998.8H39622736m3571O4075L0756r6142k01881k08497j13309l6895j07765k87473
2019.2H38622034l81649k78234j49012j62602k72512l57509l37720k26676j30892j19149
2039.6H36206079j76967k61247k39849r4116J8299m411r2387q4400O4850J86562J47403
2062H35669816L8802k3484K6822J56343J98364R8944k7835l9697J05083K10702J43349
2084.4H36557209L7551K5094J24276K33411K23518R0539j8298M0710K13861K92957
2104.8H37820828J80662K6166J4901J22428J77443J39594N4241l4333J014J28269J44541
2127.3H38775754L8803n3704m4942O9201J50025R0599k4438l3021Q5354J59859J01805
$$ plain form
1976.3 839082360 839153826 839319527 839484751 839557052 839544892 839569926 839703023 839838862 839856803 839759946 839622736
1998.8 839622736 839579165 839643240 839673996 839577854 839375973 839167476 839054167 839017272 838909507 838622034
2019.2 838622034 838240385 837962151 837813139 837650537 837378025 837020516 836682796 836456120 836325228 836206079
2039.6 836206079 836029112 835767865 835528016 835433900 835452199 835447788 835355401 835271001 835335851 835522413 835669816
2062 835669816 835708618 835685134 835711956 835868299 836066663 836165607 836137772 836098075 836203158 836413860 836557209
2084.4 836557209 836594760 836619854 836744130 836977541 837201059 837291598 837273300 837314010 837527871 837820828
2104.8 837820828 838001490 838027656 838042557 838164985 838342428 838482022 838536263 838501930 838502944 838631213 838775754
2127.3 838775754 838814557 838760853 838715911 838785112 838935137 839025736 839001298 838968277 839053631 839213490 839315295
2149.7H39315295P570K98J10805K40028K55823J78516J49369K09630K83122L32355
2170.1H41082811L42191K98142K76208L31581M01318L93986L17574K74181K95163L31401
2190.5H44344556L32892K97010K74420K74122K78950L06665L18528K82645K58922K78891
2210.9H47247601L08990L10540K78831K34127J94728J73032K00153K50339K34247J79052
2231.3H49611640J44541J45078J75059J85251J33574M9651N9426J74462K13445J29520
2251.7H51021647N1320M3094R1732J66952J63377K9981o7890L8922K65837L46780J85787
2274.1H52337539M053N067J48117K43545J59085k9028j33395o9141Q2612J27554l6240
2296.5H52839768k28524k28048p1585J79j23799l17216l94523k53677m8876o5923l38375
$$ plain form
2149.7 839315295 839322865 839323163 839433968 839673996 839929819 840108335 840257704 840467334 840750456 841082811
2170.1 841082811 841425002 841723144 841999352 842330933 842732251 843126237 843443811 843717992 844013155 844344556
2190.5 844344556 844677448 844974458 845248878 845523000 845801950 846108615 846427143 846709788 846968710 847247601
2210.9 847247601 847556591 847867131 848145962 848380089 848574817 848747849 848948002 849198341 849432588 849611640
2231.3 849611640 849756181 849901259 850076318 850261569 850395143 850444794 850504220 850678682 850892127 851021647
2251.7 851021647 851072967 851116061 851207793 851374745 851538122 851568103 851500213 851539135 851804972 852151752 852337539
2274.1 852337539 852341592 852346659 852494776 852738321 852897406 852868378 852734983 852665842 852748454 852876008 852839768
2296.5 852839768 852611244 852383196 852311611 852311790 852187991 851870775 851476252 851222575 851173699 851107776 850769401
2319H50769401n85735n31554k66791j04606j74642l77118m49836l28124j41859k1219
2339.4H47787917j07348j70827J95324M76539O2764o71208j152992j087785p05659
2357.7H44626725l10958J550J98960K46704L03686N18322O85274N85437L36945K61724
2378.1H47454369M08471M92990L43799J4901k49266k57313r9302q940j27614l64780
2398.5H47607315m75645l32118j16050r1493k94924n08547m99188l05295j90080k89857
2418.9H44504118m81963n72324m59075k75433k69532m63367o43372o18160m25696k91169
2439.3H40004027l86298o06060o82831n33461l44813l48806n42403o57320n59628l88622
2459.7H34953785l24428m32551n67555n76675m59671l20018l19838m68433n81384n30481
$$ plain form
2319 850769401 850183666 849652112 849385321 849280715 849106073 848728955 848279119 847950995 847809136 847787917
2339.4 847787917 847680569 847509742 847705066 848181605 848244369 847573161 846420169 845332384 844626725
2357.7 844626725 844315767 844317317 844516277 844762981 845066667 845584989 846270263 846855700 847192645 847454369
2378.1 847454369 847862840 848355830 848699629 848714530 848465264 848207951 848108649 848099709 847972095 847607315
2398.5 847607315 847131670 846799552 846683502 846592009 846297085 845788538 845289350 844984055 844793975 844504118
2418.9 844504118 844022155 843449831 842990756 842715323 842445791 841982424 841339052 840720892 840295196 840004027
2439.3 840004027 839617729 839011669 838328838 837795377 837450564 837101758 836559355 835902035 835342407 834953785
2459.7 834953785 834629357 834196806 833629251 833052576 832592905 832272887 831953049 831484616 830903232 830372751
2480.1H30372751l58939k32757l08871m85062n13912l67105k04801j86563l33369m67062
2500.5H26914310m43697l04877k05338k70188m17173m54664l53217k58148k80142l84271
2520.9H23542595n04553n33402m16875l22938l83795n14984n98132n63801m43637l98576
2541.3H18861902n01991o22212o41644n54085m29273m12941n35369o12616n48959m48525
2561.7H13554287m21703m89890n71132n85139n22912m27484m15266n21659o03140n62072
2582.1H08433890m32431l19779l52264m70638m91083m19497l68536l81589m63008n51761
2602.5H04183304n33759m41134m32134n31793o48200p01368o59645o07430o57678q05557
2622.9G98164606r25660q95679p94292q19683r60946j044869j011849r01162q46505
$$ plain form
2480.1 830372751 830013812 829781055 829472184 828987122 828473210 828106105 827901304 827714741 827381372 826914310
2500.5 826914310 826470613 826165736 825960398 825690210 825273037 824818373 824465156 824207008 823926866 823542595
2520.9 823542595 823038042 822504640 822087765 821764827 821381032 820866048 820267916 819704115 819260478 818861902
2541.3 818861902 818359911 817737699 817096055 816541970 816112697 815699756 815164387 814551771 814002812 813554287
2561.7 813554287 813132584 812642694 812071562 811486423 810963511 810536027 810120761 809599102 808995962 808433890
2582.1 808433890 808001459 807681680 807329416 806858778 806367695 805948198 805579662 805198073 804735065 804183304
2602.5 804183304 803649545 803208411 802776277 802244484 801596284 800894916 800235271 799627841 798970163 798164606
2622.9 798164606 797238946 796343267 795548975 794729292 793768346 792723477 791711628 790810466 789963961
2641.2G89963961r31025j011252j011730r73403r10938q79943r16481r62079r46879
2659.6G81420231q76844q07881q20578r08076r22323q15570p26998p51138q01682p90179
2680G73198962p46190o99103o61612o79195p36773p41064o97077o92665p51197q15690
2700.4G65978396q45671q19146p57218p60197q34108q88347q62122p70271p18295p52628
2720.8G57970393q09253q11874p60317p15971o94514o81996o82890o79970o38783o04034
2741.2G50890791o22630o33597o12855n73158n19574n45263o30617o20246n15342m52876
2761.6G45164633n02706n81205n96761n65172n31196n37396o23345p47204q07702p92444
2782G38879502p57873p69615q78573j017272j067460j030445j020789j108587j252949
$$ plain form
2641.2 789963961 789032936 788021684 787009954 786036551 785125613 784245670 783329189 782367110 781420231
2659.6 781420231 780543387 779735506 778914928 778006852 777084529 776268959 775541961 774790823 773989141 773198962
2680 773198962 772452772 771753669 771092057 770412862 769676089 768935025 768237948 767545283 766794086 765978396
2700.4 765978396 765132725 764313579 763556361 762796164 761962056 761073709 760211587 759441316 758723021 757970393
2720.8 757970393 757161140 756349266 755588949 754872978 754178464 753496468 752813578 752133608 751494825 750890791
2741.2 750890791 750268161 749634564 749021709 748448551 747928977 747383714 746753097 746132851 745617509 745164633
2761.6 745164633 744661927 744080722 743483961 742918789 742387593 741850197 741226852 740479648 739671946 738879502
2782 738879502 738121629 737352014 736473441 735456169 734388709 733358264 732337475 731228888 729975939
2800.3G29975939j340687j320482j294613j356363j503348j640559j649439j609683
2816.6G18260765j669407j807868j936198j998424k010524k073527k242625k437651
2832.9G02084541k571642k698124k952456l400624m016101m709721n231142n250931
2849.3F71253800m673004l691375k555549j486480p79152o44327j024603j698733k397477
2867.6F52303100k863825k982497k891719k809823k748847k606988k382695k107919
2883.9F30908787j836300j672625j567185j401186j220107j126230j185059j373351
2900.2F19526744j600683j859128k208770k670824l250718l949821m606426m919529
2916.6E94460845m727244m092992l160655k036512p63953N28276J685083K726078L648460
$$ plain form
2800.3 729975939 728635252 727314770 726020157 724663794 723160446 721519887 719870448 718260765
2816.6 718260765 716591358 714783490 712847292 710848868 708838344 706764817 704522192 702084541
2832.9 702084541 699512899 696814775 693862319 690461695 686445594 681735873 676504731 671253800
2849.3 671253800 666580796 662889421 660333872 658847392 658068240 657423913 656399310 654700577 652303100
2867.6 652303100 649439275 646456778 643565059 640755236 638006389 635399401 633016706 630908787
2883.9 630908787 629072487 627399862 625832677 624431491 623211384 622085154 620900095 619526744
2900.2 619526744 617926061 616066933 613858163 611187339 607936621 603986800 599380374 594460845
2916.6 594460845 589733601 585640609 582479954 580443442 579679489 580207765 581892848 584618926 588267386
2934.9E88267386M334986M787386N106747N212784M965841M454315L958285L656626
2951.2F24744356L470361L347933L366351L525019L764331M030705M224539M256069
2967.6F54729664M153788M052461L974199L799319L528834L186643K794921K491534
2983.9F82711363K296567K074837J775563J389146R33111N66244K76148r7275m89830
3002.2F91435874p83206r48011q99733o98864o52313q04067q87751q64268q93712j034975
3022.6F82968974j282871j537561j604259j531422j561582j768947j983464j993835
3038.9F69705033j887500j900077k026439k130627k141059k110242k085031k058088
3055.3F53365970k105534k182365k126157j984537j896560j948237k112389k168000
$$ plain form
2934.9 588267386 592602372 597389758 602496505 607709289 612675130 617129445 621087730 624744356
2951.2 624744356 628214717 631562650 634929001 638454020 642218351 646249056 650473595 654729664
2967.6 654729664 658883452 662935913 666910112 670709431 674238265 677424908 680219829 682711363
2983.9 682711363 685007930 687082767 688858330 690247476 691180587 691746831 692022979 691925704 691435874
3002.2 691435874 690652668 689704657 688804924 688106060 687453747 686649680 685761929 684897661 684003949 682968974
3022.6 682968974 681686103 680148542 678544283 677012861 675451279 673682332 671698868 669705033
3038.9 669705033 667817533 665917456 663891017 661760390 659619331 657509089 655424058 653365970
3055.3 653365970 651260436 649078071 646951914 644967377 643070817 641122580 639010191 636842191
3071.6F36842191k010166j781524j719057j897693k072990k085686k038896j984059
3087.9F21252120j944244j982332k018511j948416j822531j794935j907408j972198
3104.2F05861545j882553j798034j865328j872658j723230j718700j856268j952827
3120.5E91191947k023398k012253j927316j880765j885593j883269j798570j677751
3136.8E76103032j683712j840830j950145j885951j755476j651465j616657j733899
3153.2E61984897j885712j840532j721859j698971j701176j673460j644969j664639
3169.5E48153579j682639j651764j618624j607835j582980j556694j583636j593232
3185.8E35276175j513541j449108j477659j527011j546145j523375j461208j403451
$$ plain form
3071.6 636842191 634832025 633050501 631331444 629433751 627360761 625275075 623236179 621252120
3087.9 621252120 619307876 617325544 615307033 613358617 611536086 609741151 607833743 605861545
3104.2 605861545 603978992 602180958 600315630 598442972 596719742 595001042 593144774 591191947
3120.5 591191947 589168549 587156296 585228980 583348215 581462622 579579353 577780783 576103032
3136.8 576103032 574419320 572578490 570628345 568742394 566986918 565335453 563718796 561984897
3153.2 561984897 560099185 558258653 556536794 554837823 553136647 551463187 549818218 548153579
3169.5 548153579 546470940 544819176 543200552 541592717 540009737 538453043 536869407 535276175
3185.8 535276175 533762634 532313526 530835867 529308856 527762711 526239336 524778128 523374677
3202.1E23374677j393080j399398j395464j388073j362204j320839j263619j265645
3218.4E12586355j337409j313805j223624j220107j244009j191795j138985j221657
3234.7E02694964j335740j321196j266271j188606j069516j059353j161278j179784
3251.1D93113220j088649j045257j071155j068950j056850j049548r78709q75920p96079
3269.4D84082103q56459j033068j062125r63807q98719r04709r36538r21339q87245
3287.8D75618094q28773p96705q87305j016497j068205j005441q59260p36237q01951
3306.1D67617720j041561j214683j256108j235396j204431j212746j226574j209080
3322.4D58017141j230061j377434j496851j447082j398712j401633j376093j442879
$$ plain form
3202.1 523374677 521981597 520582199 519186735 517798662 516436458 515115619 513852000 512586355
3218.4 512586355 511248946 509935141 508711517 507491410 506247401 505055606 503916621 502694964
3234.7 502694964 501359224 500038028 498771757 497583151 496513635 495454282 494293004 493113220
3251.1 493113220 492024571 490979314 489908159 488839209 487782359 486732811 485754102 484878182 484082103
3269.4 484082103 483225644 482192576 481130451 480166644 479267925 478363216 477426678 476505339 475618094
3287.8 475618094 474789321 473992616 473105311 472088814 471020609 470015168 469155908 468419671 467617720
3306.1 467617720 466576159 465361476 464105368 462869972 461665541 460452795 459226221 458017141
3322.4 458017141 456787080 455409646 453912795 452465713 451067001 449665368 448289275 446846396
3338.8D46846396j588702j650423j669675j624585j516163j595199j829028j900643
3355.1D33471978j760781j657635j720101j740545j572668j463890j622439j900673
3371.4D20033246j976490j778543j593113j535892j503140j428336j311332j124859
3387.7D07781541r02652r52602j285493j328051r13382o57827r46521j276583j128137
3406.1C98390293q29995p27295o99699p15167p42048o32494m85778m26173l27468j32531
3426.5C92671645L5196J5348J2368J86295J67608o0290k4080K70813M83573N35041
3446.8C94293517M99040N27382O50137P65622Q74728R85950R34512Q92043J166999
3465.2D01589930J380503J132846P40141O98447R27389J187473J289457J103193J038492
$$ plain form
3338.8 446846396 445257694 443607271 441937596 440313011 438796848 437201649 435372621 433471978
3355.1 433471978 431711197 430053562 428333461 426592916 425020248 423556358 421933919 420033246
3371.4 420033246 418056756 416278213 414685100 413149208 411646068 410217732 408906400 407781541
3387.7 407781541 406878889 405926287 404640794 403312743 402399361 401741534 400795013 399518430 398390293
3406.1 398390293 397560298 396833003 396133304 395418137 394676089 394043595 393557817 393131644 392804176 392671645
3426.5 392671645 392706841 392722189 392734557 392920852 393088460 393028170 393004090 393274903 393758476 394293517
3446.8 394293517 394792557 395319939 395970076 396735698 397610426 398596376 399530888 400422931 401589930
3465.2 401589930 402970433 404103279 404843420 405541867 406469256 407656729 408946186 410049379 411087871
3483.6D11087871J255899J265556J107216J171469J308710J393258J423210J407087
3499.9D21420276J372636J190662J037210J147211J376152J589268J586318J375497
3516.2D32095230J336097J532615J766294J723528J450985J380921J535654J742184
3532.5D44563508J942396J944095J795650J901626K176553K203137J900643J741231
3548.8D60168839J904994K049416K148271K326220K496391K561748K596051K683073
3565.1D78935003K787918K768755K682150K732098K943545L164381L340512L510297
3581.5E02864659L670573L671944L454149L384590L499508L623366L758431L896952
3597.8E31824172L945291L922700L970504M028261M099309M121483M050970M048526
$$ plain form
3483.6 411087871 412343770 413609326 414716542 415888011 417196721 418589979 420013189 421420276
3499.9 421420276 422792912 423983574 425020784 426167995 427544147 429133415 430719733 432095230
3516.2 432095230 433431327 434963942 436730236 438453764 439904749 441285670 442821324 444563508
3532.5 444563508 446505904 448449999 450245649 452147275 454323828 456526965 458427608 460168839
3548.8 460168839 462073833 464123249 466271520 468597740 471094131 473655879 476251930 478935003
3565.1 478935003 481722921 484491676 487173826 489905924 492849469 496013850 499354362 502864659
3581.5 502864659 506535232 510207176 513661325 517045915 520545423 524168789 527927220 531824172
3597.8 531824172 535769463 539692163 543662667 547690928 551790237 555911720 559962690 564011216
3614.1E64011216M058778M059136M015446L807306L761709L875613L937781L812969
3630.4E95339954L557026L539086L591358L577710L614008L722787L863692L956437
3646.7F24762058L821492L272772K789140K807081L086865L096819K871573K769410
3663F49277210K940893L135205L034413K816140K626121K297938J943648J913488K104640
3681.4F72089696K334475K565623K678513K166331J409292J356066J655936J830280
3697.7F88086212J778662J543820J444578J652300J881540J807988J366973J076042
3714G00638115J120270J247525J311243J245796J094461R62615J131951J536370J766503
3732.4G12054849J431405Q10445P28249J059651J137317R40203R81510R92656N69522
$$ plain form
3614.1 564011216 568069994 572129130 576144576 579951882 583713591 587589204 591526985 595339954
3630.4 595339954 598896980 602436066 606027424 609605134 613219142 616941929 620805621 624762058
3646.7 624762058 628583550 631856322 634645462 637452543 640539408 643636227 646507800 649277210
3663 649277210 652218103 655353308 658387721 661203861 663829982 666127920 668071568 669985056 672089696
3681.4 672089696 674424171 676989794 679668307 681834638 683243930 684599996 686255932 688086212
3697.7 688086212 689864874 691408694 692853272 694505572 696387112 698195100 699562073 700638115
3714 700638115 701758385 703005910 704317153 705562949 706657410 707620025 708751976 710288346 712054849
3732.4 712054849 713486254 714296699 715024948 716084599 717221916 718162119 719143629 720136285 720705807
3750.7G20705807L17991O58393Q75890P16865N95689P18832Q86262R26077P33673M62771
3771.1G27598250M76360P51972R91643R17554O26802N12243N48899N79834O34968P21097
3791.5G34359622Q02100Q83162R40799P97928N30064M38988L66092K53737L87251P03812
3811.9G40463555Q33094P25031P41482O31809K75373K35975L76701M53890N52773O83368
3832.3G45973051Q20994P12573L27707J20044J27911J97709M08828P71999R88603N40257
3852.7G50989676j54377l6478K66612M32611M91082M69744M66705L71039K32935J67668
3873.1G53697217J94549L67284N02944M67002L65258K11000J39534K49386K46704J43349
3893.5G56584227L05057O06715O60301L89456n7399k90573j10983J63734L55124M13120
$$ plain form
3750.7 720705807 721023798 721682191 722558081 723274946 723870635 724589467 725475729 726401806 727135479 727598250
3771.1 727598250 728074610 728826582 729818225 730735779 731362581 731874824 732423723 733003557 733638525 734359622
3791.5 734359622 735161722 736044884 736985683 737783611 738313675 738752663 739118755 739372492 739759743 740463555
3811.9 740463555 741296649 742021680 742763162 743394971 743670344 743906319 744283020 744736910 745289683 745973051
3832.3 745973051 746794045 747506618 747834325 747954369 748082280 748279989 748688817 749460816 750449419 750989676
3852.7 750989676 750835299 750798821 751065433 751498044 751989126 752458870 752925575 753296614 753529549 753697217
3873.1 753697217 753891766 754259050 754761994 755228996 755594254 755805254 755944788 756194174 756440878 756584227
3893.5 756584227 756889284 757495999 758156300 758545756 758488357 758197784 758086801 758250535 758605659 759018779
3913.9G59018779L12805J63496J18970J84238K20061J62720J76490K36928J43111L7193
3934.3G60774791Q8394K17736K93433K39671J65522J81555J95086J23501N2870R0718
3954.7G62423277J94073K29537J65165J07526J42634K24829K60711K08556J18733O0379
3975.1G64135420N0903J17123K26259K84255K13444Q6486R6798J86920J86324J17243
3995.5G65701175N8591
3997.5G65759766
$$ plain form
3913.9 759018779 759331584 759495080 759614050 759798288 760018349 760181069 760357559 760594487 760737598 760774791
3934.3 760774791 760863185 761080921 761374354 761614025 761779547 761961102 762156188 762279689 762332559 762423277
3954.7 762423277 762617350 762846887 763012052 763119578 763262212 763487041 763747752 763956308 764075041 764135420
3975.1 764135420 764186323 764303446 764529705 764813960 765027404 765113890 765210688 765397608 765583932 765701175
3995.5 765701175 765759766
3997.5 765759766
##END=$$ End of the data block
