##TITLE=3 meg Kay $$ Begin of the data block
##JCAMP-DX=5.00 $$ ACD/SpecManager v 10.08
##SPECTROMETER/DATA SYSTEM=Alpha
##DATE=16 Oct 2013 13:51:24
##DATA TYPE=INFRARED SPECTRUM
##DATA CLASS=XYDATA
##ORIGIN=
##OWNER=
##NPOINTS=1765
##FIRSTX=399.75695801
##LASTX=3997.56933594
##MAXX=3997.56933594
##MINX=399.75695801
##MAXY=0.85327435
##MINY=0.38902861
##XFACTOR=1.0000000000
##YFACTOR=1.000000000000000e-9
##FIRSTY=0.61031979
##DELTAX=2.03957629
##XUNITS=1/CM
##YUNITS=ARBITRARY UNITS
##XYDATA=(X++(Y..Y))
$$ plain form
399.8 610319793 607283473 605099976 603317857 602526248 603192985 604920626 606766880 608105779 608213961
418.1 608213961 606564879 604675353 603135526 601294398 599096715 596977651 595295727 594272316
434.4 594272316 593761444 593515098 594395041 597111940 600613236 603451908 605205595 606261790 607044101
452.8 607044101 607649326 607702613 606553972 604600847 602571368 600428402 597981870 595451295 592918456
471.1 592918456 590101182 587478876 585845888 585044801 584453642 584011734 583815455 583632350 583379447
489.5 583379447 582953691 582062483 580760181 579408109 578094959 576559603 574688196 572552621 570011914
507.9 570011914 567065895 564187765 561544180 558534563 554978311 551675260 549300551 548058152
524.2 548058152 547686696 547599971 547945559 549474537 552392423 556299925 560564399 564462006 567622602
$$ packed form
399.8F10319793l036320k183497j782119p91609O66737J727641J846254J338899J08182
418.1F08213961j649082j889526j539827j841128k197683k119064j681924j023411
434.4E94272316n10872k46346Q79943K716899L501296K838672J753687J056195P82311
452.8F07044101O05225N3287j148641j953125k029479k142966k446532k530575k532839
471.1E92918456k817274k622306j632988q01087n91159m41908j96279j83105k52903
489.5E83379447m25756q91208j302302j352072j313150j535356j871407k135575k540707
507.9E70011914k946019k878130k643585l009617l556252l303051k374709j242399
524.2E48058152l71456q6725L45588J528978K917886L907502M264474L897607L160596
$$ plain form
542.5 567622602 569984257 571212888 570947587 569538236 567648649 565672517 563585162 560876608 557283819
560.9 557283819 553006709 548413992 543798089 539244413 535138011 532309771 531588316 533288062 537039280
579.2 537039280 542093575 547616959 552909434 557656288 561740458 564823985 566471815 566901922 566772938
597.6 566772938 566553950 566591561 566896677 567218840 567590952 568325460 569597006 571360171 573492050
616 573492050 575888872 578598678 581848145 585635781 589483082 592795610 595265090 597202182 599225640
634.3 599225640 601494431 603507280 604751587 605410635 606187046 607441247 608978391 610298634 611043215
652.7 611043215 611600220 612525046 613838732 615111709 615876794 616067588 616199493 617632449 619801462
671 619801462 621313751 622287452 623322606 624890327 626785755 628329098 629163146 629656971 630200624
$$ packed form
542.5E67622602K361655J228631k65301j409351j889587j976132k087355k708554l592789
560.9E57283819m277110m592717m615903m553676m106402k828240p21455J699746L751218
579.2E37039280N054295N523384N292475M746854M084170L083527J647830M30107j28984
597.6E66772938k18988L7611L05116L22163L72112P34508J271546J763165K131879
616E73492050K396822K709806L249467L787636L847301L312528K469480J937092K023458
634.3E99225640K268791K012849J244307O59048P76411J254201J537144J320243P44581
652.7F11043215N57005R24826J313686J272977P65085J90794J31905J432956K169013
671F19801462J512289R73701J035154J567721J895428J543343Q34048M93825N43653
$$ plain form
689.4 630200624 630734086 630952001 630420923 628893197 626804709 624889493 623457253 622373879 621606171
707.7 621606171 621596813 622945309 625748515 629477262 633442044 637441099 641850233 646898329 652193666
726.1 652193666 656960070 660709083 663621962 666256905 668875039 671080232 672296762 672293961 671394587
744.4 671394587 670012653 668097615 665383816 661860764 657844484 653944790 650781274 648551702
760.8 648551702 647242010 647136390 648785949 652520239 658056557 664549291 671136618 677355707 683174074
779.1 683174074 688632190 693487585 697462082 700524211 703102171 705788970 708752751 711815476
795.4 711815476 714893699 718014777 721131980 724108279 726632297 728440583 729569614 730250180 730697215
813.8 730697215 730932295 730766594 730011463 728595734 726572931 724034667 720979273 717368662 713193238
$$ packed form
689.4F30200624N33462K17915n31078j527726k088488j915216j432240j083374p67708
707.7F21606171r358J348496K803206L728747L964782L999055M409134N048096N295337
726.1F52193666M766404L749013K912879K634943K618134K205193J216530k801q99374
744.4F71394587j381934j915038k713799l523052m016280l899694l163516k229572
760.8F48551702j309692j05620J649559L734290N536318O492734O587327O219089N818367
779.1F83174074N458116M855395L974497L062129K577960K686799K963781L062725
795.4G11815476L078223L121078L117203K976299K524018J808286J129031O80566M47035
813.8G30697215K35080j65701p55131j415729k022803k538264l055394l610611m175424
$$ plain form
832.1 713193238 708649635 704147756 699954212 696113288 692641556 689462900 686514139 683971822
848.5 683971822 681902587 679921329 677588642 675039113 673098385 672988117 675714791 681244016 688537419
866.8 688537419 696454406 704293966 711504936 717188358 720410109 720945477 719297945 716104627 711789668
885.2 711789668 706565380 700620651 694400549 688592911 683597088 679002047 674108922 668717682
901.5 668717682 662999630 657055557 650682986 643538356 635555625 627147317 619054317 611946523
917.8 611946523 606174350 601913035 599208534 597907424 597750723 598403215 599466920 600689709 602219582
936.2 602219582 604409277 607328355 610375226 612055004 610757709 605892003 597870886 587460577
952.5 587460577 575280130 561748862 547291338 532317996 517125130 501822114 486339271
$$ packed form
832.1G13193238m543603m501879m193544l840924l471732l178656k948761k542317
848.5F83971822k069235j981258k332687k549529j940728j10268K726674N529225P293403
866.8F88537419P916987P839560P210970N683422L221751N35368j647532l193318m314959
885.2G11789668n224288n944729o220102n807638m995823m595041m893125n391240
901.5F68717682n718052n944073o372571p144630p982731q408308q093000p107794
917.8F11946523n772173m261315k704501j301110j56701O52492J063705J222789J529873
936.2F02219582K189695K919078L046871J679778j297295m865706q021117j0410309
952.5E87460577j2180447j3531268j4457524j4973342j5192866j5303016j5482843
$$ plain form
966.8 486339271 470719546 455348819 440750152 427370697 415590733 405744553 398140967 392950416
983.1 392950416 390046597 389028609 389351070 390511394 392168045 394123405 396243691 398378253 400290072
1001.4 400290072 401733547 402612954 403022856 403099924 402945578 402753383 402779728 403241277 404279917 405928522
1021.8 405928522 408052266 410448492 412974715 415518075 418022424 420365363 422254711 423514128
1038.1 423514128 424325943 425048947 425917298 426961780 428200454 429782540 431985527 435110271 439258009
1056.5 439258009 444325835 450224310 456946939 464117318 470345676 473352581 471467942 465425313
1072.8 465425313 458125889 452384740 449364990 448822916 450019449 452403694 455698758 459717393
1089.1 459717393 464188308 468605578 472413212 475301057 477266222 478537709 479411155 480164975 481214106
$$ packed form
966.8D86339271j5619725j5370727j4598667j3379455j1779964r846180p603586n190551
983.1C92950416k903819j017988L22461J160324J656651J955360K120286K134562J911819
1001.4D00290072J443475Q79407M09902P7068j54346j92195K6345M61549J038640J648605
1021.8D05928522K123744K396226K526223K543360K504349K342939J889348J259417
1038.1D23514128Q11815P23004Q68351J044482J238674J582086K202987L124744M147738
1056.5D39258009N067826N898475O722629P170379O228358L006905j884639o042629
1072.8D65425313p299424n741149l019750n42074J196533K384245L295064M018635
1089.1D59717393M470915M417270L807634K887845J965165J271487Q73446P53820J049131
$$ plain form
1107.5 481214106 482994795 485617667 488776833 491957396 494762480 497099817 499184430 501351893
1123.8 501351893 503792524 506546080 509620368 512777090 515407562 516713142 515991867 513024867
1140.1 513024867 508297205 502767384 497262329 492145985 487516463 483533710 480488181 478627920
1156.4 478627920 477955848 478226006 479328662 481505781 485074162 490225464 497003883 505196393 514455378
1174.8 514455378 524569273 535422206 546700418 557801306 568122804 577342391 585415244 592327118
1191.1 592327118 597889602 601875126 604350626 605835259 607078373 608589351 610459983 612658441
1207.4 612658441 615274370 618461192 622216523 626161397 629643023 632184148 633740187 634530485
1223.7 634530485 634700000 634215891 633063495 631461382 629831016 628537357 627655387 626990438 626457989
$$ packed form
1107.5D81214106J780689K622872L159166L180563K805084K337337K084613K167463
1123.8E01351893K440631K753556L074288L156722K630472J305580p21275k967000
1140.1E13024867m727662n529821n505055n116344m629522l982753l045529j860261
1156.4D78627920o72072K70158J102656K177119L568381N151302O778419Q192510R258985
1174.8E14455378J0113895J0852933J1278212J1100888J0321498R219587Q072853O911874
1191.1E92327118N562484L985524K475500J484633J243114J510978J870632K198458
1207.4F12658441K615929L186822L755331L944874L481626K541125J556039P90298
1223.7F34530485J69515m84109j152396j602113j630366j293659q81970o64949n32449
$$ plain form
1242.1 626457989 626332700 627022803 628625154 630738914 632818222 634639382 636334121 638056219 639751673
1260.4 639751673 641254246 642540991 643816590 645307958 646946311 648355007 649228513 649578452 649617732
1278.8 649617732 649565756 649526894 649454355 649255216 648925722 648532629 648023427 647217274 646081805 644846380
1299.2 644846380 643788576 643024623 642457843 641847730 641029835 640048921 639010906 637935996 636733770
1317.6 636733770 635255933 633473217 631418467 629029274 626246214 623163283 620085537 617412329
1333.9 617412329 615397811 613985181 612911880 612102151 611626148 611343920 611046910 610587597 609867871
1352.2 609867871 608909845 607793391 606641114 605517328 604230225 602758169 601473927 600519180 599921167
1370.6 599921167 599687994 599551082 599388123 599347472 599399447 599624038 600416124 601824105 603239298 604345262
$$ packed form
1242.1F26457989j25289O90103J602351K113760K079308J821160J694739J722098J695454
1260.4F39751673J502573J286745J275599J491368J638353J408696Q73506L49939L9280
1278.8F49617732n1976l8862p2539j99139l29494l93093n09202q06153j135469j235425
1299.2F44846380j057804p63953n66780o10113q17895r80914j038015j074910j202226
1317.6F36733770j477837j782716k054750k389193k783060l082931l077746k673208
1333.9F17412329k014518j412630j073301q09729m76003k82228k97010m59313p19726
1352.2F09867871r58026j116454j152277j123786j287103j472056j284242r54747n98013
1370.6E99921167k33173j36912j62959m0651N1975K24591P92086J407981J415193J105964
$$ plain form
1391 604345262 605224252 605638266 605491042 604939640 604199827 603529811 602791786 601879120 600963891 600097001
1411.4 600097001 599402010 599155307 599247396 599096656 598789871 598877192 599316776 599955022 600628257 601255119
1431.8 601255119 602133811 603251100 603996158 604450583 605139256 606002808 606802523 607168853 606884003
1450.1 606884003 606311500 605931401 605469227 604297578 603453696 603791118 605209649 607592821 611325920
1468.5 611325920 617015123 624564171 631977022 638350666 644365489 650278449 655869782 660797834
1484.8 660797834 665267110 669472992 673254609 676629007 680082381 683370769 685676754 687454879
1501.1 687454879 689538717 692111552 693748176 693497479 693068147 693252921 694008052 695056200 696220875
1519.5 696220875 697321832 697958589 698324323 698490262 698574901 698924124 699182510 699374318 700184226 701019943
$$ packed form
1391F04345262Q78990M14014j47224n51402p39813o70016p38025r12666r15229q66890
1411.4F00097001o94991k46703R2089j50740l06785Q7321M39584O38246O73235O26862
1431.8F01255119Q78692J117289P45058M54425O88673Q63552P99715L66330k84850
1450.1F06884003n72503l80099m62174j171649q43882L37422J418531K383172L733099
1468.5F11325920N689203P549048P412851O373644O014823N912960N591333M928052
1484.8F60797834M469276M205882L781617L374398L453374L288388K305985J778125
1501.1F87454879K083838K572835J636624k50697m29332J84774P55131J048148J164675
1519.5F96220875J100957O36757L65734J65939Q4639L49223K58386J91808Q09908Q35717
$$ plain form
1539.9 701019943 700392962 699049056 697920084 697232962 696758449 696244657 695865452 695941806 695668638
1558.2 695668638 693240643 690600634 688775122 687343597 686052740 684415221 682876945 681724846
1574.5 681724846 680044472 678035080 676584721 675437450 674219310 672835290 671354532 669853389
1590.9 669853389 668400526 666820765 664879739 662615061 660151064 657516003 654691219 651598871
1607.2 651598871 648067296 644338071 640954852 637607932 633543611 629850388 626856148 623518467
1623.5 623518467 619916320 616369486 612804413 609862030 607709169 605414212 603201687 602149367
1639.8 602149367 602331758 603606164 605771422 608093858 610385597 613707602 617384493 619741321
1656.1 619741321 622344494 626052439 630507469 634967804 639287531 644241631 649519384 654203296
$$ packed form
1539.9G01019943o26981j343906j128972o87122m74513n13792l79205P6354k73168
1558.2F95668638k427995k640009j825512j431525j290857j637519j538276j152099
1574.5F81724846j680374k009392j450359j147271j218140j384020j480758j501143
1590.9F69853389j452863j579761j941026k264678k463997k635061k824784l092348
1607.2F51598871l531575l729225l383219l346920m064321l693223k994240l337681
1623.5F23518467l602147l546834l565073k942383k152861k294957k212525j052320
1639.8F02149367J82391J274406K165258K322436K291739L322005L676891K356828
1656.1F19741321K603173L707945M455030M460335M319727M954100N277753M683912
$$ plain form
1672.4 654203296 659081101 664208651 668985486 673980474 679791689 685999095 690825343 695062518
1688.8 695062518 699836016 704890788 710798323 717091382 722676933 727585733 731075585 733951390
1705.1 733951390 736709833 739089787 741532862 744335532 747466385 750447631 752466142 753917456
1721.4 753917456 755366504 756708324 757934809 759279191 760714531 761761546 761881590 762021363 762848854
1739.7 762848854 764202476 766091406 768668234 771927834 775598168 779143512 782398999 785713494
1756.1 785713494 788890958 791725099 794347703 796546340 798614442 800783217 802816093 804403424
1772.4 804403424 805371821 806197703 807252944 808343530 809290826 810182691 811072707 812139213 813424349
1790.7 813424349 814423859 814907312 815440536 816263378 817086875 817676902 818191946 818845868 819632828 820369780
$$ packed form
1672.4F54203296M877805N127550M776835M994988N811215O207406M826248M237175
1688.8F95062518M773498N054772N907535O293059N585551M908800L489852K875805
1705.1G33951390K758443K379954K443075K802670L130853K981246K018511J451314
1721.4G53917456J449048J341820J226485J344382J435340J047015J20044J39773Q27491
1739.7G62848854J353622J888930K576828L259600L670334L545344L255487L314495
1756.1G85713494L177464K834141K622604K198637K068102K168775K032876J587331
1772.4H04403424R68397Q25882J055241J090586R47296Q91865Q90016J066506J285136
1790.7H13424349R99510M83453N33224Q22842Q23497N90027N15044O53922P86960P36952
$$ plain form
1811.1 820369780 820910454 821397543 821913660 822446048 823130727 824032545 824872494 825484693 825907052 826065838
1831.5 826065838 826258779 826700449 827135563 827469647 827988505 828625679 828927279 828952432 828950047 828985751
1851.9 828985751 829146862 829489350 829886556 830157280 830289960 830502629 831027567 831626058 831759989 831565320
1872.3 831565320 831528068 831759691 832142591 832521975 832806051 833029389 833357215 833824635 834190369 834374130
1892.7 834374130 834463239 834463716 834516048 834772646 835111320 835331142 835407495 835459232 835578799 835795939 836113632
1915.1 836113632 836367369 836380899 836355507 836478889 836627185 836702406 836703122 836698174 836788774 836991310 837233424
1937.6 837233424 837428629 837534964 837556303 837610662 837754309 837889850 837951243 837994516 838136494 838385701
1958 838385701 838609636 838694811 838720262 838829160 839011014 839173436 839264274 839271426 839262247 839338541 839505076
$$ packed form
1811.1H20369780N40674M87089N16117N32388O84679R01818Q39949O12199M22359J58786
1831.5H26065838J92941M41670M35114L34084N18858O37174L01600K5153k385L5704
1851.9H28985751J61111L42488L97206K70724J32680K12669N24938N98491J33931j94669
1872.3H31565320l7252K31623L82900L79384K84076K23338L27826M67420L65734J83761
1892.7H34374130Q9109M77N2332K56598L38674K19822P6353N1737J19567K17140L17693
1915.1H36113632K53737J3530k5392J23382J48296P5221P16m948R0600K02536K42114
1937.6H37233424J95205J06335K1339N4359J43647J35541O1393M3273J41978K49207
1958H38385701K23935Q5175K5451J08898J81854J62422R0838P152r179P6294J66535
$$ plain form
1980.4 839505076 839660525 839709818 839699090 839763284 839925826 840033293 839998960 839890480 839784503 839766443
2000.8 839766443 839824438 839850366 839768648 839562416 839315891 839180768 839169800 839087009 838790178 838404119
2021.2 838404119 838132381 837992191 837854505 837608159 837252438 836896300 836653650 836514950 836386681 836186409
2041.6 836186409 835918128 835709274 835640132 835646808 835627079 835542560 835459292 835513413 835692108 835837543 835887432
2064 835887432 835879803 835922718 836090386 836290836 836384296 836347938 836309314 836418509 836635292 836798191 836842418
2086.5 836842418 836849093 836944461 837149680 837379754 837512851 837536156 837602854 837820411 838089585 838252544
2106.9 838252544 838290215 838305652 838415504 838604569 838747144 838773131 838729978 838744700 838878155 839015186
2127.3 839015186 839036584 838989019 838976979 839058399 839198232 839278936 839250863 839225411 839317918 839466095 839544117
$$ packed form
1980.4H39505076J55449M9293j0728O4194J62542J07467l4333j08480j05977j8060
2000.8H39766443N7995K5928q1718k06232k46525j35123j0968q2791k96831l86059
2021.2H38404119k71738j40190j37686k46346l55721l56138k42650j38700j28269k00272
2041.6H36186409k68281k08854o9142O676j9729q4519q3268N4121J78695J45435M9889
2064H35887432p629M2915J67668K00450R3460l6358l8624J09195K16783J62899M4227
2086.5H36842418O675R5368K05219K30074J33097K3305O6698K17557K69174J62959
2106.9H38252544L7671J5437J09852J89065J42575K5987m3153J4722J33455J37031
2127.3H39015186K1398m7565j2040Q1420J39833Q0704k8073k5452R2507J48177P8022
$$ plain form
2149.7 839544117 839553177 839590311 839730442 839976847 840227246 840402544 840562701 840775132 841050386 841387510
2170.1 841387510 841733754 842019677 842290521 842623889 843006551 843377471 843705177 844010532 844325483 844662309
2190.5 844662309 844989419 845273077 845528305 845782340 846063554 846401572 846742332 847001255 847213030 847465873
2210.9 847465873 847777724 848108649 848413229 848645031 848826706 849042654 849296987 849539220 849751234 849920750
2231.3 849920750 850054026 850205481 850394368 850576282 850691140 850730479 850788355 850949407 851164043 851316571
2251.7 851316571 851368546 851396024 851498306 851690233 851865828 851897299 851833642 851879835 852145791 852498770
2272.1 852498770 852697253 852703393 852698326 852834404 853086889 853274345 853261948 853119314 853038371 853112519 853211164
2294.5 853211164 853137970 852899551 852706969 852691352 852721274 852596939 852277875 851899564 851656795 851583302
$$ packed form
2149.7H39544117R060L7134J40131K46405K50399J75298J60157K12431K75254L37124
2170.1H41387510L46244K85923K70844L33368L82662L70920L27706L05355L14951L36826
2190.5H44662309L27110K83658K55228K54035K81214L38018L40760K58923K11775K52843
2210.9H47465873L11851L30925L04580K31802J81675K15948K54333K42233K12014J69516
2231.3H49920750J33276J51455J88887J81914J14858L9339N7876J61052K14636J52528
2251.7H51316571N1975K7478J02282J91927J75595L1471o3657M6193K65956L52979
2272.1H52498770J98483O140n067J36078K52485J87456j2397j42634q0943P4148R8645
2294.5H53211164p3194k38419j92582j5617K9922j24335l19064l78311k42769p3493
$$ plain form
2314.9 851583302 851464808 851078272 850489199 850002766 849780023 849657655 849436879 849056721 848632932 848367274
2335.3 848367274 848285794 848218679 848017633 847800970 847970426 848440945 848534346 847895145 846744835 845657647
2355.7 845657647 844914317 844513357 844484746 844655395 844845593 845198572 845844269 846591890 847151518 847473681
2376.1 847473681 847745597 848145366 848631144 848972201 848986149 848753452 848522007 848449528 848454475 848313510
2396.5 848313510 847944498 847500741 847180963 847035110 846919000 846617579 846114397 845633507 845342278 845163524
2416.9 845163524 844902456 844438732 843847454 843354583 843054354 842787564 842349529 841721654 841091692 840639174
2437.3 840639174 840322316 839933872 839343488 838666439 838133454 837781489 837418258 836879075 836235344 835692465
2457.7 835692465 835339487 835030675 834569752 833967566 833370566 832909107 832617223 832352042 831904113 831295311
$$ packed form
2314.9H51583302j18494l86536n89073m86433k22743j22368k20776l80158m23789k65658
2335.3H48367274q1480o7115k01046k16663J69456M70519R3401o39201j150310j087188
2355.7H45657647p43330m00960k8611J70649J90198L52979O45697P47621N59628L22163
2376.1H47473681K71916L99769M85778L41057J3948k32697k31445p2479M947j40965
2396.5H48313510l69012m43757l19778j45853j16110l01421n03182m80890k91229j78754
2416.9H45163524k61068m63724n91278m92871l00229k66790m38035o27875o29962m52518
2437.3H40639174l16858l88444n90384o77049n32985l51965l63231n39183o43731n42879
2457.7H35692465l52978l08812m60923o02186n97000m61459k91884k65181m47929o08802
$$ plain form
2478.1 831295311 830763161 830415666 830151975 829826236 829369724 828873098 828497648 828267813 828066111 827753961
2498.5 827753961 827305496 826862454 826561093 826347589 826054990 825629234 825186074 824856162 824617982 824335277
2518.9 824335277 823925972 823411942 822898865 822491884 822158158 821769834 821270049 820697308 820154786 819723964
2539.2 819723964 819323480 818802536 818163753 817527354 816991687 816570580 816147745 815605402 814983964 814408243
2559.6 814408243 813939691 813546419 813106894 812529981 811906457 811376989 810965598 810559213 810028195 809419930
2580 809419930 808878660 808456004 808105111 807719588 807253718 806796789 806403518 806031287 805637419 805176735
2600.4 805176735 804637671 804117799 803688824 803260088 802703679 802007854 801286399 800646245 800034940 799343526
2620.8 799343526 798550010 797669590 796780050 795957506 795124054 794172823 793160379 792193890 791299522
$$ packed form
2478.1H31295311n32150l47495k63691l25739m56512m96626l75450k29835k01702l12150
2498.5H27753961m48465m43042l01361k13504k92599m25756m43160l29912k38180k82705
2518.9H24335277m09305n14030n13077m06981l33726l88324m99785n72741n42522m30822
2539.2H19723964m00484n20944o38783o36399n35667m21107m22835n42343o21438n75721
2559.6H14408243m68552l93272m39525n76913o23524n29468m11391m06385n31018o08265
2580H09419930n41270m22656l50893l85523m65870m56929l93271l72231l93868m60684
2600.4H05176735n39064n19872m28975m28736n56409o95825p21455o40154o11305o91414
2620.8G99343526p93516q80420q89540q22544q33452r51231j012444r66489q94368
$$ plain form
2639.2 791299522 790445507 789520860 788473070 787419736 786470950 785600483 784709156 783758104 782794774
2657.5 782794774 781868041 780989587 780161679 779339731 778450966 777526557 776689768 775967717 775231242 774430573
2677.9 774430573 773652732 772925973 772239864 771596253 770921528 770161331 769392192 768682778 767995059 767251194
2698.3 767251194 766427815 765577734 764784873 764067173 763322055 762478530 761587620 760733902 759964287 759233952
2718.7 759233952 758467972 757645607 756820738 756080985 755424440 754761755 754050493 753331602 752648532 752017319
2739.1 752017319 751413107 750787735 750152528 749538660 748959243 748416901 747869790 747281373 746688724 746136367
2759.5 746136367 745631278 745142996 744611919 744039178 743473172 742932260 742382884 741739690 740967274 740148485
2779.9 740148485 739392936 738695323 737934291 737015307 735971868 734918773 733909011 732894003 731794357
$$ packed form
2639.2G91299522q54015r24647j047790j053334r48786q70467q91327r51052r63330
2657.5G82794774r26733q78454q27908q21948q88765r24409q36789p22051p36475q00669
2677.9G74430573p77841p26759o86109o43611o74725p60197p69139p09414o87719p43865
2698.3G67251194q23379q50081p92861p17700p45118q43525q90910q53718p69615p30335
2718.7G59233952p65980q22365q24869p39753o56545o62685p11262p18891o83070o31213
2739.1G52017319o04212o25372o35207o13868n79417n42342n47111n88417n92649n52357
2759.5G46136367n05089m88282n31077n72741n66006n40912n49376o43194p72416q18789
2779.9G40148485p55549o97613p61032r18984j043439j053095j009762j015008j099646
$$ plain form
2798.3 731794357 730545223 729183257 727844596 726562500 725219190 723713517 722067058 720399797
2814.6 720399797 718773365 717110813 715313792 713372350 711371243 709377587 707340062 705140829
2830.9 705140829 702713370 700102985 697355568 694386959 691000581 686993837 682279825 677046239
2847.2 677046239 671808422 667149425 663447559 660859585 659342706 658563673 657934010 656917155 655215919
2865.6 655215919 652790010 649902284 646930754 644043446 641214132 638449550 635845721 633478522
2881.9 633478522 631372929 629520059 627818525 626212478 624810398 623635471 622523963 621305466
2898.2 621305466 619892836 618280709 616453469 614277840 611605883 608345747 604418993 599851608
2914.5 599851608 594924867 590148270 586014807 582849264 580821335 580039799 580555618 582272112 585038841
$$ packed form
2798.3G31794357j249134j361966j338661j282096j343310j505673j646459j667261
2814.6G20399797j626432j662552j797021j941442k001107j993656k037525k199233
2830.9G05140829k427459k610385k747417k968609l386378m006744m714012n233586
2847.2F77046239n237817m658997l701866k587974j516879p79033o29663j016855j701236
2865.6F55215919k425909k887726k971530k887308k829314k764582k603829k367199
2881.9F33478522k105593j852870j701534j606047j402080j174927j111508j218497
2898.2F21305466j412630j612127j827240k175629k671957l260136l926754m567385
2914.5E99851608m926741m776597m133463l165543k027929p81536N15819J716494K766729
$$ plain form
2932.9 585038841 588684857 593006134 597825170 602953613 608126521 613026500 617440760 621406436
2949.2 621406436 625107408 628644824 632056355 635443091 638946533 642693877 646715760 650931358
2965.5 650931358 655195534 659361362 663415790 667387843 671196520 674743414 677945793 680763423
2981.8 680763423 683273435 685587525 687701046 689491928 690858603 691774964 692336440 692644358 692611635
3000.2 692611635 692161560 691375852 690421581 689553857 688902915 688275218 687483072 686600745 685722589 684811532
3020.6 684811532 683767676 682476997 680937111 679342210 677822053 676266789 674505770 672521651
3036.9 672521651 670504630 668603122 666731119 664723694 662582159 660459638 658389688 656316400
3053.2 656316400 654244959 652128339 649932563 647801161 645838857 643934965 641929805 639799416
$$ packed form
2932.9E85038841L646016M321277M819036N128443N172908M899979M414260L965676
2949.2F21406436L700972L537416L411531L386736L503442L747344M021883M215598
2965.5F50931358M264176M165828M054428L972053L808677L546894L202379K817630
2981.8F80763423K510012K314090K113521J790882J366675R16361N61476L07918l2723
3000.2F92611635m50075p85708r54271q67724o50942o27697p92146q82327q78156r11057
3020.6F84811532j043856j290679j539886j594901j520157j555264j761019j984119
3036.9F72521651k017021j901508j872003k007425k141535k122521k069950k073288
3053.2F56316400k071441k116620k195776k131402j962304j903892k005160k130389
$$ plain form
3069.5 639799416 637669802 635644734 633775711 632038713 630211949 628167570 626060188 624005497
3085.8 624005497 622024953 620114446 618157566 616103828 614096045 612249434 610446453 608510196
3102.2 608510196 606503010 604613900 602828979 600968540 599094629 597382426 595692515 593844950
3118.5 593844950 591868103 589826882 587799549 585849524 583964109 582073450 580131173 578244090
3134.8 578244090 576531947 574871540 573084354 571219802 569378436 567582309 565877855 564251959
3151.1 564251959 562525213 560621142 558739662 556995511 555315137 553638935 551950574 550255895
3167.4 550255895 548555911 546853781 545168519 543533325 541956604 540413857 538858235 537276685
3183.7 537276685 535708249 534157097 532605171 531058490 529534757 528027594 526515007 525019646
$$ packed form
3069.5F39799416k129614k025068j869023j736998j826764k044379k107382k054691
3085.8F24005497j980544j910507j956880k053738k007783j846611j802981j936257
3102.2F08510196k007186j889110j784921j860439j873911j712203j689911j847565
3118.5E93844950j976847k041221k027333j950025j885415j890659j942277j887083
3134.8E78244090j712143j660407j787186j864552j841366j796127j704454j625896
3151.1E64251959j726746j904071j881480j744151j680374j676202j688361j694679
3167.4E50255895j699984j702130j685262j635194j576721j542747j555622j581550
3183.7E37276685j568436j551152j551926j546681j523733j507163j512587j495361
$$ plain form
3200.1 525019646 523591340 522219539 520847201 519440174 518039823 516703129 515397847 514063239
3216.4 514063239 512692511 511337996 510048389 508799136 507554233 506324172 505135119 503974259
3232.7 503974259 502737999 501410663 500116825 498873681 497678101 496582925 495512992 494348586
3249 494348586 493140250 492001206 490934581 489860922 488773704 487747461 486761093 485754341 484801263
3267.4 484801263 483993948 483175308 482178092 481117576 480112344 479150325 478220850 477313250 476372182
3285.7 476372182 475429088 474614948 473874629 473021179 472021133 470936447 469889641 469019681 468269944
3304.1 468269944 467418313 466327041 465075672 463801175 462556928 461356223 460177511 458970934
3320.4 458970934 457747340 456514388 455162555 453653574 452103019 450608611 449203908 447852194
$$ packed form
3200.1E25019646j428306j371801j372338j407027j400351j336694j305282j334608
3216.4E14063239j370728j354515j289607j249253j244903j230061j189053j160860
3232.7E03974259j236260j327336j293838j243144j195580j095176j069933j164406
3249D94348586j208336j139044j066625j073659j087218j026243r86368j006752r53078
3267.4D84801263q07315q18640r97216j060516j005232r62019r29475r07600r41068
3285.7D76372182r43094q14140p40319q53450j000046j084686j046806q69960p49737
3304.1D68269944q51631j091272j251369j274497j244247j200705j178712j206577
3320.4D58970934j223594j232952j351833j508981j550555j494408j404703j351714
$$ plain form
3336.7 447852194 446403295 444786668 443124205 441476017 439882010 438400924 436838299 435007632
3353 435007632 433084011 431287318 429604441 427913815 426180720 424539000 422996759 421303213 419346243
3371.4 419346243 417369336 415622622 414058775 412541598 411018491 409550577 408222377 407094449
3387.7 407094449 406220466 405314922 404041559 402700692 401764989 401098132 400138438 398818403 397674084
3406.1 397674084 396857440 396137983 395429313 394683450 393927455 393318623 392876983 392479122 392126828 391918391
3426.5 391918391 391876549 391883105 391966760 392225623 392413527 392352879 392306656 392539650 393006533 393527329 394006759
3448.9 394006759 394537419 395211786 395986438 396856070 397844732 398796350 399718970 400897503 402246326
3467.2 402246326 403327763 404045045 404767692 405750096 407005489 408350855 409489214 410529941 411731362
$$ packed form
3336.7D47852194j448899j616627j662463j648188j594007j481086j562625j830667
3353D35007632j923621j796693j682877j690626j733095j641720j542241j693546j956970
3371.4D19346243j976907j746714j563847j517177j523107j467914j328200j127928
3387.7D07094449q73983r05544j273363j340867r35703o66857r59694j320035j144319
3406.1C97674084q16644p19457p08670p45863p55995o08832m41640l97861l52294k08437
3426.5C91918391m1842O556Q3655K58863J87904o0648m6223K32994M66883N20796M79430
3448.9C94006759N30660O74367P74652Q69632R88662R51618R22620J178533J348823
3467.2D02246326J081437P17282P22647R82404J255393J345366J138359J040727J201421
$$ plain form
3485.6 411731362 412950188 414080948 415293962 416620225 417980164 419336677 420743942 422183424
3501.9 422183424 423415601 424481839 425689548 427084774 428602785 430110455 431483686 432885855
3518.2 432885855 434507281 436329871 438059986 439519912 440922320 442469001 444180131 446078271
3534.5 446078271 448029935 449836969 451737881 453923553 456120938 458047688 459889203 461890996
3550.9 461890996 463968724 466103673 468411267 470912009 473511994 476145893 478851140 481643289
3567.2 481643289 484380782 487064511 489874870 492897481 496097893 499468535 503039837 506744206
3583.5 506744206 510357022 513731539 517109096 520677686 524405003 528262913 532223403 536192715
3599.8 536192715 540137231 544140458 548187554 552273691 556392670 560496211 564599931 568649650
$$ packed form
3485.6D11731362J218826J130760J213014J326263J359939J356513J407265J439482
3501.9D22183424J232177J066238J207709J395226J518011J507670J373231J402169
3518.2D32885855J621426J822590J730115J459926J402408J546681J711130J898140
3534.5D46078271J951664J807034J900912K185672K197385J926750J841515K001793
3550.9D61890996K077728K134949K307594K500742K599985K633899K705247K792149
3567.2D81643289K737493K683729K810359L022611L200412L370642L571302L704369
3583.5E06744206L612816L374517L377557L568590L727317L857910L960490L969312
3599.8E36192715L944516M003227M047096M086137M118979M103541M103720M049719
$$ plain form
3616.1 568649650 572629929 576594412 580472469 584334671 588234901 592161953 596032977 599690557
3632.4 599690557 603293002 606901050 610484242 614117205 617871642 621749997 625628829 629277468
3648.8 629277468 632472694 635326207 638199866 641313314 644450307 647369564 650147915 653086722
3665.1 653086722 656209469 659194112 662019193 664689898 666933477 668805897 670689881 672768176
3681.4 672768176 675141215 677797079 680492043 682597160 684007823 685437322 687116504 688873231
3697.7 688873231 690590739 692175210 693689764 695328295 697117925 698840439 700179636 701263845
3714 701263845 702408910 703670681 704960704 706195235 707323551 708370268 709555387 711032867 712717652
3732.4 712717652 714120090 714942753 715734601 716852665 717935443 718727410 719640732 720609546 721143007
$$ packed form
3616.1E68649650L980279L964483L878057L862202L900230L927052L871024L657580
3632.4E99690557L602445L608048L583192L632963L754437L878355L878832L648639
3648.8F29277468L195226K853513K873659L113448L136993K919257K778351K938807
3665.1F53086722L122747K984643K825081K670705K243579J872420J883984K078295
3681.4F72768176K373039K655864K694964K105117J410663J429499J679182J756727
3697.7F88873231J717508J584471J514554J638531J789630J722514J339197J084209
3714G01263845J145065J261771J290023J234531J128316J046717J185119J477480J684785
3732.4G12717652J402438Q22663P91848J118064J082778P91967R13322R68814N33461
$$ plain form
3750.7 721143007 721501350 722242415 723193407 723975122 724594235 725298524 726153970 727045655 727753699 728234529
3771.1 728234529 728790820 729614377 730580270 731400371 732003093 732552528 733099639 733695447 734375834 735116124
3791.5 735116124 735916615 736717880 737529933 738306284 738895178 739380002 739760280 740039527 740502894 741241932
3811.9 741241932 742034674 742731452 743465126 744064867 744313061 744546235 744937062 745424926 745996833 746654332
3832.3 746654332 747429729 748102546 748448074 748669267 748859704 749010563 749340892 750035763 750926733 751367450
3852.7 751367450 751183093 751248896 751660049 752173781 752673626 753135324 753629148 754019439 754213154 754358172
3873.1 754358172 754580140 754961908 755439281 755868673 756225049 756456912 756614506 756846070 757061541 757219732
3893.5 757219732 757548809 758153856 758813322 759177685 759071887 758755088 758656502 758858085 759233773 759646177
$$ packed form
3750.7G21143007L58343P41065R50992P81715O19113P04289Q55446Q91685P08044M80830
3771.1G28234529N56291Q23557R65893Q20101O02722N49435N47111N95808O80387P40290
3791.5G35116124Q00491Q01265Q12053P76351N88894M84824L80278K79247M63367P39038
3811.9G41241932P92742O96778P33674N99741K48194K33174L90827M87864N71907O57499
3832.3G46654332P75397O72817L45528K21193J90437J50859L30329O94871Q90970M40717
3852.7G51367450j84357O5803M11153N13732M99845M61698M93824L90291J93715J45018
3873.1G54358172K21968L81768M77373M29392L56376K31863J57594K31564K15471J58191
3893.5G57219732L29077O05047O59466L64363j05798l16799r8586K01583L75688M12404
$$ plain form
3913.9 759646177 759965181 760108471 760186255 760356426 760563791 760747313 760993659 761253476 761380970 761442006
3934.3 761442006 761582494 761817813 762070954 762262285 762431622 762650907 762850881 762962520 763050854 763218164
3954.7 763218164 763438225 763615310 763753593 763857961 763974011 764175534 764388323 764552832 764716327 764863372
3975.1 764863372 764950216 765043736 765226543 765445054 765594244 765724182 765947878 766185522 766318142 766398251
3995.5 766398251 766485572
3997.5 766485572
$$ packed form
3913.9G59646177L19004J43290P7784J70171K07365J83522K46346K59817J27494O1036
3934.3G61442006J40488K35319K53141J91331J69337K19285J99974J11639Q8334J67310
3954.7G63218164K20061J77085J38283J04368J16050K01523K12789J64509J63495J47045
3975.1G64863372Q6844R3520J82807K18511J49190J29938K23696K37644J32620Q0109
3995.5G66398251Q7321
3997.5G66485572
##END=$$ End of the data block
