##TITLE=3 meg Kay $$ Begin of the data block
##JCAMP-DX=5.00 $$ ACD/SpecManager v 10.08
##SPECTROMETER/DATA SYSTEM=Alpha
##DATE=16 Oct 2013 13:51:24
##DATA TYPE=INFRARED SPECTRUM
##DATA CLASS=XYDATA
##ORIGIN=
##OWNER=
##NPOINTS=1765
##FIRSTX=399.75695801
##LASTX=3997.56933594
##MAXX=3997.56933594
##MINX=399.75695801
##MAXY=0.85366571
##MINY=0.38900349
##XFACTOR=1.0000000000
##YFACTOR=1.000000000000000e-9
##FIRSTY=0.61112863
##DELTAX=2.03957629
##XUNITS=1/CM
##YUNITS=ARBITRARY UNITS
##XYDATA=(X++(Y..Y))
399.8F11128628k726078k537012j961172o22689Q12590J814365J742900Q29875m09543
418.1F08071864j437366j369834j478434k159238k405762k020717j408041q08537l83138
436.5E94600797j51635N75483K127588L321529L069758J950622J114726Q39710O57439
454.8F08106017o7770j367689j987099j967132k094865k332151k358913k474785k925575
473.2E90530038k564609j485050j007557r70125o19054k67684k01941p6771j39594
491.5E83197653p82728j472652j566470j310706j288533j610577k169132k730012k855480
509.9E67411363k816081k975106l235817l536701l308773k313018j181901m26888l3498
528.3E47583580N00381J513541K860486M037023M331767L751636L017068K344787J369417
$$ y = [611128628, 608402550, 605865538, 603904366, 603281677, 604094267, 605908632, 607651532, 608481407, 608071864, 606634498, 605264664, 603786230, 601626992, 599221230, 597200513, 595792472, 594983935, 594600797, 594449162, 595024645, 597152233, 600473762, 603543520, 605494142, 606608868, 607448578, 608106017, 608038247, 606670558, 604683459, 602716327, 600621462, 598289311, 595930398, 593455613, 590530038, 587965429, 586480379, 585472822, 584502697, 583883643, 583615959, 583414018, 583337247, 583197653, 582414925, 580942273, 579375803, 578065097, 576776564, 575165987, 572996855, 570266843, 567411363, 564595282, 561620176, 558384359, 554847658, 551538885, 549225867, 548043966, 547617078, 547583580, 548083961, 549597502, 552457988, 556495011, 560826778, 564578414, 567595482, 569940269, 571309686]
546.6E71309686q2970j391470j996279k050340k093852k690732l576100m208565m548550
565E48670828m796564m757941m019916k588511o43313J634777L724873M957259N424619
583.3E47606111N468845N025804M175842L041267J563072L00169k44617k20478P7367
601.7E66793382K70486K98142L62456P37071J432360K022802K236128K344430K665281
620E79162538L202677L764689L863632L266275K374471J907289K019643K158106J883685
638.4F03603005J271129P89344Q89302J416385J654327J228750O41703N49138R75609
656.7F13018692J435875J324296P52807K49565J11222J185834K030611J557649J070439
675.1F22736990J058877J521468J871288J605689R33946N04732N45501O17385J97769
$$ y = [571309686, 571226716, 569835246, 567838967, 565788627, 563694775, 561004043, 557427943, 553219378, 548670828, 543874264, 539116323, 535096407, 532507896, 531864583, 533499360, 537224233, 542181492, 547606111, 553074956, 558100760, 562276602, 565317869, 566880941, 567181110, 566936493, 566716015, 566793382, 567063868, 567362010, 567724466, 568461537, 569893897, 571916699, 574152827, 576497257, 579162538, 582365215, 586129904, 589993536, 593259811, 595634282, 597541571, 599561214, 601719320, 603603005, 604874134, 605663478, 606552780, 607969165, 609623492, 610852242, 611493945, 612043083, 613018692, 614454567, 615778863, 616531670, 616781235, 616892457, 618078291, 620108902, 621666551, 622736990, 623795867, 625317335, 627188623, 628794312, 629728258, 630232990, 630778491, 631395876, 631593645]
693.5F31593645p37608j717865k092660j809418j364052j026810o94930O735J300156
711.8F23457193K750218L715337L982842M025638M454195N089224N277574M725039
728.1F57477260L745496K920985K636314K615511K147138J150012L4154q47400j403331
746.5F70476139j928747k688408l550410m110635l969252l220558k292633j318693
762.8F47396803o2883J678109L747702N587876O542146O574452O204486N856752N502462
781.2F89027905M862965L965497L080487K570331K623260K959847L095091L039896
797.5G15225279L109634L232718L059327K468706J712560J016021N92351M35829K26855
815.8G31079280j90913p94709j437187j942754k440274l048301l670692m205763m526019
$$ y = [631593645, 630856037, 629138172, 627045512, 625236094, 623872042, 622845232, 622150302, 622157037, 623457193, 626207411, 629922748, 633905590, 637931228, 642385423, 647474647, 652752221, 657477260, 661222756, 664143741, 666780055, 669395566, 671542704, 672692716, 672726870, 671879470, 670476139, 668547392, 665858984, 662308574, 658197939, 654228687, 651008129, 648715496, 647396803, 647333920, 649012029, 652759731, 658347607, 664889753, 671464205, 677668691, 683525443, 689027905, 693890870, 697856367, 700936854, 703507185, 706130445, 709090292, 712185383, 715225279, 718334913, 721567631, 724626958, 727095664, 728808224, 729824245, 730416596, 730852425, 731079280, 730888367, 730093658, 728656471, 726713717, 724273443, 721225142, 717554450, 713348687, 708822668]
834.2G08822668m564763m286229l828704l444732l169477k878725k514124k167046
850.5F81968868k071023k304137k486050j949966j21295K762258N553185P307232P935047
868.9F96594119P823169P138670N610525L200531N48840j639903l215372m347444n253851
887.2G06459284n997420o254017n790412m996658m611551m881800n380094n720973
903.5F62826359n933821o366849p204652q087575q439601q011579p007659n718946
919.8F06055677m253209k713382j298070j45912O61552J059651J205385J517236K188802
938.2F04277730K939284L061354J656592j342535m903972q032859j0414302j2178183
954.5E75063109j3519048j4456272j4957488j5175223j5355528j5556842j5617162
$$ y = [708822668, 704257905, 699971676, 696142972, 692698240, 689528763, 686650038, 684135914, 681968868, 679897845, 677593708, 675107658, 673157692, 673036397, 675798655, 681351840, 688659072, 696594119, 704417288, 711555958, 717166483, 720367014, 720915854, 719275951, 716060579, 711713135, 706459284, 700461864, 694207847, 688417435, 683420777, 678809226, 673927426, 668547332, 662826359, 656892538, 650525689, 643321037, 635233462, 626793861, 618782282, 611774623, 606055677, 601802468, 599089086, 597791016, 597645104, 598306656, 599366307, 600571692, 602088928, 604277730, 607217014, 610278368, 611934960, 610592425, 605688453, 597655594, 587241292, 575063109, 561544061, 547087789, 532130301, 516955078, 501599550, 486042708, 470425546]
968.8D70425546j5322983j4564008j3366252j1765450r800345p559627n177677k883821
985.1C89985383r81898L42936J184135J684607J938432K076447K131611J954049J474351
1003.5D01790053Q72254L79682N7548j48922j89096J609M27306J030087J651764K117604
1023.9D07989889K378613K512962K586573K573073K330482J830071J265824Q73149
1040.2D24340636P69048Q82447J032770J189798J533926K207458L154784M154474N047887
1058.5D44313228N886138O715566P146775O220699L011733j892954o045252p300914
1074.8D58055019n724758k975374n00172J225263K373158L248364L985644M478097
1091.2D64165241M442334L799110K856970J964897J289159Q89689P92801J086027J746237
$$ y = [470425546, 455102563, 440538555, 427172303, 415406853, 405606508, 398046881, 392869204, 389985383, 389003485, 389346421, 390530556, 392215163, 394153595, 396230042, 398361653, 400315702, 401790053, 402662307, 403041989, 403099537, 402950615, 402761519, 402763128, 403190434, 404220521, 405872285, 407989889, 410368502, 412881464, 415468037, 418041110, 420371592, 422201663, 423467487, 424340636, 425109684, 425992131, 427024901, 428214699, 429748625, 431956083, 435110867, 439265341, 444313228, 450199366, 456914932, 464061707, 470282406, 473294139, 471401185, 465355933, 458055019, 452330261, 449354887, 448854715, 450079978, 452453136, 455701500, 459687144, 464165241, 468607575, 472406685, 475263655, 477228552, 478517711, 479407400, 480200201, 481286228, 483032465]
1109.5D83032465K539664L141910L233433K823591K313972K084315K186715K434314
1125.8E03790379K711713L048479L193081K674878J312553p29620k968371m715562
1142.2E08317530n532086n527734n107821m585295l966988l072559j896024o91027
1158.5D77937996K84464J133292K183527L567636N173207O778270Q160233R227157
1174.8E14445782J0097384J0865271J1294484J1107386J0327458R200692Q050859O927729
1191.1E92317045N576014L963650K462387J492858J231968J501560J894653K211392
1207.4F12651527K607644L197491L764808L924429L452182K520859J552821P98702
1223.7F34470463J76132m84169j151502j604974j626313j259923q66592o89805n44250
$$ y = [483032465, 485572129, 488714039, 491947472, 494771063, 497085035, 499169350, 501356065, 503790379, 506502092, 509550571, 512743652, 515418530, 516731083, 516001463, 513033092, 508317530, 502785444, 497257710, 492149889, 487564594, 483597606, 480525047, 478629023, 477937996, 478222460, 479355752, 481539279, 485106915, 490280122, 497058392, 505218625, 514445782, 524543166, 535408437, 546702921, 557810307, 568137765, 577338457, 585389316, 592317045, 597893059, 601856709, 604319096, 605811954, 607043922, 608545482, 610440135, 612651527, 615259171, 618456662, 622221470, 626145899, 629598081, 632118940, 633671761, 634470463, 634646595, 634162426, 633010924, 631405950, 629779637, 628519714, 627653122, 626963317, 626419067]
1242.1F26419067r3281P36952J611829K096116K076805J820326J672864J707792J705945
1260.4F39754415J522004J308918J295924J478851J595140J392066Q67069L11971K4140
1278.8F49550498j669J5616o9618k12372l23236l97026n25296p84635j096726j241803
1299.2F44913733j090765p70271n57422o08445p96616r54687j049281j100003j203716
1317.6F36782527j458764j763761k051652k412796k815544l083766l046989k651632
1333.9F17497623k018869j423001j056373p62046m43399k78949l06666m77612p32124
1352.2F09998584r70602j148045j182437j127601j259923j446485j304627r88424o00159
1370.6E99970281k18987j29044j81139p6950J9610K08438Q17180J448571J416505J088917
$$ y = [626419067, 626325786, 627062738, 628674567, 630770683, 632847488, 634667814, 636340678, 638048470, 639754415, 641276419, 642585337, 643881261, 645360112, 646955252, 648347318, 649214387, 649526358, 649550498, 649548829, 649564445, 649494827, 649282455, 648959219, 648562193, 648036897, 647252262, 646155536, 644913733, 643822968, 643052697, 642495275, 641886830, 641090214, 640135527, 639086246, 637986243, 636782527, 635323763, 633560002, 631508350, 629095554, 626280010, 623196244, 620149255, 617497623, 615478754, 614055753, 612999380, 612237334, 611793935, 611514986, 611208320, 610730708, 609998584, 609027982, 607879937, 606697500, 605569899, 604309976, 602863491, 601558864, 600570440, 599970281, 599751294, 599622250, 599441111, 599364161, 599383771, 599592209, 600409389, 601857960, 603274465, 604363382]
1391F04363382Q68082L97503j82450n84840p37906o43611o92189q67605q99315q59856
1411.4F00161195o90282k67207N1200j41740k39730J22250M29093O17266O56188O34133
1431.8F01332366Q88944J100779P38740M51445O65307Q54910Q13186L64065l09348
1450.1F06900394n95212m00543m63963j117170q11517L03567J391887K414823L770768
1468.5F11393034N704344P556617P405341O356656O010890N910337N584359M922986
1484.8F60844564M455686M171312L741860L348112L426969L282845K351463J827360
1501.1F87450171K087295K531290J599490k39730m03821K03371P41780J008332J151084
1519.5F96129262J125038O82652M15087K00212R9480L45349K50519J97827Q27611Q67605
$$ y = [604363382, 605231464, 605628967, 605446517, 604861677, 604123771, 603480160, 602787971, 601920366, 601021051, 600161195, 599470913, 599203706, 599254906, 599113166, 598873436, 598995686, 599424779, 600042045, 600698233, 601332366, 602221310, 603322089, 604060829, 604512274, 605177581, 606032491, 606845677, 607209742, 606900394, 606305182, 605904639, 605440676, 604323506, 603511989, 603815556, 605207443, 607622266, 611393034, 617097378, 624653995, 632059336, 638415992, 644426882, 650337219, 655921578, 660844564, 665300250, 669471562, 673213422, 676561534, 679988503, 683271348, 685622811, 687450171, 689537466, 692068756, 693668246, 693428516, 693024695, 693228066, 693969846, 694978178, 696129262, 697254300, 697936952, 698352039, 698552251, 698651731, 698997080, 699247599, 699445426, 700273037, 701140642]
1539.9G01140642n96702j329124j107514o67095m85122n48840m11570M1604l12567
1558.2F95723712k415359k584099j778782j430928j322031j636327j528740j193940
1574.5F81833506j729608k001286j444637j166642j241922j414001j503468j531064
1590.9F69800878j517237j632332j928092k223908k447486k608538k782702l096045
1607.2F51564538l569245l749013l370166l328979m089474l724158k981007l304780
1623.5F23447716l586471l551006l567815k940655k188027k352059k198219r83894
1639.8F02079570K58386J345218K236008K372623K282381L270387L701747K473593
1656.1F20019913K682805L726601M452765M470289M322827M933894N270362M703581
$$ y = [701140642, 700543940, 699214816, 698107302, 697440207, 696955085, 696406245, 695994675, 696036279, 695723712, 693308353, 690724254, 688945472, 687514544, 686192513, 684556186, 683027446, 681833506, 680103898, 678102612, 676657975, 675491333, 674249411, 672835410, 671331942, 669800878, 668283641, 666651309, 664723217, 662499309, 660051823, 657443285, 654660583, 651564538, 647995293, 644246280, 640876114, 637547135, 633457661, 629733503, 626752496, 623447716, 619861245, 616310239, 612742424, 609801769, 607613742, 605261683, 603063464, 602079570, 602337956, 603683174, 605919182, 608291805, 610574186, 613844573, 617546320, 620019913, 622702718, 626429319, 630882084, 635352373, 639675200, 644609094, 649879456, 654583037]
1672.4F54583037M891097N149186M798591M986346N776048O180823M832983M238545
1688.8F95436656M765988N035043N849659O227374N552054M910171L512978K884984
1705.1G34174907K742827K366066K452076K803444L091395K964318K059877J480401
1721.4G54135311J467704J362563J229047J348496J441002J017928R8050J70707Q81970
1739.7G63152778J377285J881957K562821L220915L633917L553748L286481L322780
1756.1G85992682L157258K818167K632141K229691K073765K122998J992166J615643
1772.4H04634511J027823Q50677J054764J079917R28581Q76188Q72195J039565J250207
1790.7H13614428R60469M76301N67198Q65638Q42750N69821M81545O43552P88450P30753
$$ y = [654583037, 659474134, 664623320, 669421911, 674408257, 680184305, 686365128, 691198111, 695436656, 700202644, 705237687, 711087346, 717314720, 722866774, 727776945, 731289923, 734174907, 736917734, 739283800, 741735876, 744539320, 747630715, 750595033, 752654910, 754135311, 755603015, 756965578, 758194625, 759543121, 760984123, 762002051, 762100101, 762270808, 763152778, 764530063, 766412020, 768974841, 772195756, 775829673, 779383421, 782669902, 785992682, 789149940, 791968107, 794600248, 796829939, 798903704, 801026702, 803018868, 804634511, 805662334, 806513011, 807567775, 808647692, 809576273, 810452461, 811324656, 812364221, 813614428, 814574897, 815051198, 815618396, 816484034, 817326784, 817896605, 818378150, 819021702, 819810152, 820540905]
1811.1H20540905N45681N10573N46873N50448O69659Q71658Q28981O06299M08053J75178
1831.5H26254308K31326M49002M28259L55303N29766O15895K81036J7047o378L8326
1851.9H29193890J87576L62337L87847K55287J21653K15888N33342N92590J29342j64867
1872.3H31814885j1563J97530L43442L95000L12030K07186K74062M24087L75867K24352
1892.7H34556878J22964L8087P8202K45750L03268J99556R2328O3241J02579K03967
1913.1H36006820L17037K46406K0146J4484J47701J11520P689j8537M4346J29819J90615
1935.5H37218046K22326J99675J16706N901K2590J32322J49727P1645N3883J65045
1955.9H38357866K55525K01225Q0943N8174J29223J81020J68264Q3208l0637l7432
$$ y = [820540905, 821086586, 821597159, 822144032, 822694480, 823364139, 824235797, 825064778, 825671077, 826079130, 826254308, 826485634, 826934636, 827362895, 827718198, 828247964, 828863859, 829144895, 829161942, 829155564, 829193890, 829381466, 829743803, 830131650, 830386937, 830508590, 830724478, 831257820, 831850410, 831979752, 831814885, 831803322, 832000852, 832344294, 832739294, 833051324, 833258510, 833532572, 833956659, 834332526, 834556878, 834679842, 834717929, 834796131, 835041881, 835345149, 835544705, 835637033, 835700274, 835802853, 836006820, 836323857, 836570263, 836590409, 836604893, 836752594, 836864114, 836871803, 836853266, 836897612, 837027431, 837218046, 837440372, 837640047, 837756753, 837762654, 837785244, 837917566, 838067293, 838138938, 838192821, 838357866, 838613391, 838814616, 838895559, 838953733, 839082956, 839263976, 839432240, 839515448, 839484811, 839447379]
1976.3H39447379P3373J53065J42694O9737J5676N4598J53422J38045L576r4473j15216
1998.8H40041876k3067O2704O974j18316k12132k13326j03473k861q5771l02255l97087
2021.2H38653266k81989j39952j31786k56717l61562l34322k36273j58370j42693j91510
2041.6H36418092k51710k06828o2764K7657j8716j04726p5817P2778J71542J26064
2062H36095572K7418r060N6147J72794K18034J01149n6505n4419J15216K38597J72436
2084.4H37077379L5703J2160J34349K40326K12669R0539L755O0022K14517K87176J67369
2106.9H38535964K1577L7671J42693J79827J36614M3154m5300K802J39475J54435K9683
2129.3H39378595o2644k6882Q5175J48833Q5771l3080k9624R8586J55509R7036K5213
$$ y = [839447379, 839520752, 839673817, 839816511, 839886248, 839901924, 839956522, 840109944, 840247989, 840251565, 840157092, 840041876, 840018809, 840081513, 840088487, 839970171, 839758039, 839544713, 839441240, 839438379, 839352608, 839050353, 838653266, 838371277, 838231325, 838099539, 837842822, 837481260, 837146938, 836910665, 836752295, 836609602, 836418092, 836166382, 835959554, 835896790, 835924447, 835905731, 835801005, 835725188, 835797966, 835969508, 836095572, 836122990, 836113930, 836170077, 836342871, 836560905, 836662054, 836605549, 836551130, 836666346, 836904943, 837077379, 837113082, 837125242, 837259591, 837499917, 837712586, 837803125, 837806880, 837866902, 838081419, 838368595, 838535964, 838557541, 838595212, 838737905, 838917732, 839054346, 839097500, 839052200, 839055002, 839194477, 839348912, 839378595, 839315951, 839289069, 839374244, 839523077, 839608848, 839575768, 839546144, 839644730, 839800239, 839897275, 839922488]
2151.7H39922488K3126J18196K26617K41697J86145J60337K03430K88308L61860L58283
2172.1H42090487K95163K84433L28481L53873L48508L23594L11494L37899L58462L19242
2192.5H45351636K61188K41220K52187K83301L21150L28422K90632K50995K59280L00884
2212.9H48140895L19541K92003K43306K10583K11001K41697K60114K21610J53184J13368
2233.3H50407302J40369J87636J89423J35482N7041O2883J61767J98782J40786P1227
2253.7H51752698L1770O8783J79112K07663O0260n8770N0962K58267L14355J73628
2274.1H53038728J4186P689J56582K73704J74820n0961j67251q4758Q4043J26302m5240
2296.5H53527844k31087k00749l2901J1980j26183l18110l96013k61665q0645r7513
$$ y = [839922488, 839945614, 840063810, 840290427, 840532124, 840718269, 840878606, 841082036, 841370344, 841732204, 842090487, 842385650, 842670083, 842998564, 843352437, 843700945, 844024539, 844336033, 844673932, 845032394, 845351636, 845612824, 845854044, 846106231, 846389532, 846710682, 847039104, 847329736, 847580731, 847840011, 848140895, 848460436, 848752439, 848995745, 849206328, 849417329, 849659026, 849919140, 850140750, 850293934, 850407302, 850547671, 850735307, 850924730, 851060212, 851117253, 851180136, 851341903, 851540685, 851681471, 851752698, 851784468, 851853251, 852032363, 852240026, 852300286, 852241516, 852292478, 852550745, 852865100, 853038728, 853052914, 853060603, 853217185, 853490889, 853665709, 853614748, 853447497, 853362739, 853446782, 853573084, 853527844, 853296757, 853096008, 853063107, 853075087, 852948904, 852630794, 852234781, 851973116, 851892471, 851794958]
2316.9H51794958l36528n50091m74155k37703j52946k72095l86775l38971k80202k38716
2337.3H48526776j65522k06828j85788K67982N67556J29163o32584j179278j166522
2355.7H45954955p28369k52426M3988J20819J28388L13879O14166P46369N81145L31998
2376.1H47854912K98083M49062N06520L16739k0266k58743k50102p9572N067j53363
2396.5H48668337l96967m53591k81096q2076q1479l03268n17250m92394k74598j55270
2416.9H45630348k93196n12838n75662m45425k81274k78891m68730o36697n86212m07875
2437.3H41143548l26991m44352o40691o85334n22017l30687l23415n26309o77168n78105
2457.7H36088479l53158k69949m21167n98967o19352m81844l03626k74300m45307o03854
$$ y = [851794958, 851458430, 850908339, 850434184, 850196481, 850043535, 849771440, 849384665, 849045694, 848765492, 848526776, 848361254, 848154426, 847968638, 848236620, 848804176, 848933339, 848300755, 847121477, 845954955, 845226586, 844974160, 845018148, 845138967, 845267355, 845581234, 846195400, 846941769, 847522914, 847854912, 848152995, 848602057, 849108577, 849425316, 849405050, 849146307, 848896205, 848816633, 848821700, 848668337, 848271370, 847817779, 847536683, 847454607, 847373128, 847069860, 846552610, 846060216, 845785618, 845630348, 845337152, 844824314, 844248652, 843803227, 843521953, 843243062, 842774332, 842137635, 841551423, 841143548, 840816557, 840372205, 839731514, 839046180, 838524163, 838193476, 837870061, 837343752, 836666584, 836088479, 835735321, 835465372, 835044205, 834445238, 833825886, 833344042, 833040416, 832766116, 832320809, 831716955]
2478.1H31716955n49674l76284k80798l29733m44412m72844l51011k02835k02775l49701
2498.5H28156888m62174m10676k86698k44201l07977m03642m22657l41773k63631k86639
2518.9H24726820l95298m83096m72545l84569l39091m22061n38409n73098n15938m14073
2539.2H20188642l96491n16951o32345o33121n27322m12226m22776n52475o43730n76556
2559.6H14874649m39823l94404m69207n59271n73039n16355m35352m36068n56230o30141
2580H09864759n37812l85344l15547l63946m65036m98175m28617l55244l78847m84705
2600.4H05651486n58198m97102l94702m19975n53369o78241p02441o43730o38783p18236
2620.8G99846709q09014q83877q71957p91609q29995r75489j028538r56237q70049
$$ y = [831716955, 831167281, 830790997, 830510199, 830180466, 829736054, 829263210, 828912199, 828709364, 828506589, 828156888, 827694714, 827284038, 826997340, 826753139, 826445162, 826041520, 825618863, 825277090, 825013459, 824726820, 824331522, 823848426, 823375881, 822991312, 822652221, 822230160, 821691751, 821118653, 820602715, 820188642, 819792151, 819275200, 818642855, 818009734, 817482412, 817070186, 816647410, 816094935, 815451205, 814874649, 814434826, 814040422, 813571215, 813011944, 812438905, 811922550, 811487198, 811051130, 810494900, 809864759, 809326947, 808941603, 808626056, 808262110, 807797074, 807298899, 806870282, 806515038, 806136191, 805651486, 805093288, 804596186, 804201484, 803781509, 803228140, 802549899, 801847458, 801203728, 800564945, 799846709, 799037695, 798153818, 797281861, 796490252, 795660257, 794684768, 793656230, 792699993, 791829944]
2639.2G91829944q65579r50396j029670j031876r49681q58545q64267r34542r75012
2657.5G83370376r50396q77917q16226q36909r04858r04203q05914p13229p25091p75456
2677.9G75060177p81357p48039o93977o54161o80625p59244p86602p18594o63579p26878
2698.3G67847121q17180q16166p73609p65920p98046q38280q54254q28802p74086p53403
2718.7G59827375q02099q46803p98107p00056o70433o91295o96957p01070o67512n93424
2739.1G52659619n73039o12319o39975o28233n75959n24819n43535o22451o49989n61833
2759.5G46727467m51148m52816n57185o07192n55396n09978n35845o27280p47680q23975
2779.9G40858972p95841p41422p85411r21130j040637j053453r93192r98557j112938
$$ y = [791829944, 790964365, 790013969, 788984299, 787952423, 787002742, 786144197, 785279930, 784345388, 783370376, 782419980, 781542063, 780725837, 779888928, 778984070, 778079867, 777273953, 776560724, 775835633, 775060177, 774278820, 773530781, 772836804, 772182643, 771502018, 770742774, 769956172, 769237578, 768573999, 767847121, 767029941, 766213775, 765440166, 764674246, 763876200, 763037920, 762183666, 761354864, 760580778, 759827375, 759025276, 758178473, 757380366, 756680310, 756009877, 755318582, 754621625, 753920555, 753253043, 752659619, 752086580, 751474261, 750834286, 750206053, 749630094, 749105275, 748561740, 747939289, 747289300, 746727467, 746276319, 745823503, 745266318, 744659126, 744103730, 743593752, 743057907, 742430627, 741682947, 740858972, 740063131, 739321709, 738536298, 737615168, 736574531, 735521078, 734527886, 733529329, 732416391]
2798.3G32416391j236021j292527j287699j279950j352191j520514j670003j674593
2814.6G21102893j621544j666844j812041j963913k013981j989842k035797k180278
2830.9G05818653k397656k599359k723634k954662l431320m065156m720092n209684
2847.2F77717090n253852m708946l729343k585888j521885q01742o43969j025379j717329
2865.6F55728757k417743k857268k977490k926767k851188k754986k608657k396226
2881.9F33938432k104342j843095j702964j580537j396119j222670j153648j230181
2898.2F21704876j388371j552879j805485k199769k660989l229917l946960m624962
2914.5F00295544m973591m783928m109144l157080k035141p66634N35905J702487K729893
$$ y = [732416391, 731180370, 729887843, 728600144, 727320194, 725968003, 724447489, 722777486, 721102893, 719481349, 717814505, 716002464, 714038551, 712024570, 710034728, 707998931, 705818653, 703420997, 700821638, 698098004, 695143342, 691712022, 687646866, 682926774, 677717090, 672463238, 667754292, 664024949, 661439061, 659917176, 659115434, 658471465, 657446086, 655728757, 653311014, 650453746, 647476256, 644549489, 641698301, 638943315, 636334658, 633938432, 631834090, 629990995, 628288031, 626707494, 625311375, 624088705, 622935057, 621704876, 620316505, 618763626, 616958141, 614758372, 612097383, 608867466, 604920506, 600295544, 595321953, 590538025, 586428881, 583271801, 581236660, 580470026, 581005931, 582708418, 585438311]
2932.9E85438311L637016M328370M791200N086124N170703M943848M454195L986538
2949.2F21836305L718495L520548L360808L375232L559232L808141M051805M226565
2965.5F51457131M270732M198373M092633L991783L840089L600359L244102K813578
2981.8F81508780K488255K312660K132714J847446J427650R40085N77748K95937r1374
3000.2F93439901m96984p81655r06765q33333o68764o40750p49350q29458q68916r18687
3020.6F85745239j038849j298308j555980j593768j500368j523793j743078j969934
3036.9F73521161j976550j883328j899778j996577k096236k154231k167702k122104
3053.2F57224655k053380k099454k177120k105474j976013j930297j985013k090871
$$ y = [585438311, 589075327, 593403697, 598194897, 603281021, 608451724, 613395572, 617849767, 621836305, 625554800, 629075348, 632436156, 635811388, 639370620, 643178761, 647230566, 651457131, 655727863, 659926236, 664018869, 668010652, 671850741, 675451100, 678695202, 681508780, 683997035, 686309695, 688442409, 690289855, 691717505, 692657590, 693235338, 693531275, 693439901, 692942917, 692161262, 691254497, 690421164, 689752400, 689111650, 688362300, 687532842, 686663926, 685745239, 684706390, 683408082, 681852102, 680258334, 678757966, 677234173, 675491095, 673521161, 671544611, 669661283, 667761505, 665764928, 663668692, 661514461, 659346759, 657224655, 655171275, 653071821, 650894701, 648789227, 646813214, 644882917, 642897904, 640807033]
3069.5F40807033k125979k035260j848042j725912j857102k049148k076626k055943
3085.8F25033021k021909j952469j994252k065122j978338j841545j829028j953483
3102.2F09396875k012193j887739j793861j875043j881242j711130j673579j839161
3118.5E94722927k011776k089262k036274j934171j871168j864076j910627j882970
3134.8E79122603j747191j703680j830339j931489j877129j778662j682460j611889
3151.1E64959764j720726j914859j905620j756549j690805j712560j727879j697779
3167.4E50832987j668036j672983j685500j656294j608968j595020j604617j594365
3183.7E37747204j548290j519561j533627j568139j587868j564800j526177j491070
$$ y = [640807033, 638681054, 636645794, 634797752, 633071840, 631214738, 629165590, 627088964, 625033021, 623011112, 621058643, 619064391, 616999269, 615020931, 613179386, 611350358, 609396875, 607384682, 605496943, 603703082, 601828039, 599946797, 598235667, 596562088, 594722927, 592711151, 590621889, 588585615, 586651444, 584780276, 582916200, 581005573, 579122603, 577375412, 575671732, 573841393, 571909904, 570032775, 568254113, 566571653, 564959764, 563239038, 561324179, 559418559, 557662010, 555971205, 554258645, 552530766, 550832987, 549164951, 547491968, 545806468, 544150174, 542541206, 540946186, 539341569, 537747204, 536198914, 534679353, 533145726, 531577587, 529989719, 528424919, 526898742, 525407672]
3200.1E25407672j433432j403928j417637j408100j377165j343489j320422j326620
3216.4E14376879j368165j370490j304448j264929j270235j273513j217723j160919
3232.7E04146457j251579j363337j326918j255870j191139j103700j107573j223862
3249D94322479j256436j107872r87649j032591j093715j072198j031459j006156r15497
3267.4D84818906p76768q36164j033425j074314j033128j005113r44882r10879r29743
3285.7D76274490r30994q65281q12024q57592r78440j082122j062393q81910p00772
3304.1D68102962q11190j130044j317114j316666j244039j193821j211137j252979
3320.4D58625972j249522j277864j427978j518875j474142j434833j388371j337916
$$ y = [525407672, 523974240, 522570312, 521152675, 519744575, 518367410, 517023921, 515703499, 514376879, 513008714, 511638224, 510333776, 509068847, 507798612, 506525099, 505307376, 504146457, 502894878, 501531541, 500204623, 498948753, 497757614, 496653914, 495546341, 494322479, 493066043, 491958171, 490970522, 489937931, 488844216, 487772018, 486740559, 485734403, 484818906, 484042138, 483205974, 482172549, 481098235, 480065107, 479059994, 478115112, 477204233, 476274490, 475343496, 474478215, 473666191, 472808599, 471830159, 470748037, 469685644, 468803734, 468102962, 467291772, 466161728, 464844614, 463527948, 462283909, 461090088, 459878951, 458625972, 457376450, 456098586, 454670608, 453151733, 451677591, 450242758, 448854387, 447516471]
3336.7D47516471j460969j698613j746119j646786j579255j528502j636714j884579
3353D34334934j948059j789450j654655j694650j763880j641452j521856j689643j973092
3371.4D18658197j997680j755118j565754j552224j588822j509905j324177j103669
3387.7D06260848q74966r34244j297980j349360r28908o43224r08852j313537j222074
3406.1C96787703q56399o80447o80775p61509p71164o15329m68522m33147l53337j59323
3426.5C91007751p15K474M9561K17289J81555m2259m3989K19465M65959N52416N26279
3448.9C93135786N46336O33121P29143Q78066J019955R54002R13590J198203J391381
3467.2D01399583J088768O64949O83785J007348J303822J363844J145601J066655J192420
$$ y = [447516471, 446055502, 444356889, 442610770, 440963984, 439384729, 437856227, 436219513, 434334934, 432386875, 430597425, 428942770, 427248120, 425484240, 423842788, 422320932, 420631289, 418658197, 416660517, 414905399, 413339645, 411787421, 410198599, 408688694, 407364517, 406260848, 405385882, 404451638, 403153658, 401804298, 400875390, 400232166, 399323314, 398009777, 396787703, 395931304, 395250857, 394570082, 393808573, 393037409, 392422080, 391953558, 391520411, 391167074, 391007751, 391007036, 391009510, 391059071, 391276360, 391457915, 391415656, 391371667, 391591132, 392057091, 392609507, 393135786, 393682122, 394315243, 395044386, 395922452, 396942407, 397896409, 398809999, 400008202, 401399583, 402488351, 403153300, 403837085, 404844433, 406148255, 407512099, 408657700, 409724355, 410916775]
3485.6D10916775J178593J127750J234948J353711J407802J401484J402974J396239
3501.9D21420276J236588J114935J209288J362592J514405J562894J451880J419633
3518.2D32292491J589000J815021J770854J513005J419455J552671J758963J932770
3534.5D45644230J936495J841605J989275K226770K177179J868188J774997K010285
3550.9D61469024K177924K247066K392560K521694K547472K594650K709925K809376
3567.2D81469691K783626K741426K835423L045082L235907L372848L547728L719508
3583.5E06751239L692806L474236L438472L604472L778338L906847L975927L966511
3599.8E36588848L973543M088164M148721M161895M147112M080772M072786M075169
$$ y = [410916775, 412095368, 413223118, 414458066, 415811777, 417219579, 418621063, 420024037, 421420276, 422656864, 423771799, 424981087, 426343679, 427858084, 429420978, 430872858, 432292491, 433881491, 435696512, 437467366, 438980371, 440399826, 441952497, 443711460, 445644230, 447580725, 449422330, 451411605, 453638375, 455815554, 457683742, 459458739, 461469024, 463646948, 465894014, 468286574, 470808268, 473355740, 475950390, 478660315, 481469691, 484253317, 486994743, 489830166, 492875248, 496111155, 499484003, 503031731, 506751239, 510444045, 513918281, 517356753, 520961225, 524739563, 528646410, 532622337, 536588848, 540562391, 544650555, 548799276, 552961171, 557108283, 561189055, 565261841, 569337010]
3616.1E69337010M070342M030287L846467L826916L953099M008651L896117L631950
3632.4F00600839L566324L608644L599465L615499L724217L875971L915727L697992
3648.8F30204678L241658K887070K830386L030181L136039K988756K840161K940774
3665.1F54099703L075480K952993K774656K587199K275527K015650J962006K053499
3681.4F73796713K278984K550542K624810K117276J491249J482069J697660J746237
3697.7F89785540J672804J553238J512885J685023J869798J690447J212657J090586
3714G02072978J233995J299977J249254J157403J141548J124978J173973J359701J576663
3732.4G13390470J406967Q90792Q09371J080573J053512Q23796R74237R66251M89295
$$ y = [569337010, 573407352, 577437639, 581284106, 585111022, 589064121, 593072772, 596968889, 600600839, 604167163, 607775807, 611375272, 614990771, 618714988, 622590959, 626506686, 630204678, 633446336, 636333406, 639163792, 642193973, 645330012, 648318768, 651158929, 654099703, 657175183, 660128176, 662902832, 665490031, 667765558, 669781208, 671743214, 673796713, 676075697, 678626239, 681251049, 683368325, 684859574, 686341643, 688039303, 689785540, 691458344, 693011582, 694524467, 696209490, 698079288, 699769735, 700982392, 702072978, 703306973, 704606950, 705856204, 707013607, 708155155, 709280133, 710454106, 711813807, 713390470, 714797437, 715688229, 716497600, 717578173, 718631685, 719455481, 720429718, 721395969, 721885264]
3750.7G21885264L73244P99060R78291P44999N79476P35223R23157R42647P25806M51923
3771.1G29139090M91380P70510R27567P88987O15000N98371O00279O31869O99222P22944
3791.5G35985219P37012P98821Q97348Q02756M95374L94881L91423L08514M24147P13408
3811.9G41948903Q20398P31111P57575N99622K60055K52366L62337M40598N58555O90579
3832.3G47422099Q25167O60240K42889J40191J75893J86622M15206P76052Q88646L44336
3852.7G52077341j89066J70469M58062M68195M04358L97264N18978M60088K36154J46210
3873.1G55148053K11895L91602M73917M18424L78430K50042J13725J45793K19882K77519
3893.5G58029282M00245N63979N93305L58224p1585k99454j01209J97649L73245M14252
$$ y = [721885264, 722258508, 723057568, 724035859, 724780858, 725360334, 726095557, 727018714, 727961361, 728687167, 729139090, 729630470, 730400980, 731328547, 732117534, 732732534, 733330905, 733931184, 734563053, 735262275, 735985219, 736722231, 737521052, 738418400, 739221156, 739716530, 740111411, 740502834, 740811348, 741235495, 741948903, 742769301, 743500412, 744257987, 744857609, 745117664, 745370030, 745732367, 746172965, 746731520, 747422099, 748247266, 748907506, 749150395, 749290586, 749466479, 749653101, 750068307, 750844359, 751733005, 752077341, 751888275, 752058744, 752516806, 752985001, 753389359, 753786623, 754305601, 754765689, 755001843, 755148053, 755359948, 755751550, 756225467, 756643891, 757022321, 757272363, 757386088, 757531881, 757751763, 758029282, 758429527, 758993506, 759586811, 759945035, 759873450, 759573996, 759472787, 759670436, 760043681, 760457933]
3913.9G60457933L33130J92702J15872J47879J98602K08974K28942K04503R3818M9293
3934.3G62231648J39892K36511K37048J97232K05517K21788J81020J29223R7394R6380
3954.7G63973653J68443K37942K01702J14739J10328J90795K27212J99914J87159J45435
3975.1G65757322N1797K4914J15276K50161K67267J55985J15693J37090J56343J86861
3995.5G67218709J36316
3997.5G67355025
$$ y = [760457933, 760791063, 760983765, 761099637, 761247516, 761446118, 761655092, 761884034, 762088537, 762182355, 762231648, 762371540, 762608051, 762845099, 763042331, 763247848, 763469636, 763650656, 763779879, 763877273, 763973653, 764142096, 764380038, 764581740, 764696479, 764806807, 764997602, 765224814, 765424728, 765611887, 765757322, 765809119, 765834033, 765949309, 766199470, 766466737, 766622722, 766738415, 766875505, 767031848, 767218709, 767355025]
##END=$$ End of the data block
