##TITLE=3 $$ Begin of the data block
##JCAMP-DX=5.00 $$ ACD/SpecManager v 10.08
##SPECTROMETER/DATA SYSTEM=Alpha
##DATE=16 Apr 2014 10:35:00
##DATA TYPE=INFRARED SPECTRUM
##DATA CLASS=XYDATA
##ORIGIN=
##OWNER=
##NPOINTS=1765
##FIRSTX=399.75695801
##LASTX=3997.56933594
##MAXX=3997.56933594
##MINX=399.75695801
##MAXY=0.87557203
##MINY=0.21696086
##XFACTOR=1.0000000000
##YFACTOR=1.000000000000000e-9
##FIRSTY=0.76089507
##DELTAX=2.03957629
##XUNITS=1/CM
##YUNITS=ARBITRARY UNITS
##XYDATA=(X++(Y..Y))
399.8G60895073l151893j1430204o942392M782856Q681178j81258j0244548r333968
416.1G33074844J991272J0558724L009796p961273r068787K47598Q227289M641592
432.4G44721055o332576j1110962l849864N402506M936814m612386j1272967p025123
448.7G10856497K454222N388736j374960r412944q289874J142860O498217K196968
465G09459722n887568p615447p38263O619394N090892l222406q142173m247368L281415
483.4F94598198N100191q48771o928503n617380J526236N574644J772761n294621p353544
501.7F82529211j955688L577232K190352m291296q130312m953504J263798L144443
518.1F73374236j289547o047666n114973P48992M750371K160728l447711n299091j459659
$$ y = [760895073, 757743180, 746312976, 739370584, 744153440, 752834618, 752653360, 742408812, 733074844, 735066116, 745624840, 748634636, 740673363, 731604576, 731852174, 740079463, 744721055, 738388479, 727277517, 723427653, 728830159, 733766973, 729154587, 717881620, 710856497, 713310719, 718699455, 717324495, 707911551, 699621677, 700764537, 707262754, 709459722, 703572154, 695956707, 695218444, 701837838, 706928730, 703706324, 695564151, 691316783, 694598198, 699698389, 698849618, 691921115, 686303735, 687829971, 693404615, 695177376, 689882755, 682529211, 680573523, 684150755, 686341107, 682049811, 673919499, 668965995, 670229793, 673374236, 672084689, 666037023, 660922050, 661671042, 666421413, 668582141, 665134430, 659835339, 658375680]
536.4F58375680L093183K687574k211094n684316l582418J471460L392458J31428m183233
554.8F53490722m302144j47402L204644J940012k232552m348278j779914K406001L151059
573.1F51382148j91092l392995k548217J175344L431677J736880j776755k876341l56138
591.5F46584511K713442K642393m19259k715111j451969J835763L243685J227736j655697
609.8F52005494k001286N09024K850353K192140o45697k065659l85105K332866L068089
628.2F57860219J396418m42028k02954J956880L494144K543986K49266o96659O47426
646.5F66806698K595246K852380J013398p92622m61221J527309K748788J900851L17991
664.9F78508818j98126J209975K669751K548695J432359M07219R88066K486766L213763
$$ y = [658375680, 661468863, 664156437, 661945343, 656261027, 652678609, 654150069, 657542527, 657673955, 653490722, 649188578, 649041176, 652245820, 654185832, 651953280, 647605002, 645825088, 648231089, 651382148, 651191056, 647798061, 645249844, 646425188, 649856865, 651593745, 649816990, 646940649, 646584511, 649297953, 651940346, 651521087, 648805976, 647354007, 649189770, 652433455, 653661191, 652005494, 650004208, 650513232, 653363585, 655555725, 654910028, 652844369, 652459264, 654792130, 657860219, 659256637, 658814609, 658611655, 660568535, 664062679, 666606665, 666855931, 666159272, 666806698, 669401944, 672254324, 673267722, 672475100, 672013879, 673541188, 676289976, 678190827, 678508818, 678310692, 679520667, 682190418, 684739113, 686171472, 686578691, 687566757, 690053523, 693267286]
683.3F93267286K389431P75397l4035K92361L70920o85871k114236k221763j54615
701.6F91884875L089309N546331O038845N079448M110575L949046M116416L671825
717.9G27486670K494156J515031J496494K258718K876580K605259J654744R87232J281798
736.3G44656682J977563K088964J339614M66287M10736J294494K302468K629101K185762
754.6G59351671J634836J772642K494693K951085K523601J529992Q77261J197875K089500
773G76423156K475500J894474R82047P88271J602411K511621K386331J215816J75893
791.4G90455520L70264J425207J932859J130343j44541m25220O41286J987219K199710
809.7G99572647J100063K2232K63989J399458J783132O32048j025975j458645j35481
$$ y = [693267286, 695656717, 696432114, 696398079, 696690440, 697061360, 696375489, 694261253, 692039490, 691884875, 694974184, 700520515, 706559360, 711638808, 715749383, 719698429, 723814845, 727486670, 729980826, 731495857, 732992351, 735251069, 738127649, 740732908, 742387652, 743374884, 744656682, 746634245, 748723209, 750062823, 750529110, 750939846, 752234340, 754536808, 757165909, 759351671, 760986507, 762759149, 765253842, 768204927, 770728528, 772258520, 773135781, 774333656, 776423156, 778898656, 780793130, 781775177, 782563448, 784165859, 786677480, 789063811, 790279627, 790455520, 790825784, 792250991, 794183850, 795314193, 795169652, 794744432, 795385718, 797372937, 799572647, 800672710, 800694942, 800958931, 802358389, 804141521, 804773569, 803747594, 802288949, 802153468]
828.1H02153468J630485K151132J276374N44846J352846L107787L786265K274573l9994
846.4H18237782p27356P87556K644956K685547R25183n86211j43767J619041K299428
864.8H27742159P23064j505732k066374n08487J291930J199603m70578j334131N3823
883.1H25125277K420425L227056J562476p29502j036286Q96037K618968J945377m42267
901.5H35587561j838446p23123J423955J787484m15326k938389l126800r54032J057148
919.8H29860032Q44299q53836j513720P5221K275646K503395L78490j696706j370192
938.2H30502629Q82089K300144J022577j628161k681493j111210J064778J168728j066328
956.6H30453753l037035k401710n3644J102329l67821k888560l618598j764655L99589
$$ y = [802153468, 803783953, 805935085, 807211459, 807756305, 809109151, 812216938, 816003203, 818277776, 818237782, 817510426, 818297982, 820942938, 823628485, 824553668, 823967457, 823823690, 825442731, 827742159, 828465223, 826959491, 824893117, 824384630, 825676560, 826876163, 826405585, 825071454, 825125277, 827545702, 830772758, 832335234, 831605732, 830569446, 831465483, 834084451, 836029828, 835587561, 833749115, 833025992, 834449947, 836237431, 835822105, 832883716, 829756916, 828802884, 829860032, 830704331, 829850495, 828336775, 828411996, 830687642, 833191037, 833569527, 831872821, 830502629, 831384718, 833684862, 834707439, 833079278, 830397785, 829286575, 830351353, 831520081, 830453753, 827416718, 825015008, 824961364, 826063693, 825695872, 822807312, 819188714, 817424059, 817823648]
974.9H17823648K81334j922786l530621k585054j33216J063406k57492k358973k565920
993.3H05814326n65887J208008N31196j937687l475785k571226o52909l20017k398133
1011.6G95631886m948974n526245m124224k933621l624082n462646o283820m978836
1027.9G57749438k690196j609862k623856m219412m230321k564132j119912j326382
1044.3G37365365k491951k588510p41840J569390K244175Q43584r72926j281202j73748
1062.6G33772337N30422l98755k178311k886653j727998n0784L36707o99639j622796
1081G25074530j050473N17130J216114P9930j828492k652347j840770o71089o41108
1099.3G18203425j636922k046764q30591J091361J868368P64131j024902j716673r83298
$$ y = [817823648, 818104982, 816182196, 812651575, 810066521, 809933305, 810996711, 810739219, 808380246, 805814326, 805248439, 806456447, 806987643, 805049956, 801574171, 799002945, 798350036, 798030019, 795631886, 790682912, 785156667, 781032443, 778098822, 774474740, 769012094, 762728274, 757749438, 755059242, 753449380, 750825524, 746606112, 742375791, 739811659, 738691747, 737365365, 734873414, 732284904, 731543064, 733112454, 735356629, 736200213, 735227287, 733946085, 733772337, 734302759, 733904004, 731725693, 728839040, 727111042, 727060258, 727396965, 726697326, 725074530, 724024057, 724541187, 725757301, 725837231, 724008739, 721356392, 719515622, 718844533, 718203425, 716566503, 714519739, 713689148, 714780509, 716648877, 717413008, 716388106, 714671433, 713688135]
1117.7G13688135j71184m87745j522422j742303k71976J970708L064454K148807L65734
1136G17042208o24121n12540m05192j330078k936959l866315l321052j959920j137375
1154.4G00948656j405180j984835j808345q71181l20375j066327k359212k323389k26974
1172.7F88582838K382457L321588K060354j2339j168429j011074n58734p74443j499295
1191.1F91322923j913190j648426j263321j540482k426326k965450k380789j101255
1207.4F76083684l65675q90374k135336l007770l027916k713143k924741l716647m272163
1225.8F53029919m001916l209412k603650k515912k540410k028286r29654J73807P00415
1244.1F36074901O75261O57677J037896J548052J565277R14634J77264j8478L56436
$$ y = [713688135, 713516951, 713029206, 711506784, 709764481, 709492505, 711463213, 714527667, 716676474, 717042208, 716418087, 715905547, 715500355, 714170277, 711233318, 707367003, 704045951, 702086031, 700948656, 699543476, 697558641, 695750296, 694879115, 694558740, 693492413, 691133201, 688809812, 688582838, 690965295, 694286883, 696347237, 696334898, 695166469, 694155395, 693596661, 692822218, 691322923, 689409733, 687761307, 686497986, 684957504, 682531178, 679565728, 677184939, 676083684, 675718009, 674827635, 672692299, 669684529, 666656613, 663943470, 661018729, 657302082, 653029919, 649028003, 645818591, 643214941, 640699029, 638158619, 636130333, 635200679, 635374486, 636074901, 636750162, 637407839, 638445735, 639993787, 641559064, 642473698, 642650962, 642632484, 642988920]
1262.5F42988920P73967P31468L64065K09570N23269R58264R71377M80771q464K1279
1282.9F48014486N63502J091838J071453N35309j0311k00629k15948m44591r17018
1301.2F49488091j214087r95159l89695J85967M83453P00951J093328J694858K222299
1319.6F53270006K184153J593232J018524Q03530Q13186P05779K89202j77086j62184
1338F60338342O41704J565993J818061J644492J592159J827896K047479J878857J217485
1356.3F74572468K37524r08136k216339l536344l930926k069175J281142L113806K436936
1374.7F68980956L02196k026260l879786m809141m115522j317382K319515L803313
1391F59257889L023863J541376p0930j650989k948165l955066m538417m244447l871679
$$ y = [642988920, 643762887, 644494355, 644858420, 645067990, 645591259, 646549523, 647520900, 648001671, 647993207, 648014486, 648577988, 649669826, 650741279, 651276588, 651266277, 651065648, 650849700, 650405109, 649488091, 648274004, 647278845, 646889150, 647075117, 647558570, 648259521, 649352849, 651047707, 653270006, 655454159, 657047391, 658065915, 658869445, 659682631, 660388410, 660677612, 660500526, 660338342, 660980046, 662546039, 664364100, 666008592, 667600751, 669428647, 671476126, 673354983, 674572468, 674809992, 673901856, 671685517, 668149173, 664218247, 662149072, 663430214, 666544020, 668980956, 669283152, 667256892, 663377106, 658567965, 654452443, 653135061, 655454576, 659257889, 662281752, 663823128, 663752198, 662101209, 659153044, 655197978, 650659561, 646415114, 642543435]
1409.3F42543435l732443l322780k720714k135813j340747j081943k157807l682375
1425.7F22368813n306364p329762q753240r329378j0529578r902120o655693n052447
1442E59510231m676819m082739k633393k59161J789451L775954Q589566J4226198J2386083
1460.3E88625371Q868337P465065O662607O243169Q167088J2761891J4043272R752810
1476.6F62589610M420757o49035m898548q457303j2320757j6659141j9150674j7930329
1493E86944580j8084228j9842446j7775953j4312386j2922704j5472144k0122886j6716123
1509.3D51695710j3335168j2992293j0765522o588877k820521j851618k697587l755033
1525.6C96889091m347235l865838l415883k704203j161337J88112K511770O159156
$$ y = [642543435, 638810992, 635488212, 632767498, 630631685, 629290938, 628208995, 626051188, 622368813, 617062449, 609732687, 600979447, 591650069, 581120491, 571218371, 564562678, 559510231, 554833412, 550750673, 548117280, 547858119, 549647570, 553423524, 562013090, 576239288, 588625371, 597493708, 604958773, 611621380, 617864549, 626031637, 638793528, 652836800, 662589610, 667010367, 666361332, 661462784, 653005481, 640684724, 624025583, 604874909, 586944580, 568860352, 549017906, 531241953, 516929567, 504006863, 488534719, 468411833, 451695710, 438360542, 425368249, 414602727, 408013850, 405193329, 403341711, 400644124, 396889091, 392541856, 388676018, 385260135, 382555932, 381394595, 381582707, 384094477, 390253633]
1541.9C90253633Q472771J0326236J2328237J5188724J7572642J8743932J8601239
1556.2D91487414K3416191K9160142K0894468J6651332J6016781J4651299J3785243
1570.5F26062870J0359347O996512N317688K363861j123965m133701o661535r262383
1586.8F29918694j2002885j4374435j5592456j5969157j5913784j6061068j6659439
1601.1E23345470j6885459j6416311j6028643j6159564j5551031j4033794j3695777
1615.3D14574891j4221042j1896074j1326551j3512969j3734043j3185859j3048976
1629.6C23649377j1912972j1986107j4137715j2396633r256304q455843q270308q730873
1645.9B38502622p837490n025014m335642l714889o28725P45237J642272L009170M255310
$$ y = [390253633, 398726404, 409052640, 421380877, 436569601, 454142243, 472886175, 491487414, 514903605, 544063747, 564958215, 581609547, 597626328, 612277627, 626062870, 636422217, 643418729, 648736417, 651100278, 649976313, 645842612, 639181077, 629918694, 617915809, 603541374, 587948918, 571979761, 556065977, 540004909, 523345470, 506460011, 490043700, 474015057, 457855493, 442304462, 428270668, 414574891, 400353849, 388457775, 377131224, 363618255, 349884212, 336698353, 323649377, 311736405, 299750298, 285612583, 273215950, 263959646, 255503803, 247233495, 238502622, 230665132, 225640118, 221304476, 217589587, 216960862, 217706099, 219348371, 222357541, 226612851]
1664.3B26612851M432678N146161O609991O815404P591948Q886933Q689910Q284241
1680.6B83070117R869546J4272034J4989019J4034956J5680611J6231805J9348026
1694.9C87496114K3022055K4369836K8743327K5442660K2426963K3445308K0992935
1709.2E55939198J7843663J5287817J3677954J4305115J3863266J1021197R306252
1723.4F51244462Q454918P473410O950676O483376P187247P577479N926192N677283
1739.7G06975043O433308O405532N873025N391836N969465P173717O845116N909324
1756.1G56976366N093455M217208M330814M623830M000545L045737K191544K430975
1772.4G86910474L548324L617049K858519K093852J821577K189637K725601K459049
$$ y = [226612851, 231045529, 236191690, 242801681, 249617085, 257209033, 266095966, 274785876, 283070117, 292939663, 307211697, 322200716, 336235672, 351916283, 368148088, 387496114, 410518169, 434888005, 463631332, 489073992, 511500955, 534946263, 555939198, 573782861, 589070678, 602748632, 617053747, 630917013, 641938210, 651244462, 659699380, 667172790, 674123466, 680606842, 687794089, 695371568, 701297760, 706975043, 713408351, 719813883, 725686908, 731078744, 737048209, 744221926, 751067042, 756976366, 762069821, 766287029, 770617843, 775241673, 779242218, 782287955, 784479499, 786910474, 790458798, 794075847, 796934366, 799028218, 800849795, 803039432, 805765033, 808224082]
1788.7H08224082J594186J453519J960933K213478K222300K063751J622796J188993
1805H22544038J231671J699984K024770J650452R29177P79211J368106J658141J160622
1823.4H35046172N06878K19345P04706J880169K099037J112282K99633K42650N15938
1841.7H42626810R90689J383066R04620L53276N77927J175463J312256O95229J8060
1860.1H50037396q941M69685P11381N24700L10481K23159M35889R49204J060426M36187
1880.5H55149567k41637k20537L67164Q32796P75457J41263l22223J68920J009822
1898.8H57660592J152277M80890k70069l24011L90053J057029P67589k49804p64548
1917.2H59899998m3571Q89241J058221N11527k40624l26931L50535Q73864N53846k80500
$$ y = [808224082, 809818268, 811271787, 813232720, 815446198, 817668498, 819732249, 821355045, 822544038, 823775709, 825475693, 827500463, 829150915, 830080092, 830859303, 832227409, 833885550, 835046172, 835553050, 835772395, 836477101, 838357270, 840456307, 841568589, 841868222, 842110872, 842626810, 843617499, 845000565, 845905185, 846258461, 846836388, 848011851, 849324107, 850019336, 850037396, 850028455, 850498140, 851209521, 851734221, 852044702, 852267861, 852703750, 853652954, 854713380, 855149567, 854907930, 854687393, 855054557, 855887353, 856662810, 856804073, 856481850, 856650770, 857660592, 858812869, 859293759, 859023690, 858699679, 859089732, 860146761, 860914350, 860664546, 859899998, 859856427, 860745668, 861803889, 862315416, 862074792, 861747861, 862098396, 862972260, 863526106, 863245606]
1937.6H63245606p83026l86536O26505J016259L28004m83692n04374K06470Q06153
1955.9H64071369N49495k47001o15597k01464N21541Q52227L64661m07397m67003K25783
1976.3H64646614P85172N32388k49207o68049k39908M98891O95049K09034l93212m13775
1996.7H65402997K31981P80761M89712l11732o93381k19822N74648P63834J22487n79536
2017.1H66561949n24342J50562O86943M83155k78771p07805k58624N35786P60376J76132
2037.5H67585361n38349n34535J46628O91891M92811k21432o50107k71559M90069P43628
2057.9H67934406K03848n01991n59806R6380O95229N20825k08258o34611k64406M64976
2078.3H67746592P55369K81811m12881m85301J14441O71625N35786j40369n56946k26140
$$ y = [863245606, 862462580, 862076044, 862702549, 863718808, 864046812, 863563120, 863058746, 863265216, 864071369, 864620864, 864373863, 863758266, 863556802, 864078343, 864930570, 865295231, 864887834, 864420831, 864646614, 865431786, 865964174, 865714967, 865046918, 864807010, 865305901, 866000950, 866209984, 865816772, 865402997, 865634978, 866415739, 866905451, 866593719, 865900338, 865680516, 866255164, 867018998, 867141485, 866561949, 866037607, 866188169, 866875112, 867358267, 867079496, 866371691, 866113067, 866648853, 867409229, 867585361, 867047012, 866512477, 866659105, 867350996, 867843807, 867622375, 866972268, 866700709, 867190778, 867934406, 868138254, 867636263, 867076457, 867172837, 867868066, 868388891, 868180633, 867546022, 867281616, 867746592, 868501961, 868783772, 868370891, 867885590, 868000031, 868671656, 869207442, 869067073, 868510127, 868283987]
2098.7H68283987M57764P25627K88903l48389m48942Q2076O18159N23150j07228n25296
2119.1H69549811k21551M38929P09236L05414l06964m01557J27793O34312N12362q2612
2139.5H71265173m64261j85668M34875O76334K63512l14116l91126P2599N38766M85778
2159.9H72381866m1783m38034k35081L35276O33061L10302k64108m05610J7583M78030
2180.3H72771502M36246o6340m53174k70009K75731N79953L20733j91272l51607n722
2200.7H73046041M11510M12583j4245l76463k38419K59102N55336L21210j62661l42072
2221.1H73871922l9160L70920M07994K7418l23236k24114K01464M60565K83659j25110
2241.5H74912322l02077o0856K80917L36289N7459k56300k33054J19686L77953K50697
$$ y = [868283987, 868741751, 869467378, 869756281, 869407892, 868958950, 869041026, 869659185, 870182335, 870075107, 869549811, 869328260, 869767189, 870476425, 870781839, 870474875, 870073318, 870201111, 870835423, 871347785, 871265173, 870800912, 870615244, 871050119, 871726453, 871989965, 871675849, 871284723, 871357322, 871896088, 872381866, 872340083, 871902049, 871666968, 872002244, 872635305, 872945607, 872681499, 872275889, 872293472, 872771502, 873207748, 873141408, 872688234, 872418225, 872693956, 873273909, 873594642, 873403370, 873051763, 873046041, 873457551, 873870134, 873855889, 873479426, 873241007, 873500109, 874055445, 874376655, 874213994, 873871922, 873832762, 874203682, 874611676, 874639094, 874315858, 874091744, 874293208, 874753773, 875037432, 874912322, 874610245, 874549389, 874830306, 875166595, 875224054, 874967754, 874734700, 874854386, 875232339, 875483036]
2261.9H75483036j13606k96593q0943K57075K98798Q583k84970k93136J1027L16322
2282.3H75305593K66433j01447l51847k07245J03653K01225k0445k97486l19124o1035
2302.7H74518275J73450J06275j98364m06504k89381j7225O2644j62840m39822m67897
2323.1H72878611k05696R0063J38164n4717k52247k74360j46866q464n186j15573o8844
2345.5H71974885J97530K71738M6491l20017n83589n10156j62482O6042J430p2062
2365.9H70909810m2081J27614M23729N41866L28660M1664j6034J51873K92003J67131
2386.3H72926235j41501l20375k20180K027Q2969p9691l12984l74794k22623j0371
2406.7H71328712K2172j99079m01139l42250j16646N0842k9623l02434m39167k78116
$$ y = [875483036, 875369430, 875072837, 874991894, 875248969, 875547767, 875556350, 875271380, 874978244, 874989271, 875305593, 875572026, 875470579, 875118732, 874911487, 875015140, 875216365, 875195920, 874898434, 874579310, 874518275, 874691725, 874798000, 874599636, 874193132, 873903751, 873886526, 873949170, 873786330, 873346508, 872878611, 872672915, 872762978, 872901142, 872846425, 872594178, 872319818, 872172952, 872164488, 872159302, 872043729, 871974885, 872172415, 872444153, 872490644, 872170627, 871587038, 871076882, 870914400, 870980442, 870981872, 870909810, 870867729, 870995343, 871419072, 871960938, 872289598, 872331262, 872315228, 872467101, 872759104, 872926235, 872784734, 872464359, 872244179, 872246206, 872329175, 872249484, 871936500, 871561706, 871339083, 871328712, 871350884, 871151805, 870750666, 870408416, 870291770, 870342612, 870312989, 870010555, 869571388, 869293272]
2427.1H69293272l2901J6808j56343l55124l60251j38461P5280Q047k74599m26590
2447.5H67649138k85864m9531o0j85549m11093m35472k08497K2113l0398l20852m96805
2469.9H65247130l78787j48654m5657j81675m24862m64559k29001J5974J4425k30849
2490.3H63173485m56333l89099q4699R6858o0380l51071m30346k10702O8426J00732
2510.7H61456871j63496m37676l94106q5831R8407o7413l70085m53114k38955J9610
2531.1H59364212K0086k48968m89176m37200j59323Q583j82032n30959o08325l24428
2551.5H56412470k1398l4034l32415n97239n46574k47538o5148k27094n43952o26504
2571.9H53170574l73185p8320o1155l51786o21319n41091k31982p4505k38419n33283
$$ y = [869293272, 869260371, 869277179, 869120836, 868765712, 868405461, 868267000, 868342280, 868350327, 868075728, 867649138, 867363274, 867313743, 867313683, 867128134, 866717041, 866281569, 866073072, 866095185, 866064787, 865743935, 865247130, 864868343, 864719689, 864674032, 864492357, 864067495, 863602936, 863373935, 863389909, 863404334, 863173485, 862717152, 862328053, 862243354, 862340212, 862279832, 861928761, 861498415, 861287713, 861356139, 861456871, 861293375, 860855699, 860461593, 860375762, 860474169, 860406756, 860036671, 859583557, 859344602, 859364212, 859384298, 859135330, 858646154, 858208954, 858049631, 858058214, 857876182, 857345223, 856736898, 856412470, 856391072, 856357038, 856024623, 855427384, 854880810, 854633272, 854568124, 854341030, 853797078, 853170574, 852797389, 852719069, 852657914, 852306128, 851684809, 851143718, 850911736, 850837231, 850598812, 850065529]
2592.3H50065529o28531l94404q1598o4552l72946o39677n52297k16901l696j37865
2612.7H46973062m55320n56946k77519O8783Q7262k35022n38468m78744j32680Q1002
2633.1H44535410q7142m15146m85301j82629J33992Q8811k36750m87745m40776j47879
2653.5H42274845O3121j26421n21184o02006k75970K5570l6239l64185o11960n40376
2673.9H39285195k47359q7679k82109o16788o87719l91185n8711o5744m09066p09296
2694.3H35729539o31332l15130j86980m16398p29918p66099n00559k62916l73483p55012
2714.6H30791712j003504q61168m96089l11911m87924p65383p70450m78983k01166
2733H25415134k11775m87864o99818n84245k80499j73629m12762p14957p65741n41985
$$ y = [850065529, 849436998, 849042594, 848960996, 848896444, 848523498, 847883821, 847331524, 847114623, 847110927, 846973062, 846517742, 845960796, 845683277, 845752060, 845839322, 845604300, 845065832, 844587088, 844454408, 844535410, 844448268, 844033122, 843547821, 843365192, 843499184, 843587995, 843351245, 842863500, 842422724, 842274845, 842337966, 842211545, 841690361, 841088355, 840812385, 840837955, 840801716, 840437531, 839825571, 839285195, 839037836, 838950157, 838668048, 838051260, 837363541, 836972356, 836913645, 836847901, 836438835, 835729539, 835098207, 834783077, 834596097, 834179699, 833449781, 832683682, 832183123, 831920207, 831546724, 830791712, 829788208, 828927040, 828430951, 828119040, 827631116, 826865733, 826095283, 825616300, 825415134, 825203359, 824715495, 824015677, 823431432, 823150933, 822977304, 822564542, 821849585, 821083844, 820541859]
2753.4H20541859l17932m10437p52628r38356p71761m92394m25339o22034q55028q47280
2773.8H14108670o08027m34518n46813q45909j014650q85129o42240o29544q92282
2792.2H07609558j116693j064062q16524o67930q04841j110792j248181j042962p86066
2810.5G98951507q02279j012862j156807j097858q96453p81596r44197j263857j436472
2828.9G89559126j386762j375615j684726k324462l108978l854453m500926n159736
2845.2G66163468n835175o204665n880773m843652l632009k976299l287792m485070
2861.5G29018033o007433p113815p265210o217956m069269j325369J258910L019750
2877.8G01297641L650486L337145K564013J673877P44284k74122j400531k447009l139972
$$ y = [820541859, 820223927, 819813490, 819060862, 818122506, 817350745, 816858351, 816433012, 815810978, 814955950, 814108670, 813500643, 813066125, 812519312, 811673403, 810658753, 809773624, 809131384, 808501840, 807609558, 806492865, 805428803, 804612279, 803944349, 803139508, 802028716, 800780535, 799737573, 798951507, 798149228, 797136366, 795979559, 794881701, 793985248, 793203652, 792259455, 790995598, 789559126, 788172364, 786796749, 785112023, 782787561, 779678583, 775824130, 771323204, 766163468, 760328293, 754123628, 748242855, 743399203, 739767194, 736790895, 733503103, 729018033, 723010600, 715896785, 708631575, 702413619, 698344350, 697018981, 698277891, 701297641, 704948127, 708285272, 710849285, 712523162, 713267446, 712993324, 711592793, 709145784, 706005812]
2896.2G06005812l427565l521443l696024m077554m559755m951537n285323n754232
2912.5F70732379o314278o696999o748557o519914o121456n566478m729152l536820
2928.8F24498725k090335n53131Q75711K025605K781629K907574K057732J42216k422213
2947.2F30223513m895866o564558p039368o216943m233241j593530J099109L457546
2963.5F04236662N337119O660879P377446P665157P857979Q134245Q434773Q547902
2979.8F64252162Q277833P783175P381320P015526O414831N489945M409314L455221
2996.1G14479327K689958J993835J291454N94914P5817j33217j64926k78532n99742
3014.5G19948888j018822j360655j586020j794815k040744k200544k104700j745879
$$ y = [706005812, 702578247, 699056804, 695360780, 691283226, 686723471, 681771934, 676486611, 670732379, 664418101, 657721102, 650972545, 644452631, 638331175, 632764697, 628035545, 624498725, 622408390, 621855259, 622730970, 624756575, 627538204, 630445778, 632503510, 632645726, 630223513, 625327647, 618763089, 611723721, 605506778, 601273537, 599680007, 600779116, 604236662, 609573781, 616234660, 623612106, 631277263, 639135242, 647269487, 655704260, 664252162, 672529995, 680313170, 687694490, 694710016, 701124847, 706614792, 711024106, 714479327, 717169285, 719163120, 720454574, 721049488, 721125305, 720992088, 720827162, 720548630, 719948888, 718930066, 717569411, 715983391, 714188576, 712147832, 709947288, 707842588, 706096709]
3030.8G06096709j347006j181244j279474j476347j562476j455963j321673j357675
3047.1F95114851j543939j647771j566052j420379j287520j178860j049698p80284
3063.4F84640348l33011J21891L20614K49266J81139K48790L69787M08232K57671P7665
3083.8F86542392J09851K90215M22299L93808K00927K742r7454j93178l80337o84917
3104.2F86606348r83060j076102j046598j131177j361728j604914j762510j869321
3120.5F75770938j979887k136290k362490k556205k641439k667308k683222k774358
3136.8F55969739k973974l179848l264129l259361l318012l438353l553033l691971
3153.2F29291058l811598l850281l905535m006744m068017m058063m048764m128695
$$ y = [706096709, 704749703, 703568459, 702288985, 700812638, 699250162, 697794199, 696472526, 695114851, 693570912, 691923141, 690357089, 688936710, 687649190, 686470330, 685420632, 684640348, 684307337, 684429228, 684749842, 684999108, 685180247, 685429037, 685798824, 686207056, 686464727, 686542392, 686652243, 686942458, 687364757, 687758565, 687959492, 687962234, 687864780, 687671602, 687291265, 686606348, 685623288, 684547186, 683500588, 682369411, 681007683, 679402769, 677640259, 675770938, 673791051, 671654761, 669292271, 666736066, 664094627, 661427319, 658744097, 655969739, 652995765, 649815917, 646551788, 643292427, 639974415, 636536062, 632983029, 629291058, 625479460, 621629179, 617723644, 613716900, 609648883, 605590820, 601542056, 597413361]
3169.5E97413361m234731m259527m184186m057944l940821l910959l929793l830374
3185.8E65065026l603220l377199l228187l113091k937794k691031k435684k234638
3202.1E41444182k128303k075195j967907j777112j632989j622498j668930j676738
3218.4E26894510j618147j579940j665652j844347k020120k166391k304673k472937
3234.7E11222303k685845k918303l104985l218412l328681l465682l638119l789753
3251.1D85072523l849923l862262l901601l989339m029095l969341l862173l773004
3267.4D53835785l723800l654599l513128l343850l199369l043681k890736k791703
3283.7D27674919k638429k373576k157688k037049j900583j729518j550705j364410
$$ y = [597413361, 593178630, 588919103, 584734917, 580676973, 576736152, 572825193, 568895400, 565065026, 561461806, 558084607, 554856420, 551743329, 548805535, 546114504, 543678820, 541444182, 539315879, 537240684, 535272777, 533495665, 531862676, 530240178, 528571248, 526894510, 525276363, 523696423, 522030771, 520186424, 518166304, 515999913, 513695240, 511222303, 508536458, 505618155, 502513170, 499294758, 495966077, 492500395, 488862276, 485072523, 481222600, 477360338, 473458737, 469469398, 465440303, 461470962, 457608789, 453835785, 450111985, 446457386, 442944258, 439600408, 436401039, 433357358, 430466622, 427674919, 425036490, 422662914, 420505226, 418468177, 416567594, 414838076, 413287371, 411922961]
3300D11922961j224368j162291j066565q59172o31898m71592m08292m07457l53009
3318.4D05338317k15262j18941j06573o2972L6388J47641K37852K79606L01182L50952
3338.8D06188190M16994M86136N56737N83261N76138O24002P35610Q01564Q09341Q10117
3359.1D12588090Q15123Q32588Q55773Q66413Q64864Q72850Q63135Q44151Q79466R10878
3379.5D21193331Q37029P45892P48307Q13007Q01653O68972N39810N04732N87344O90162
3399.9D28130239O44565N03749M73916N47111O37114P17312P50989P30187P35610Q51214
3420.3D34722006J038701J220077J321584J345009J354545J522362J746535J689017
3436.6D45959836J487613J507819J690417J810432J920938J986176J951188J967549
$$ y = [411922961, 410698593, 409536302, 408469737, 407610565, 406978667, 406507075, 406098783, 405691326, 405338317, 405123055, 405004114, 404897541, 404834569, 404870957, 405018598, 405256450, 405536056, 405837238, 406188190, 406605184, 407091320, 407648057, 408231318, 408807456, 409431458, 410167068, 410968632, 411777973, 412588090, 413403213, 414235801, 415091574, 415957987, 416822851, 417695701, 418558836, 419402987, 420282453, 421193331, 422030360, 422776252, 423524559, 424337566, 425139219, 425808191, 426348001, 426852733, 427440077, 428130239, 428774804, 429278553, 429752469, 430299580, 430936694, 431654006, 432404995, 433135182, 433870792, 434722006, 435760707, 436980784, 438302368, 439647377, 441001922, 442524284, 444270819, 445959836, 447447449, 448955268, 450645685, 452456117, 454377055, 456363231, 458314419, 460281968]
3453D60281968K093494K225906K238244K113342K126932K410710K631903K509295K224803
3471.3D80856597K231598K507836K765417K876312K858042K875924K994478L124356
3487.6E03090560L242135L328741L334642L332972L288090L263712L356576L340244
3504E29577672L143013L103733L315806L534317L513515L242314L029287L053367L253699
3522.3E58766723L289461L112018L112435L261268L319323L398598L467977L340304
3538.6E85068107L243744L313720L445626L524720L525019L500700L547251L666878
3554.9F12835765L767431L837883L743410L360808L204703M026771M845500M530013
3571.3F44152284M034340M026234M226148M400075M383921M024625L682554M024744
$$ y = [460281968, 462375462, 464601368, 466839612, 468952954, 471079886, 473490596, 476122499, 478631794, 480856597, 483088195, 485596031, 488361448, 491237760, 494095802, 496971726, 499966204, 503090560, 506332695, 509661436, 512996078, 516329050, 519617140, 522880852, 526237428, 529577672, 532720685, 535824418, 539140224, 542674541, 546188056, 549430370, 552459657, 555513024, 558766723, 562056184, 565168202, 568280637, 571541905, 574861228, 578259826, 581727803, 585068107, 588311851, 591625571, 595071197, 598595917, 602120936, 605621636, 609168887, 612835765, 616603196, 620441079, 624184489, 627545297, 630750000, 634776771, 639622271, 644152284, 648186624, 652212858, 656439006, 660839081, 665223002, 669247627, 672930181, 676954925]
3587.6F76954925M646123M492342M161000M245162M348099M336119M415274M199385
3603.9G11798429L630817L564537L907323M037976M101396L871441L719866M206777
3620.2G42838562M249215L521502K794921L036141M047871M003227L638863L512264
3636.5G71642566L256380K943456K593041K078593J724720K421021L567040L274977
3652.8G93501794K565742K780199K989888K413035J780510J385390R75907R98855J602471
3671.2H10993791J422107J262188K195537K574205K260268J793265J185656Q60333
3687.5H24547350J231492J897335J968086J421213P66456M28975O39498R59635O18398
3705.9H34478438q7977k90751N12242J382947J167119M26888k1696K1041K63810M84288
$$ y = [676954925, 681601048, 686093390, 690254390, 694499552, 698847651, 703183770, 707599044, 711798429, 715429246, 718993783, 722901106, 726939082, 731040478, 734911919, 738631785, 742838562, 747087777, 750609279, 753404200, 756440341, 760488212, 764491439, 768130302, 771642566, 774898946, 777842402, 780435443, 782514036, 784238756, 786659777, 790226817, 793501794, 796067536, 798847735, 801837623, 804250658, 806031168, 807416558, 808392465, 809391320, 810993791, 812415898, 813678086, 815873623, 818447828, 820708096, 822501361, 823687017, 824547350, 825778842, 827676177, 829644263, 831065476, 831831932, 832260907, 832900405, 833860040, 834478438, 834390461, 834099710, 834611952, 835994899, 837162018, 837588906, 837567210, 837588251, 837852061, 838336349]
3726.3H38336349M73856o2286o25074k69115Q32498J182616L25202o99877n68152L31402
3746.7H39257419J72019P6532R06289J104593N64456L27111N57899M72844Q8453q8990
3767.1H43438625N3048M86255O21855K33770q2672K3365K69592K08616P2360J62542
3787.5H45487356K65539J52945j85966m58360m62770n12779j73628N46932N06818M06325
3807.8H45572412N52475K08915m28677o34134m03583l46362K32100P86185M90845J54853
3828.2H46185029r1434k82168l19600m39942l27945K35379O22809O86168M31776k26974
3848.6H46473098j099110j291871L15368J287043O03855j75238l97145j22965j09613
3867H45483422l47614J4007M78566N09083K10524k80202k82764l2723O7413K20120
$$ y = [838336349, 838810205, 838747919, 838122845, 837853730, 838686228, 839868844, 840194046, 839494169, 838926017, 839257419, 839429438, 839505970, 840412259, 841516852, 842081308, 842408419, 842966318, 843439162, 843527615, 843438625, 843491673, 843977928, 844599783, 844833553, 844750881, 844774246, 845043838, 845252454, 845324814, 845487356, 845752895, 845905840, 845719874, 845261514, 844798744, 844285965, 844112337, 844659269, 845166087, 845572412, 846124887, 846333802, 845905125, 845270991, 844867408, 844521046, 844753146, 845539331, 846030176, 846185029, 846093595, 845811427, 845491827, 845051885, 844723940, 844959319, 845582128, 846268296, 846700072, 846473098, 845373988, 844082117, 844397485, 845684528, 846288383, 846113145, 845716000, 845593035, 845483422, 845135808, 845149815, 845628381, 846137464, 846347988, 846067786, 845785022, 845752299, 845819712, 846039832]
3887.4H46039832j7107k15411J88947K43008l60966p78973n58972N8412O75261Q00610
3907.8H46074641M38928K0802k82645m22001j97947J51277J36971l0279j6451m1485
3928.2H45831811j37507M0471L07560K00331n4121j22726l159J24514L577j05262O3419
3950.6H46148908K29597K26319Q0228r0063n0187J50502K07484Q7261n1975j08898
3971H46829176m4763P2479J34766R7752L1173J0014M9650J02759O1512o3896j21654
3993.4H47158968j8000J19448
3997.5H47260416
$$ y = [846039832, 846022725, 845807314, 845996261, 846239269, 845878303, 845099330, 844540358, 844598770, 845274031, 846074641, 846513569, 846534371, 846251726, 845829725, 845631778, 845783055, 845920026, 845889747, 845873296, 845831811, 845694304, 845734775, 846042335, 846242666, 846188545, 846065819, 846062660, 846187174, 846190751, 846085489, 846148908, 846378505, 846604824, 846685052, 846594989, 846544802, 846695304, 846902788, 846990049, 846938074, 846829176, 846784413, 846856892, 846991658, 847089410, 847120583, 847130597, 847180247, 847283006, 847344518, 847280622, 847158968, 847140968, 847260416]
##END=$$ End of the data block
