##TITLE=$$ Begin of the data block
##JCAMP-DX=5.00 $$ ACD/SpecManager v 10.08
##SPECTROMETER/DATA SYSTEM=Alpha
##DATE=22 Dec 2014 10:36:42
##DATA TYPE=INFRARED SPECTRUM
##DATA CLASS=XYDATA
##ORIGIN=
##OWNER=
##NPOINTS=1765
##FIRSTX=399.76428223
##LASTX=3997.64306641
##MAXX=3997.64306641
##MINX=399.76428223
##MAXY=0.83348429
##MINY=0.28120705
##XFACTOR=1.0000000000
##YFACTOR=1.000000000000000e-9
##FIRSTY=0.55695289
##DELTAX=2.03961372
##XUNITS=1/CM
##YUNITS=ARBITRARY UNITS
##XYDATA=(X++(Y..Y))
399.8E56952894r070158m388929J367808K823412j00076j738608J060307M867494M003644
418.1E55777788l299713o263375k392948J298010j97112n202592o979525k718508K437532
436.5E32459557K834380K38597K67208M507363P849156N596281N8412k388418L93510
454.8E51816046L446818J103103m236698n772949k488613Q46803o78360n268574o689846
473.2E32077730k453804J501620M64618l038764l561259J92464L462851J829505k754867
491.5E27720094m434705j374662J591265K76625l891825n565405k699197L8088j329422
509.9E10330856n066693o431639m025608j476557k208858m621268m764199j415759
526.2D80320275K226263K308846p8202n96046K938419P353366P806957M064440O89805
$$ plain form
399.8 556952894 547882736 543493807 544861615 547685027 547584951 545846343 546906650 551774144 555777788
418.1 555777788 552478075 546214700 543821752 545119762 544922650 539720058 532740533 530022025 532459557
436.5 532459557 535293937 535532534 535799742 540307105 548156261 553752542 553810954 551422536 551816046
454.8 551816046 555262864 556365967 552129269 546356320 543867707 544714510 544036150 538767576 532077730
473.2 532077730 529623926 531125546 531590164 528551400 524990141 525182605 528645456 530474961 527720094
491.5 527720094 523285389 521910727 523501992 523778617 519886792 514321387 511622190 511660278 510330856
509.9 510330856 505264163 498832524 494806916 493330359 491121501 486500233 481736034 480320275
526.2 480320275 482546538 484855384 484777182 484181136 487119555 494472921 502279878 506344318 507034123
544.6E07034123R31919K578556J460135k402067m996479l882408j501471k048820n773008
562.9D91400480q430540p324904m482300l156632l525913k869159O94782N514681P970006
581.3D75790501O782382M750759M990130O545514N887330J951337j639605j561999
597.6E03496349J041651K265811K49266k215028j622259J604914L675223K447426J79529
616E11122882N66841L889560O276369M921258J763701R87351L237367M982293L366231
634.3E41113853N007j084864J229942L620803K631545m87268j578807P88152L441155
652.7E49679518K918541r4950j647830L95298L339529L199399k48313k547324J041531
671E56035399M018486L889084J128793j033724K45273L092707L450095O75082j871526
$$ plain form
544.6 507034123 507966042 510544598 512004733 509602666 504606187 500723779 499222308 497173488 491400480
562.9 491400480 482969940 475645036 471162736 468006104 464480191 461611032 462305814 467820495 475790501
581.3 475790501 482572883 487323642 492313772 498859286 504746616 506697953 505058348 503496349
597.6 503496349 504538000 506803811 507053077 504838049 503215790 504820704 508495927 510943353 511122882
616 511122882 511689723 515579283 521855652 526776910 528540611 529527962 532765329 537747622 541113853
634.3 541113853 541118860 540033996 541263938 544884741 547516286 547029018 545450211 546238363 549679518
652.7 549679518 552598059 552503109 550855279 551250577 554590106 557789505 557541192 554993868 556035399
671 556035399 560053885 563942969 565071762 564038038 564283311 567376018 570826113 571501195 569629669
689.4E69629669j380145Q64207J182557j720667m760385m539609j786828J8656p92920
707.7E56714535k013564n07534L338993N943596N248964L278375L470242O183743Q130133
726.1E89787483O697118L419817K020717L559529N216003L878236K65717j840949p90417
744.5F12213254N89073r81510m679322o652415n214334k795338k540052m295409m810810
762.8E80833137k032518K249837M741430M675865M493654O530881R777605J0785520
779.1F22055411Q199334M872859M214525N888939O526590M298627J612604J837492
795.4F59506381M672884O534458M999876J940191J152932L096342M365146K564311
811.8F88832521n72323j403690O96302K395749Q99970k436936m101038l019809j795173
$$ plain form
689.4 569629669 568249524 569113731 570296288 568575621 563815236 559275627 557488799 557507455 556714535
707.7 556714535 554700971 554193437 557532430 563476026 568724990 572003365 575473607 581657350 589787483
726.1 589787483 596484601 599904418 601925135 605484664 610700667 614578903 614844620 613003671 612213254
744.5 612213254 612802327 611820817 607141495 600489080 595274746 592479408 589939356 585643947 580833137
762.8 580833137 578800619 581050456 585791886 590467751 594961405 601492286 611269891 622055411
779.1 622055411 630254745 635127604 639342129 645231068 651757658 656056285 657668889 659506381
795.4 659506381 664179265 670713723 675713599 677653790 678806722 681903064 686268210 688832521
811.8 688832521 688260198 686856508 687552810 689948559 690848529 688411593 684310555 681290746 679495573
830.1F79495573l100276o009519p320702n676270l261804k946258m631936n638659
846.4F40910149m303158k271354k349913m668236o550133n477428j319290L532052
862.8F17502689O575346Q066297J0093450J2652994J3012111R628594M661023J460672
879.1F83653176M41968r57131m250884p580877q250176o376863m689455n057573o441653
897.4F40490532o634176n263746m313886n552411q155286r815037r660542r003938
913.7E82091510r330809j0116577r395480o462097k958000r92775p95305o61194Q40723
932.1E42219996L078163M297912M005730L498495L735364L464519O73950m480541r539663
950.5E50953925j2438000j3442695j4277816j5843242j7399341j7969936j7695993
$$ plain form
830.1 679495573 676395297 670385778 663065076 657388806 654127002 651180744 646548808 640910149
846.4 640910149 636606991 634335637 631985724 627317488 620767355 615289927 613970637 617502689
862.8 617502689 624078035 632144332 642237782 654890776 667902887 677531481 682192504 683653176
879.1 683653176 684095144 683138013 678887129 671306252 663056076 656679213 651989758 646932185 640490532
897.4 640490532 633856356 628592610 624278724 618726313 610571027 600755990 591095448 582091510
913.7 582091510 572760701 562644124 553248644 546786547 543828547 542835772 542040467 541379273 542219996
932.1 542219996 545298159 549596071 553601801 557100296 560835660 564300179 564974129 560493588 550953925
950.5 550953925 538515925 525073230 510795414 494952172 477552831 459582895 441886902
964.7D41886902j7570287j8149287j8857538j8826574j7839522j6254693j4511794
979C19877207j2658655j0336459p432640m544973k400279j093268k03878O98805J592785
997.4B83498645K068668J871854J251072P09832M74572K85626j04428l66181k6643
1015.7B89663017R22382J939445K494038K673983K938420L454029L921837L891051
1032C11898202L174811K153784J439840J194090J012355P03245O25819J147240K276153
1050.4C25625539L661543M822582N701303O771327Q285522R787947J0124385Q008600
1066.7C82788748K969890l646761q780271j0070294p943123m451603j074374J531184
1083C51323396L068328L760338M318654N174846N938053N862146M674674K934724J535147
$$ plain form
964.7 441886902 424316615 406167328 387309790 368483216 350643694 334389001 319877207
979 319877207 307218552 296882093 289449453 284904480 282504201 281410933 281207055 281905860 283498645
997.4 283498645 285567313 287439167 288690239 289400071 289874643 290160269 290055841 289689660 289663017
1015.7 289663017 290585399 292524844 295018882 297692865 300631285 304085314 308007151 311898202
1032 311898202 315073013 317226797 318666637 319860727 320873082 321576327 322202146 323349386 325625539
1050.4 325625539 329287082 334109664 339810967 346582294 354867816 364655763 374780148 382788748
1066.7 382788748 385758638 382111877 373331606 363261312 355318189 350866586 349792212 351323396
1083 351323396 354391724 358152062 362470716 367645562 373583615 379445761 384120435 387055159 388590306
1101.4C88590306R60588J062692J522153K259970L236055M080415M236311L533542
1117.7D09482032K432466J684695J733035K382100L147602L800392M190475L874510
1134D32727307K281606o39319m021049o576568p587909p450253o981701o424904n409777
1152.4C89917433l769695j956881n29170M56125J531660L210664N396098P488281Q998662
1170.7D10743177J0052472J1128694J2262851J2991279J2935281J2251854J1556119
1185D93921727J1049718J0153830Q332491N957484M065037L195703K875626K418875
1201.3E41970491J837612J782000K602815L808916M612923M807293M823864M893362
1217.7E71139276M653454L615677J909435L49820m41730o69301r46462j510739j943708
$$ plain form
1101.4 388590306 389550894 390613586 392135739 394395709 397631764 401712179 405948490 409482032
1117.7 409482032 411914498 413599193 415332228 417714328 420861930 424662322 428852797 432727307
1134 432727307 435008913 434369594 430348545 423771977 416184068 408733815 401752114 395327210 389917433
1152.4 389917433 386147738 384190857 383661687 384117812 385649472 388860136 394256234 401744515 410743177
1170.7 410743177 420795649 431924343 444187194 457178473 470113754 482365608 493921727
1185 493921727 504971445 515125275 523457766 529415250 533480287 536675990 539551616 541970491
1201.3 541970491 543808103 545590103 548192918 552001834 556614757 561422050 566245914 571139276
1217.7 571139276 575792730 579408407 581317842 581667662 581225932 580556631 579610169 578099430 576155722
1236E76155722j756191j083195m53711j05023K71320J025796J960576K474188K235413
1254.4E80724895J583040J148343J162946J326740J383245J495302J884877K336800
1270.7E93046188K310038J556635M56095l39449n28633m03464m30346p26938j034379
1289E93905747j099169j077652j333297j880228k258599k139270j803637j708448j893818
1307.4E78711629j925349j562119j111746q79049r74894j390278j932979k594590l540575
1325.8E62800050m626811n388558n398512m614591l408849k363384j710534r91166
1342.1E34297645j08600M90427N30005J05679l45826o17027p72953p69914p57873j069605
1362.5E30981958j224637p93576l52562N6863N30839O94275O03318O39558P24077J146317
$$ plain form
1236 576155722 574399531 573316336 572862625 572757602 573028922 574054718 576015294 578489482 580724895
1254.4 580724895 582307935 583456278 584619224 585945964 587329209 588824511 590709388 593046188
1270.7 593046188 595356226 596912861 597368956 597029507 596500874 596097410 595667064 594940126 593905747
1289 593905747 592806578 591728926 590395629 588515401 586256802 584117532 582313895 580605447 578711629
1307.4 578711629 576786280 575224161 574112415 573233366 572258472 570868194 568935215 566340625 562800050
1325.8 562800050 558173239 552784681 547386169 542771578 539362729 536999345 535288811 534297645
1342.1 534297645 534189045 534679472 535209477 535315156 534969330 534352303 533579350 532809436 532051563 530981958
1362.5 530981958 529757321 528963745 528611183 528668046 529198885 529893160 530496478 531136036 531860113 533006430
1382.9E33006430K355396L847599M215837L477752K643585J411796k086r77576j327753
1401.2E48650980j358390j778662k067745j943230j856447j562297r44734p61866j215160
1419.6E35162449q45194n4896L37780P83801J158356J382888J758694J970232J540601
1437.9E43194711J261115J513958J612127J286805L60906n67496o59466l09527j051962
1456.3E46641171k827346j731396L33846J731455K714932M001438O202281Q940339
1472.6E66006720R098232P660448P110000P008016O889224O624162O751419O604373
1488.9F23752594N320191M134357M379213M780829L891885L205896L537059M553437
1505.2F57555461M237592J695216J313984K079785K678156K818704K627670K181173
$$ plain form
1382.9 533006430 535361826 539209425 543425262 546903014 549546599 550958395 550956309 549978733 548650980
1401.2 548650980 547292590 545513928 543446183 541502953 539646506 538084209 537139475 536377609 535162449
1419.6 535162449 534317255 534262359 534600139 535383940 536542296 537925184 539683878 541654110 543194711
1437.9 543194711 544455826 545969784 547581911 548868716 549229622 548662126 548002660 547693133 546641171
1456.3 546641171 543813825 542082429 542416275 544147730 546862662 550864100 557066381 566006720
1472.6 566006720 575104952 582765400 589875400 596883416 603772640 610396802 617148221 623752594
1488.9 623752594 629072785 633207142 637586355 642367184 646259069 649464965 653002024 657555461
1505.2 657555461 661793053 663488269 664802253 666882038 669560194 672378898 675006568 677187741
1521.6F77187741J182496P62523P75218J081407J638949J310467R25184J741290J914143
1539.9F88519418k73406j428187j257241o36578j80482L3438M09007R31084r000l071726
1560.3F83036327k124190q41498o01828p04706j198769o96778q822r34362j710534
1578.7F74214840j106858p12037p45416j022875j281917j351059j281083j459181j874208
1597F63380206k112031k175987k248526k371967k686083l280938l393352k727568k836227
1615.4F39547527m305482l788114k671182l153622l458858l395080l351629k165615
1631.7F13257945r65059j648784k474964j539886l83853P80761J452446J083433J216770
1650.1F10778809K112805J824141J237869K106667L130734L701627L682077L836989
$$ plain form
1521.6 677187741 678370237 679132760 679907978 680989385 682628334 683938801 684863985 686605275 688519418
1539.9 688519418 688246012 686817825 685560584 684924006 684743524 684776962 685185969 686117053 686108053 683036327
1560.3 683036327 680912137 680070639 679468811 678764105 677565336 676868558 676859736 675925374 674214840
1578.7 674214840 673107982 672395945 671650529 670627654 669345737 667994678 666713595 665254414 663380206
1597 663380206 661268175 659092188 656843662 654471695 651785612 648504674 645111322 642383754 639547527
1615.4 639547527 635242045 631453931 628782749 625629127 622170269 618775189 615423560 613257945
1631.7 613257945 612292886 610644102 608169138 606629252 606245399 607026160 608478606 609562039 610778809
1650.1 610778809 612891614 614715755 615953624 618060291 621191025 624892652 628574729 632411718
1666.4F32411718M702032M867673M005849M179597M597545M613280N020976N700350
1682.7F70099020N615652L938078L593565M029631M086316M610777M696071L774166
1699G04443276K779543J946509J846671J728952J676858K150237K751887L027380K210259
1717.4G24561572Q71241R67205J541316J833618K175867K713860K949237K412618J185476
1735.7G41212010J128078J752138J997829K087712K323031K590060K460838J994908
1752G57546604J966357K252102K269506K197206K096713J762569J783252K034962K082348
1770.4G75991619J500249O53624N90682Q74221R82345J015663J040876R93013J223445
1788.8G84865737J475573J061260N87821P24912Q41200O45936N35548P69794R69350
$$ plain form
1666.4 632411718 637113750 641981423 645987272 650166869 654764414 659377694 664398670 670099020
1682.7 670099020 675714672 679652750 683246315 687275946 691362262 695973039 700669110 704443276
1699 704443276 707222819 709169328 711015999 712744951 714421809 716572046 719323933 722351313 724561572
1717.4 724561572 725432813 726400018 727941334 729774952 731950819 734664679 737613916 740026534 741212010
1735.7 741212010 742340088 744092226 746090055 748177767 750500798 753090858 755551696 757546604
1752 757546604 759512961 761765063 764034569 766231775 768328488 770091057 771874309 773909271 775991619
1770.4 775991619 777491868 778145492 778736174 779610395 780592740 781608403 782649279 783642292 784865737
1788.8 784865737 786341310 787402570 787990391 788715303 789556503 790202439 790737987 791507781 792477131
1807.1G92477131Q54850N63919M67897O97493P49648N50508O26207R72867J093983
1825.5G99054503R70006N54502q5890K7716N15044N64516M59313O54459O62506K17497
1845.9H03594172R537k4438j5855J71006L99828M05550K20060J42515M24981Q64684
1866.3H06192040O95169j48236m14849k1040L34680M48048L24845K07007L28660O26684
1886.7H08573008O85095K85507O2167J63317K18451K42949K08497Q8870J28806L28004
1907.1H10984671L48151J10984m18K03908L53873K66969J75059j5140j77800K2232
1927.5H12272489K43425J96398N6863L0458J90019M28200L96788j3173k02536K4319
1947.9H13623250K71737K93374J31071N1558J91748L47197K94864J92762J59561J07944
$$ plain form
1807.1 792477131 793331981 793895900 794363797 795061290 795810938 796361446 796987653 797960520 799054503
1825.5 799054503 800024509 800579011 800493121 800520837 801035881 801600397 802059710 802714169 803376675 803594172
1845.9 803594172 803603709 803579271 803563416 803734422 804134250 804539800 804759860 804902375 805327356 806192040
1866.3 806192040 806887209 806738973 806324124 806303084 806637764 807085812 807410657 807617664 807946324 808573008
1886.7 808573008 809258103 809543610 809605777 809769094 809987545 810230494 810438991 810527861 810656667 810984671
1907.1 810984671 811332822 811443806 811443388 811647296 812001169 812268138 812443197 812428057 812250257 812272489
1927.5 812272489 812515914 812712312 812769175 812799633 812989652 813417852 813814640 813801467 813598931 813623250
1947.9 813623250 813894987 814188361 814319432 814370990 814562738 814909935 815204799 815397561 815557122 815665066
1968.3H15665066J34588K09093J22130J4543Q4460K12729K19643Q5890o258Q0526K19762
1990.7H17042172J26839r6023j33694l8623O8128J05083m4883k77817l08514j41561
2011.1H16301107k6762j26243m09066o28055n93245n51641n83946l46899o9559p0333
2031.5H12895358j44422k45274l97622m44830l26633j74582j72973l37958l96311j84656
2051.9H10070097Q2136J25706n9426j91689l4034K26617K24769j1265j72496p4387
2072.3H10186028J65403K52486P2300j31607p4148J61230K91944J77622k6643l2604
2092.7H11042011J82688L32534K31624J0014l3319J97529M01199K73824l1531j13249
2113.1H12493324Q9109K80678K05994o6101k07425l9577K34306K58088k3782k35737
$$ plain form
1968.3 815665066 815799654 816008747 816130877 816145420 816229880 816442609 816662252 816748142 816741884 816822410 817042172
1990.7 817042172 817169011 817072988 816939294 816900671 816968799 817073882 817028999 816751182 816442668 816301107
2011.1 816301107 816274345 816148102 815739036 815110981 814517736 813966095 813382149 813035250 812965691 812895358
2031.5 812895358 812750936 812505662 812108040 811663210 811336577 811161995 810989022 810651064 810254753 810070097
2051.9 810070097 810152233 810277939 810218513 810026824 809992790 810219407 810444176 810432911 810260415 810186028
2072.3 810186028 810351431 810603917 810676217 810544610 810470462 810631692 810923636 811101258 811074615 811042011
2092.7 811042011 811224699 811557233 811788857 811798871 811765552 811963081 812364280 812638104 812606573 812493324
2113.1 812493324 812582433 812863111 813069105 813003004 812795579 812756002 812990308 813248396 813224614 812988877
2133.5H12988877r1314J94311K77221P9275j63138j24813J82748L50535J25110j67906
2153.9H13650906r6917K73406N07236L66628Q1539M6552L47375O65367O40512L22580
2174.3H16805184J73151M11988P03692O41763L04103J57655M14788P19071O37054K50399
2194.6H21218848K1696K22504O00279O82592L54409N9188K29776O43611P33494L71099
2215H25137496L7611J34050M92514O54339M02212M5836M3333L70085N93245M04537
2235.4H28315258m649j12414K19643N50747M34875N662j65045J50919N29528M75287
2255.8H30399811O2466j97113K1458M60982N50390J55568j79887K6762M94004N90384
2276.2H32384825K09450j46150n5969L27885M89533J56522k90453k55824J83225L90351
$$ plain form
2133.5 812988877 812897563 813091874 813369095 813448370 813285232 813160419 813343167 813693702 813818812 813650906
2153.9 813650906 813553989 813827395 814334631 814701259 814782798 814829350 815176725 815842092 816482604 816805184
2174.3 816805184 816978335 817390323 818094015 818735778 819039881 819197536 819612324 820331395 820968449 821218848
2194.6 821218848 821240544 821463048 822063327 822745919 823100328 823159516 823389292 824032903 824766397 825137496
2215 825137496 825175107 825309157 825801671 826456010 826858222 826904058 826947391 827317476 827910721 828315258
2235.4 828315258 828310609 828198195 828417838 828968585 829403460 829409122 829244077 829394996 829924524 830399811
2255.8 830399811 830462277 830265164 830286622 830747604 831297994 831453562 831273675 831300437 831794441 832384825
2276.2 832384825 832594275 832448125 832392156 832720041 833209574 833366096 833075643 832819819 833003044 833393395
2296.6H33393395R0897l78549m93288j40786J67906L457m06802n30481k11239Q1599
2317H31576109j40071o80387q34763m19378p7427j96337m74811n20170l12686n662
2337.4H27914417M8339l21627m55379L19183J022220M68969p63834j585722j400768
2355.8H25245798o15359n1558n4061j86443P0810O81102J055002Q45373M33028M14550
2376.2H27838242Q09848J073599Q02160J77800k50101j62363J37150J14441k62558
2394.5H30278218n00024k74777J04845J10566l15249o76632n56171j68681n1617l58522
2414.9H27591956o96004o21140k47657j05083m06802p97093q08894m59612k34484m13895
2435.3H22801292p30872p78973m97282k55585l87132p41184q73148o21080l23892l27289
$$ plain form
2296.6 833393395 833484292 833105743 832612455 832471669 832639575 832643032 832236230 831705749 831494510 831576109
2317 831576109 831436038 830755651 829920888 829501510 829424083 829227746 828752935 828232765 827920079 827914417
2337.4 827914417 827962756 827641129 827185750 827504933 828527153 828996122 828232288 826646566 825245798
2355.8 825245798 824630439 824578881 824524820 824338377 824409187 825090289 826145291 826990664 827423692 827838242
2376.2 827838242 828648090 829721689 830523849 830701649 830451548 830289185 830426335 830540776 830278218
2394.5 830278218 829778194 829503417 829608262 829718828 829403579 828726947 828170776 828002095 827950478 827591956
2414.9 827591956 826895952 826274812 826027155 825922072 825515270 824718177 823909283 823449671 823215187 822801292
2435.3 822801292 822070420 821291447 820794165 820538580 820151448 819410264 818537116 817916036 817592144 817264855
2455.7H17264855o08206p92980n72622k30670k47478n82636p97450o34373k82168j88351
2476.1H12327921m86791p62880o33597k63393j08540l41654o65545o37412k55406l576
2496.5H08169127j67430m91321n59151l03626m3869q6606l86894n66303l82424j06811
2516.9H05074692j34170m57526o89983n48422k51591k37048n63324q24511p35402m71532
2537.3H00161183l58701n54204q20339p61330m63783l30925n06342p84993q31187n82039
2557.7G94167340l77774m94540p44224p80463n52475l30866l94225o69241q01921o22749
2578.1G88398862l63469l51668n78940p04944n30362k51174k10404m50969o43849n38171
2598.5G83774912k75492j96815m02689o51896o68108m84526m08650o10649r35317j050055
$$ plain form
2455.7 817264855 816656649 815863669 815291047 815060377 814812899 814230263 813432813 812798440 812516272 812327921
2476.1 812327921 811841130 811078250 810444653 810181260 810072720 809731066 809065521 808428109 808172703 808169127
2496.5 808169127 808001697 807510376 806951225 806647599 806603730 806517124 806130230 805563927 805181503 805074692
2516.9 805074692 804940522 804482996 803793013 803244591 802993000 802755952 802192628 801368117 800632715 800161183
2537.3 800161183 799802482 799248278 798427939 797666609 797202826 796871901 796365559 795580566 794749379 794167340
2557.7 794167340 793789566 793295026 792550802 791770339 791217864 790886998 790492773 789823532 789021611 788398862
2578.1 788398862 788035393 787683725 787104785 786399841 785869479 785618305 785407901 784956932 784313083 783774912
2598.5 783774912 783499420 783302605 782899916 782248020 781579912 781095386 780686736 780076087 779140770 778090715
2618.9G78090715q76665p05361p98583j081526j193524j044869r03368r37224j136958
2637.2G69412637j315058j251041j032472r68397j143276j280368j161992r44972r02355
2655.6G59412706j056969j212299j190722r84848q34345r59695j142204j067221q41856
2673.9G50122547p25269q04961r84192j026809q59380p05063p55727r22740r97126
2692.3G42341280r28760q27133q81493j102805j232982j130760r37283r10222j086593
2710.7G33303249j215279j099766q65578q11577r65118j082480j002968p86245o49690
2729G24824548p31766q80361q44061o53625n55277o60658q42988q80361p06553n23508
2749.4G17545390n47171p05182p48217o07848m41552m30643o10173p79331p15732n18620
$$ plain form
2618.9 778090715 777214050 776508689 775710106 774628580 773435056 772390187 771486819 770549595 769412637
2637.2 769412637 768097579 766846538 765814066 764845669 763702393 762422025 761260033 760315061 759412706
2655.6 759412706 758355737 757143438 755952716 754967868 754133523 753173828 752031624 750964403 750122547
2673.9 750122547 749397278 748592317 747608125 746581316 745721936 745016873 744261146 743338406 742341280
2692.3 742341280 741412520 740585387 739703894 738601089 737368107 736237347 735300064 734389842 733303249
2710.7 733303249 732087970 730988204 730122626 729311049 728345931 727263451 726260483 725474238 724824548
2729 724824548 724092782 723212421 722368360 721714735 721159458 720498800 719655812 718775451 718068898 717545390
2749.4 717545390 716998219 716293037 715544820 714936972 714495420 714064777 713454604 712675273 711959541 711440921
2769.8G11440921m71115o33657q20875q55029p85589q14677r70423j100063j103997
2788.2G03885496j044214j077116j246154j412988j475334j459062j442432j543999
2804.5F93184197j732409j827598j812637j789867j835704j985848k109468k107799
2820.8F77982867k083063k141416k304554k476633k529979k500236k530932k698302
2837.1F58717752k967895l182351l254950l369808l619612l728985l488899l027022
2853.4F32078230k586901k395570k540708k867222l173470l495753m001617m548729
2869.7F06468260m819512m883945m932702m857301m543662l994585l285110k541422
2886.1E72610021j874566j378954j029968p32541n35846n45144p07388r21011j113892
$$ plain form
2769.8 711440921 710969806 710336149 709515274 708660245 707874656 707059979 706089556 704989493 703885496
2788.2 703885496 702841282 701764166 700518012 699105024 697629690 696170628 694728196 693184197
2804.5 693184197 691451788 689624190 687811553 686021686 684185982 682200134 680090666 677982867
2820.8 677982867 675899804 673758388 671453834 668977201 666447222 663946986 661416054 658717752
2837.1 658717752 655749857 652567506 649312556 645942748 642323136 638594151 635105252 632078230
2853.4 632078230 629491329 627095759 624555051 621687829 618514359 615018606 611016989 606468260
2869.7 606468260 601648748 596764803 591832101 586974800 582431138 578436553 575151443 572610021
2886.1 572610021 570735455 569356501 568326533 567593992 567058146 566513002 565805614 564884603 563770711
2904.4E63770711j289427j567304k020121k573847l080011l387570l465414l431261
2920.7E42955756l249168k784610k036035j146853l06368N59211J614809K737343L727675
2939.1E42071760M476309M884064N038082N177319N379141N478322N360186N228401
2955.4E83093584N233287N255223N122959M759431M304707L965020L780783L651619
2971.7F19166613L484428L297090L175378L096044K883315K533376K243936K060414
2988F41940594J928091J713037J332581R96471P71880N53787L18765j7106l59535n05805
3008.4F48672760n74530p95722j149118j491189j749873j849234j821697j906097k119541
3026.8F35215759k183735k107084k126932k309263k500593k490402k409756k465725
$$ plain form
2904.4 563770711 562481284 560913980 558893859 556320012 553240001 549852431 546387017 542955756
2920.7 542955756 539706588 536921978 534885943 533739090 533432722 533991933 535606742 538344085 542071760
2939.1 542071760 546548069 551432133 556470215 561647534 567026675 572504997 577865183 583093584
2955.4 583093584 588326871 593582094 598705053 603464484 607769191 611734211 615514994 619166613
2971.7 619166613 622651041 625948131 629123509 632219553 635102868 637636244 639880180 641940594
2988 641940594 643868685 645581722 646914303 647910774 648682654 649236441 649555206 649538100 649178565 648672760
3008.4 648672760 648098230 647302508 646153390 644662201 642912328 641063094 639241397 637335300 635215759
3026.8 635215759 633032024 630924940 628798008 626488745 623988152 621497750 619087994 616622269
3043.1F16622269k593458k694845k685189k618194k613127k658546k767205k825201
3059.4E95166504k699375k528369k470672k606690k829433k876162k718270k486765
3075.7E73950768k385378k573550k786219k781511k709686k624095k579927k695561
3092.1E52814841k758682k600610k423882k477527k674878k676427k458751k377033
3108.4E32367051k527058k495707k225875k162934k315521k503157k683878k659380
3124.7E12793541k430797k249956k279222k419829k359927k108097k050310k277077
3141D94618326k393871k268821k129555j980632j876593k023637k267719k266943k078146
3159.4D75332409j956612j934468j947254j950354j902461j838863j812428j785219
$$ plain form
3043.1 616622269 614028811 611333966 608648777 606030583 603417456 600758910 597991705 595166504
3059.4 595166504 592467129 589938760 587468088 584861398 582031965 579155803 576437533 573950768
3075.7 573950768 571565390 568991840 566205621 563424110 560714424 558090329 555510402 552814841
3092.1 552814841 550056159 547455549 545031667 542554140 539879262 537202835 534744084 532367051
3108.4 532367051 529839993 527344286 525118411 522955477 520639956 518136799 515452921 512793541
3124.7 512793541 510362744 508112788 505833566 503413737 501053810 498945713 496895403 494618326
3141 494618326 492224455 489955634 487826079 485845447 483968854 481945217 479677498 477410555 475332409
3159.4 475332409 473375797 471441329 469494075 467543721 465641260 463802397 461989969 460204750
3175.7D60204750j759380j752198j704931j650095j676351j692712j621306j582026
3192D46765751j614869j642406j627028j552433j454741j423180j453131j450330j393914
3210.3D33153719j366318j335859j257837j235097j253248j250386j250893j234710
3226.7D22969371j157194j016558r65356j146138j293868j211762j087398r68963q62240
3245D13259894r13114j074403j071513q87901q20130r32216r81510q96335q06689p23928
3265.4D04152155o05702n17071o24150q50320r28312q75205q11756p44432o79642o53595
3285.8C96861970o19351n21094n08040o44893p84039q57175q15093o34730m59224n21183
3306.2C90497148q31842j073867j073510r77725r07778q50261q06510p83116p86215
$$ plain form
3175.7 460204750 458445370 456693172 454988241 453338146 451661795 449969083 448347777 446765751
3192 446765751 445150882 443508476 441881448 440329015 438874274 437451094 435997963 434547633 433153719
3210.3 433153719 431787401 430451542 429193705 427958608 426705360 425454974 424204081 422969371
3226.7 422969371 421812177 420795619 419830263 418684125 417390257 416178495 415091097 414122134 413259894
3245 413259894 412346780 411272377 410200864 409312963 408492833 407560617 406579107 405682772 404876083 404152155
3265.4 404152155 403546453 403029382 402405232 401554912 400626600 399751395 398939639 398195207 397515565 396861970
3285.8 396861970 396242619 395721525 395213485 394568592 393784553 392927378 392112285 391477555 391018331 390497148
3306.2 390497148 389665306 388591439 387517929 386540204 385632426 384782165 383975655 383192539 382406324
3324.6C82406324q90642r95219r55015q93534q23974p34926q08626r70393j051844
3342.9C74282151j083821r92924q00609q36641j080483j160473j036018r25660r39280
3361.3C65426242r17405p05719o05642q96097j275479j269371r46849p67261p93785
3379.6C57248634q47250q19951o46234l58582j21533k44290o32942p24435m05341k10792
3400C52237284m87804p97749o30468k86579j86950k60800l87997m43726l31104k57611
3420.4C48166496k50787r8497J38909K66641J97560K13981L63022K08527j28925j63406
3440.8C48913521R3340L42221M01765L38703L58433M30673N06520O68168P87467O39588
3461.2C53480399N70714R09686J122475P66009K42501J95981N93334R72152R76473
$$ plain form
3324.6 382406324 381515682 380520463 379565448 378671914 377847940 377113014 376304388 375333995 374282151
3342.9 374282151 373198330 372205406 371404797 370568156 369487673 368327200 367291182 366365522 365426242
3361.3 365426242 364508837 363803118 363197476 362301379 361025900 359756529 358809680 358042419 357248634
3379.6 357248634 356401384 355581433 354935199 354576617 354455084 354210794 353577852 352853417 352448076 352237284
3400 352237284 351749480 350951731 350321263 350034684 349847734 349586934 349198937 348755211 348424107 348166496
3420.4 348166496 347915709 347817212 347956121 348222762 348420322 348634303 348997325 349205852 349076927 348913521
3440.8 348913521 349006861 349349082 349750847 350089550 350447983 350878656 351385176 352053344 352840811 353480399
3461.2 353480399 354051113 354960799 356083274 356849283 357091784 357287765 357881099 358853251 359829724
3479.6C59829724O44296N51909P96259Q03620O77496Q21709R86785J008570R97216
3497.9C67117584J032889R87351P00444N48452P36683R59099J113742J058817Q22812
3516.3C75077873Q57175J189798J415610J207233Q10146O96063Q90732J174033J364737
3534.6C84683400J280487J124173J374364J706392J494467R59545R33111J240939J319528
3553C96116406J374036J593232J837850K044737K095908J823425J584947J797617K038657
3571.3D12306815K090484K205074K393812K650797K989352L198862K908170K266020
3587.7D33009386K355695K847582K987534L077030L243655L229588L247231L423632
3604D57421333L377676L258109L383994L551900L635466L563434L335357L364384L572464
$$ plain form
3479.6 359829724 360474020 361025929 361822188 362625808 363303304 364125013 365111798 366120368 367117584
3497.9 367117584 368150473 369137824 369838268 370386720 371123403 372082502 373196244 374255061 375077873
3516.3 375077873 375935048 377124846 378540456 379747689 380557835 381253898 382144630 383318663 384683400
3534.6 384683400 385963887 387088060 388462424 390168816 391663283 392622828 393555939 394796878 396116406
3553 396116406 397490442 399083674 400921524 402966261 405062169 406885594 408470541 410268158 412306815
3571.3 412306815 414397299 416602373 418996185 421646982 424636334 427835196 430743366 433009386
3587.7 433009386 435365081 438212663 441200197 444277227 447520882 450750470 453997701 457421333
3604 457421333 460799009 464057118 467441112 470993012 474628478 478191912 481527269 484891653 488464117
3622.3D88464117L744781L644466L203989L270328L548204L538967L508925L568292
3638.7E16492069L717661L952503M172325M127979L557086K961457L031015L125489
3655E45137584L267825L443062L258765L138602L487646L643751L219188L173291L143847
3673.3E74913561K252698J967073K433896K651095K972305L293097L078282K030909
3689.6E95592916J421511J775205K049327K107680K033472J803935J919985K347528
3706F11051559K427817J794457R51290J204610J749158J805365J643360J469433J233280
3724.3F25330329J135647J611471K100528K097547J473725Q06152J133740J653374
3740.6F37342513J160144N33820J402795J487911K26855J69098J159311J319945Q24928
$$ plain form
3622.3 488464117 492208898 495853364 499057353 502327681 505875885 509414852 512923777 516492069
3638.7 516492069 520209730 524162233 528334558 532462537 536019623 538981080 542012095 545137584
3655 545137584 548405409 551848471 555107236 558245838 561733484 565377235 568596423 571769714 574913561
3673.3 574913561 577166259 579133332 581567228 584218323 587190628 590483725 593562007 595592916
3689.6 595592916 597014427 598789632 600838959 602946639 604980111 606784046 608704031 611051559
3706 611051559 613479376 615273833 616225123 617429733 619178891 620984256 622627616 624097049 625330329
3724.3 625330329 626465976 628077447 630177975 632275522 633749247 634555399 635689139 637342513
3740.6 637342513 638502657 639036477 640439272 641927183 642154038 642323136 643482447 644802392 645627320
3759F45627320P60674J108110J157403R90272O62744N50687R43005J316369J301706
3777.3F54418290Q57055O06537O25968N75125P05063R63569J157582J166701J055360
3795.7F62131250J186192R70960L40223N12242M46201O7174O47068J336694J231074
3814.1F68869078Q35002R72747N63145J9789M84764O99401O97911Q11637R48667J188338
3834.4F76090479Q84831M2081j41859J22368L53277Q22067J409650J291394l53396
3852.8F80520892j032948N11169J106560R80258O00636M36485O81400M50790J24157
3871.2F84379399K29060M08948O31809N20051M45008O20246L03566J60814L32176R0838
3891.6F88121915J06096O46770R52184P53701K48075k10107k52962k861J98066M35710
$$ plain form
3759 645627320 646387994 647496104 648653507 649643779 650306523 650857210 651800215 653116584 654418290
3777.3 654418290 655275345 655881882 656507850 657082975 657788038 658751607 659909189 661075890 662131250
3795.7 662131250 663317442 664288402 664628625 665140867 665587068 665654242 666301310 667638004 668869078
3814.1 668869078 669704080 670676827 671239972 671259761 671744525 672443926 673141837 673953474 674902141 676090479
3834.4 676090479 676975310 677017391 676875532 676997900 677351177 678173244 679582894 680874288 680520892
3852.8 680520892 679487944 679999113 681105673 682085931 682686567 683123052 683804452 684255242 684379399
3871.2 684379399 684608459 685017407 685649216 686169267 686614275 687234521 687538087 687698901 688031077 688121915
3891.6 688121915 688228011 688874781 689826965 690580666 690828741 690618634 690365672 690362811 690560877 690996587
3912F90996587O42777N37574K29478J54853K09093J16467J82927L83377L02374J11461
3932.3F93866968J16766K35140L46601L32057K18690K48611K93851J57952J08898J76847
3952.7F96102381J43468J70589L00526K65241J76847K43783L04639K44439J04189j2636
3973.1F98043466L8325K09511K69711K28286J78515J05739J50025K89619K70128J34528
3993.5F99917853R1255J45971
3997.6G00155079
$$ plain form
3912 690996587 691639364 692176938 692406416 692561269 692770362 692886829 693069756 693453133 693755507 693866968
3932.3 693866968 693983734 694218874 694565475 694897532 695116222 695364833 695658684 695816636 695925534 696102381
3952.7 696102381 696245849 696416438 696716964 696982205 697159052 697402835 697707474 697951913 698056102 698043466
3973.1 698043466 698081791 698291302 698561013 698789299 698967814 699073553 699223578 699513197 699783325 699917853
3993.5 699917853 700009108 700155079
3997.6 700155079
##END=$$ End of the data block
