##TITLE=$$ Begin of the data block
##JCAMP-DX=5.00 $$ ACD/SpecManager v 10.08
##SPECTROMETER/DATA SYSTEM=Alpha
##DATE=22 Dec 2014 10:36:42
##DATA TYPE=INFRARED SPECTRUM
##DATA CLASS=XYDATA
##ORIGIN=
##OWNER=
##NPOINTS=1765
##FIRSTX=399.76428223
##LASTX=3997.64306641
##MAXX=3997.64306641
##MINX=399.76428223
##MAXY=0.83454478
##MINY=0.28149584
##XFACTOR=1.0000000000
##YFACTOR=1.000000000000000e-9
##FIRSTY=0.56119639
##DELTAX=2.03961372
##XUNITS=1/CM
##YUNITS=ARBITRARY UNITS
##XYDATA=(X++(Y..Y))
$$ plain form
399.8 561196387 551873386 547126830 548150957 550853729 550550938 548637450 549670875 554469109 558440506
418.1 558440506 554869056 548354864 546058238 547308505 546970308 541934609 535373628 532888055 535034955
436.5 535034955 537388504 537424326 537770212 542433858 550386131 555884063 555686951 553116918 553542435
454.8 553542435 557184041 558345139 553894520 547874689 545408726 546422243 545777559 540556014 533946574
473.2 533946574 531369209 532647848 533083200 530156255 526584268 526611686 529967487 531812310 529087305
491.5 529087305 524594903 523069620 524670839 525086164 521160066 515402079 512646616 512810469 511474967
509.9 511474967 506370127 500081360 496260136 494929522 492630661 487752616 482886285 481471330
526.2 481471330 483563602 485790670 485813528 485296905 488278389 495730698 503562331 507524014 508129418
$$ packed form
399.8E61196387r323001m746556J024127K702772l02791j913488J033425M798234L971397
418.1E58440506l571450o514192k296626J250267l38197n035699o560981k485573K146900
436.5E35034955K353549L5822L45886M663646P952273N497932j97112k570033M25517
454.8E53542435L641606J161098m450619o019831k465963J013517o44684n221545o609440
473.2E33946574k577365J278639M35352k926945l571987K7418L355801J844823k725005
491.5E29087305m492402j525283J601219M15325l926098n757987k755463J63853j335502
509.9E11474967n104840o288767l821224j330614k298861m878045m866331j414955
526.2D81471330K092272K227068K2858n16623K981484P452309P831633L961683O05404
$$ plain form
544.6 508129418 509141028 511935174 513427854 510793805 505602419 501696169 500318527 498450458
560.9 498450458 492717624 484185338 476810366 472338945 469058663 465356946 462538749 463381261 468898684
579.3 468898684 476774335 483480215 488163233 493073553 499616683 505585194 507558048 505816936
595.6 505816936 504297197 505585015 507963479 508143485 505793631 504039705 505612552 509319901 511752725
613.9 511752725 511875093 512451291 516413391 522729874 527671158 529427052 530344427 533527493 538565457
632.3 538565457 542065561 542144179 541076660 542303503 545893371 548518360 547975659 546316862 547149718
650.6 547149718 550655782 553492427 553259790 551620543 552157402 555553079 558724463 558602571 556209326
669 556209326 557132483 560971141 564728916 565829098 564827621 565068901 568189025 571747720 572461963
$$ packed form
544.6E08129418J011610K794146J492680k634049n191386l906250j377642j868069
560.9D98450458n732834q532286p374972m471421l280282l701717k818197Q42512N517423
579.3D68898684P875651O705880M683018M910320O543130N968511J972854j741112
595.6E05816936j519739J287818K378464J80006k349854j753926J572847L707349K432824
613.9E11752725J22368N76198L962100O316483M941284J755894R17375L183066N037964
632.3E38565457L500104P8618j067519J226843L589868K624989n42701j658797Q32856
650.6E47149718L506064K836645k32637j639247N36859L395677L171384j21892k393245
669E56209326R23157L838658L757775J100182j001477K41280L120124L558695P14243
$$ plain form
687.3 572461963 570473909 569023907 569962621 571155846 569290280 564397633 559889317 558235466 558279812
705.7 558279812 557411432 555422306 554993272 558362067 564323843 569584131 572891593 576385260 582555234
724.1 582555234 590717435 597490191 600901961 602847338 606412947 611661077 615473628 615662098 613817453
742.4 613817453 613056064 613670349 612723887 608040094 601317525 596056819 593225837 590623260 586287737
760.8 586287737 581474125 579452336 581687987 586422622 591165602 595747292 602310240 612056494
777.1 612056494 622782707 630958915 635838568 640053630 645930409 652451515 656789601 658424079
793.4 658424079 660261631 664980888 671510518 676440597 678374588 679525256 682551742 686875522
809.7 686875522 689473391 688987851 687663913 688338459 690655887 691524923 689057708 684896469 681861937
$$ packed form
687.3E72461963j988054j450002R38714J193225j865566m892647m508316j653851M4346
705.7E58279812q68380j989126m29034L368795N961776N260288L307462L493667O169974
724.1E82555234Q162201O772756L411770J945377L565609N248130L812551J88470j844645
742.4F13817453p61389O14285r46462m683793o722569n260706k830982k602577m335523
760.8E86287737m813612k021789K235651M734635M742980M581690O562948R746254
777.1F12056494J0726213Q176208M879653M215062N876779O521106M338086J634478
793.4F58424079J837552M719257O529630M930079J933991J150668L026486M323780
809.7F86875522K597869m85540j323938O74546K317428Q69036k467215m161239l034532
$$ plain form
828.1 681861937 680080354 676939905 670865059 663516819 657825828 654561281 651633918 647041917
844.4 647041917 641467690 637149572 634810388 632488489 627854586 621273100 615809977 614549220
860.7 614549220 618087828 624587595 632558286 642625630 655315399 668355823 677968919 682583153
877 682583153 683983684 684366584 683373332 679109275 671542227 663342297 657004476 652274191 647108555
895.4 647108555 640614271 634033680 628816903 624480963 618888378 610695243 600861549 591245115
911.7 591245115 582283139 572932243 562793374 553385556 546916127 543986738 543017507 542190135 541507661
930.1 541507661 542396665 545520067 549798429 553745925 557209492 560951769 564406335 565031111 560518265
948.4 560518265 550997913 538588226 525119960 510771036 494897008 477547109 459659129 442007661
$$ packed form
828.1F81861937j781583l140449o074846p348240n690991l264547k927363m592001
844.4F47041917n574227m318118k339184k321899m633903o581486n463123j260757
860.7F14549220L538608O499767P970691J0067344J2689769J3040424R613096M614234
877F82583153J400531L82900r93252m264057p567048q199930o337821m730285n165636
895.4F47108555o494284o580591n216777m335940n592585q193135r833694r616434
911.7E91245115q961976r350896j0138869r407818o469429k929389r69231q27372o82474
930.1E41507661Q89004L123402M278362L947496L463567L742277L454566O24776m512846
948.4E60518265r520352j2409687j3468266j4348924j5874028j7349899j7887980j7651468
$$ plain form
964.7 442007661 424396694 406187803 387325943 368520647 350724429 334505737 319951385
979 319951385 307263464 296985894 289581090 285020322 282657802 281642616 281495839 282205075 283791393
997.4 283791393 285866410 287733406 288975567 289695233 290161192 290418833 290328115 290008396 290007353 290914863
1017.8 290914863 292792708 295225441 297892243 300847590 304312497 308241695 312121391 315278053
1034.1 315278053 317450076 318938255 320164651 321171641 321868211 322489381 323597312 325850129 329541206
1052.4 329541206 334408224 340145618 346928298 355180740 364904881 375008255 383058012 386031777
1068.8 386031777 382337183 373550266 363523811 355620354 351168633 350083768 351664037 354817092
1085.1 354817092 358590424 362836748 367943645 373859525 379732996 384421885 387338042 388859272
$$ packed form
964.7D42007661j7610967j8208891j8861860j8805296j7796218j6218692j4554352
979C19951385j2687921j0277570p404804m560768k362520j015186j46777P09236J586318
997.4B83791393K075017J866996J242161P19666M65959K57641r0718l19719j043R07510
1017.8B90914863J877845K432733K666802K955347L464907L929198L879696L156662
1034.1C15278053K172023J488179J226396J006990O96570O21170J107931K252817L691077
1052.4C29541206M867018N737394O782680Q252442R724141J0103374Q049757K973765
1068.8C86031777l694594q786917j0026455p903457m451721j084865J580269L153055
1085.1C54817092L773332M246324N106897N915880N873471M688889K916157J521230
$$ plain form
1101.4 388859272 389851183 390923262 392410308 394667447 397932678 402032644 406297863 409856349
1117.7 409856349 412264764 413898498 415595353 417974234 421132147 424927920 429113984 432997137
1134 432997137 435293943 434650540 430611521 424044341 416472912 409023225 402051121 395655274 390267134
1152.4 390267134 386490852 384532362 384025007 384489447 386011690 389206409 394583285 402080983 411120325
1170.7 411120325 421206832 432350904 444602579 457549244 470436424 482675493 494269520
1185 494269520 505357385 515483499 523755193 529708564 533817768 537011445 539839864 542240560
1201.3 542240560 544090986 545882225 548488140 552305639 556947649 561779261 566585124 571431398
1217.7 571431398 576032877 579629421 581565976 581947148 581518710 580851316 579882741 578334332 576377928
$$ packed form
1101.4C88859272R91911J072079J487046K257139L265231M099966M265219L558486
1117.7D09856349K408415J633734J696855K378881L157913L795773M186064L883153
1134D32997137K296806o43403m039019o567180p571429p449687o972104o395847n388140
1152.4C90267134l776282j958490n07355M64440J522243L194719N376876P497698R039342
1170.7D11120325J0086507J1144072J2251675J2946665J2887180J2239069J1594027
1185D94269520J1087865J0126114Q271694N953371M109204L193677K828419K400696
1201.3E42240560J850426J791239K605915L817499M642010M831612M805863M846274
1217.7E71431398M601479L596544J936555L81172m28438o67394r68575j548409j956404
$$ plain form
1236 576377928 574624121 573542714 573114693 573051274 573351026 574386954 576335073 578779161 581003428
1254.4 581003428 582627416 583834767 585016191 586323202 587671280 589137912 591009796 593336523
1270.7 593336523 595644474 597206235 597667038 597338140 596825123 596442580 596029878 595295072 594249547
1289 594249547 593158841 592081249 590739548 588879406 586651921 584498048 582639635 580896080 579012692
1307.4 579012692 577108741 575550497 574448228 573592722 572620809 571204901 569257975 566676497 563152194
1325.8 563152194 558546484 553181946 547784567 543152511 539714277 537333548 535654783 534708142
1342.1 534708142 534609318 535071015 535567641 535671949 535326898 534699917 533939481 533184707 532420814 531350195
1362.5 531350195 530109763 529262006 528884888 528975010 529523849 530189812 530788720 531461179 532185853 533307254
$$ packed form
1236E76377928j753807j081407m28021o3419K99752J035928J948119K444088K224267
1254.4E81003428J623988J207351J181424J307011J348078J466632J871884K326727
1270.7E93336523K307951J561761M60803l28898n13017l82543m12702p34806j045525
1289E94249547j090706j077592j341701j860142k227485k153873j858413j743555j883388
1307.4E79012692j903951j558244j102269q55506r71913j415908j946926k581478l524303
1325.8E63152194m605710n364538n397379m632056l438234k380729j678765r46641
1342.1E34708142r8824M61697M96626J04308l45051o26981p60436p54774p63893j070619
1362.5E31350195j240432q47757l77118R0122N48839O65963N98908O72459P24674J121401
$$ plain form
1382.9 533307254 535667837 539531410 543729961 547175705 549805462 551222026 551207840 550190866 548837841
1401.2 548837841 547500312 545777500 543763399 541866302 540032983 538443387 537447155 536658525 535469234
1419.6 535469234 534654260 534609497 534958124 535757005 536909521 538264275 540028095 542031288 543575466
1437.9 543575466 544830561 546344101 547948837 549223781 549578190 549030423 548385680 548058271 547000706
1456.3 547000706 544191539 542466521 542809486 544555962 547274947 551248848 557402492 566332877
1472.6 566332877 575453222 583089411 590163291 597185194 604128063 610778749 617515683 624120772
1488.9 624120772 629469097 633609533 637971640 642731369 646617591 649847448 653395414 657905519
1505.2 657905519 662107229 663840115 665193915 667304218 670003951 672819674 675437272 677615523
$$ packed form
1382.9E33307254K360583L863573M198551L445744K629757J416564j4186j016974j353025
1401.2E48837841j337529j722812k014101j897097j833319j589596r96232p88630j189291
1419.6E35469234q14974m4763L48627P98881J152516J354754J763820K003193J544178
1437.9E43575466J255095J513540J604736J274944L54409n47767o44743l27409j057565
1456.3E47000706k809167j725018L42965J746476K718985L973901O153644Q930385
1472.6E66332877R120345P636189P073880P021903O942869O650686O736934O605089
1488.9F24120772N348325M140436M362107M759729L886222L229857L547966M510105
1505.2F57905519M201710J732886J353800K110303K699733K815723K617598K178251
$$ plain form
1521.6 677615523 678782701 679537892 680339575 681462944 683123589 684406221 685288668 687016726 688928843
1539.9 688928843 688655376 687248826 686025262 685416222 685249984 685305834 685738385 686654627 686600685 683498681
1560.3 683498681 681359887 680523634 679946005 679251015 678057492 677368283 677349091 676410437 674714744
1578.7 674714744 673604250 672860146 672086716 671064019 669794202 668454528 667187572 665740609 663871408
1597 663871408 661767066 659606278 657369196 654976010 652259946 648983657 645582676 642824709 640006661
1615.4 640006661 635756910 631961405 629219651 625999808 622547626 619196773 615878582 613731742
1631.7 613731742 612771988 611121476 608630002 607082427 606725693 607527196 608966589 610070109 611377060
1650.1 611377060 613611877 615453184 616614103 618685603 621834695 625593722 629328549 633179963
$$ packed form
1521.6F77615523J167178P55191Q01683J123369J660645J282632Q82447J728058J912117
1539.9F88928843k73467j406550j223564o09040j66238N5850M32551R16242n3942l102004
1560.3F83498681k138794q36253n77629o94990j193523o89209j9192r38654j695693
1578.7F74714744j110494p44104p73430j022697j269817j339674j266956j446963j869201
1597F63871408k104342k160788k237082k393186k716064l276289l400981k757967k818048
1615.4F40006661m249751l795505k741754l219843l452182l350853l318191k146840
1631.7F13731742r59754j650512k491474j547575l56734Q01503J439393J103520J306951
1650.1F11377060K234817J841307J160919K071500L149092L759027L734827L851414
$$ plain form
1666.4 633179963 637862027 642723858 646764636 650977373 655574381 660167158 665169656 670854270
1682.7 670854270 676462471 680398822 683995366 688040376 692130029 696704686 701375365 705193162
1699 705193162 708008528 709928274 711714268 713389158 715071857 717257023 720024765 723062992 725300312
1717.4 725300312 726176381 727125168 728651226 730475843 732653141 735374749 738310218 740680397 741851449
1735.7 741851449 743017912 744810283 746788800 748834014 751146138 753729582 756182551 758205354
1752 758205354 760223329 762505889 764768362 766953349 769033968 770765185 772514164 774527729 776614964
1770.4 776614964 778142333 778820693 779419541 780308485 781309426 782322824 783350825 784325182 785525143
1788.8 785525143 787000775 788085401 788679719 789396703 790223122 790861249 791399121 792143941 793082356
$$ packed form
1666.4F33179963M682064M861831M040778M212737M597008M592777N002498N684614
1682.7F70854270N608201L936351L596544M045010M089653M574657M670679L817797
1699G05193162K815366J919746J785994J674890J682699K185166K767742L038227K237320
1717.4G25300312Q76069R48787J526058J824617K177298K721608K935469K370179J171052
1735.7G41851449J166463J792371J978517K045214K312124K583444K452969K022803
1752G58205354K017975K282560K262473K184987K080619J731217J748979K013565K087235
1770.4G76614964J527369O78360N98848Q88944J000941J013398J028001R74357J199961
1788.8G85525143J475632J084626N94318P16984Q26419O38127N37872P44820R38415
$$ plain form
1807.1 793082356 793943167 794536114 795043945 795778811 796546817 797100902 797712088 798661947 799748123
1825.5 799748123 800695777 801194012 801095128 801184535 801764667 802349329 802786469 803389549 804007947 804236710
1845.9 804236710 804288328 804297745 804302335 804473996 804866910 805287898 805504024 805585861 805965483 806847274 807581723
1868.3 807581723 807454169 807041228 807028055 807374716 807828963 808160007 808359802 808682501 809323430 810021222
1888.7 810021222 810311735 810365677 810508311 810723364 810982883 811209500 811324120 811482072 811813116 812128961
1909.1 812128961 812197089 812168360 812364459 812738359 813028514 813181698 813127160 812942505 812983692 813253403
1929.5 813253403 813464999 813509941 813535810 813759983 814222753 814619601 814574957 814335883 814350188 814633667
1949.9 814633667 814948499 815115571 815189481 815365911 815702319 816020608 816234648 816398740 816525280 816667378
$$ packed form
1807.1G93082356Q60811N92947N07831P34866P68006N54085O11186R49859J086176
1825.5G99748123R47654M98235r8884Q9407N80132N84662M37140O03080O18398K28763
1845.9H04236710N1618R417M590J71661L92914M20988K16126Q1837L79622Q81791P34449
1868.3H07581723j27554m12941j3173L46661M54247L31044J99795L22699O40929O97792
1888.7H10021222K90513N3942J42634K15053K59519K26617J14620J57952L31044L15845
1909.1H12128961O8128k8729J96099L73900K90155J53184n4538j84655M1187K69711
1929.5H13253403K11596M4942K5869K24173M62770L96848m4644k39074J4305K83479
1949.9H14633667L14832J67072P3910J76430L36408L18289K14040J64092J26540J42098
$$ plain form
1970.3 816667378 816838086 816914439 816907108 816998243 817239940 817489207 817587137 817569435 817635238 817855716 817993045
1992.7 817993045 817896247 817733169 817671180 817751884 817862689 817800224 817521751 817233324 817109406 817096472
2013.1 817096472 816969335 816531539 815889597 815322578 814783633 814184666 813823879 813738942 813673556 813567460
2033.5 813567460 813353300 812945366 812472463 812150717 811988354 811812639 811505675 811160028 810976982 811008036
2053.9 811008036 811080515 811002433 810822189 810805023 811054647 811315000 811341524 811197221 811136127 811291575
2074.3 811291575 811493635 811517298 811402678 811366558 811523855 811787486 811936319 811881483 811828494 812011063
2094.7 812011063 812366784 812625408 812651277 812625229 812815666 813196838 813467503 813452840 813340366 813414097
2115.1 813414097 813705146 813956439 813910723 813674808 813623130 813872874 814128220 814110041 813900352 813821316
$$ packed form
1970.3H16667378J70708P6353p331R1135K41697K49267R7930j7702O5803K20478J37329
1992.7H17993045r6798j63078o1989Q0704J10805o2465k78473k88427j23918j2934
2013.1H17096472j27137m37796o41942n67019n38945n98967l60787q4937o5386j06096
2033.5H13567460k14160m07934m72903l21746j62363j75715l06964l45647j83046L1054
2053.9H11008036P2479p8082j80244j7166K49624K60353K6524j44303o1094J55448
2074.3H11291575K02060K3663j14620l6120J57297K63631J48833n4836n2989J82569
2094.7H12011063L55721K58624K5869k6048J90437L81172K70665j4663j12474P3731
2115.1H13414097K91049K51293m5716k35915n1678K49744K55346j8179k09689p9036
$$ plain form
2135.5 813821316 814024568 814306736 814360023 814149261 813993812 814174712 814529538 814663827 814527094 814453900
2155.9 814453900 814719319 815225780 815592647 815641105 815660357 816031396 816741109 817368567 817626178 817772448
2176.3 817772448 818211257 818953037 819629014 819942117 820070088 820448637 821177483 821866274 822149158 822177112
2196.7 822177112 822413206 823031425 823710799 824044406 824097753 824322820 824937224 825669348 826076865 826123595
2217.1 826123595 826246142 826733232 827368915 827727735 827748120 827813923 828219771 828838766 829252958 829233706
2237.5 829233706 829107702 829350770 829932570 830374002 830378294 830200732 830342174 830871344 831319928 831347585
2257.9 831347585 831167340 831244171 831722379 832240403 832386553 832246125 832306266 832804620 833391964 833594382
2278.3 833594382 833413780 833311856 833645940 834183276 834360480 834060967 833804488 834009647 834437430 834544778
$$ packed form
2135.5H13821316K03252K82168N3287k10762j55449J80900L54826J34289j36733p3194
2155.9H14453900K65419N06461L66867M8458J9252L71039P09713O27458K57611J46270
2176.3H17772448M38809P41780O75977L13103J27971L78549P28846O88791K82884K7954
2196.7H22177112K36094O18219O79374L33607N3347K25067O14404P32124M07517M6730
2217.1H26123595J22547M87090O35683L58820K0385O5803M05848O18995M14192j9252
2237.5H29233706j26004K43068N81800M41432M292j77562J41442N29170M48584K7657
2257.9H31347585j80245P6831M78208N18024J46150j40428O0141M98354N87344K02418
2278.3H33594382j80602j01924L34084N37336J77204k99513k56479K05159M27783J07348
$$ plain form
2298.7 834544778 834146082 833635569 833504736 833694279 833707511 833286524 832749784 832582891 832719684 832599521
2319.1 832599521 831927717 831117153 830757082 830773354 830645502 830151737 829560459 829252601 829328597 829387665
2339.5 829387665 828973174 828434050 828707337 829692185 830177844 829461575 827881277 826497316 826003492
2357.8 826003492 826107144 826056421 825769126 825802624 826464951 827454329 828223109 828594029 828945279 829715908
2378.2 829715908 830770195 831528664 831654489 831380606 831226230 831379116 831501842 831242681 830744803
2396.6 830744803 830475748 830586195 830679715 830325544 829630792 829085290 828935921 828911185 828582942 827893734
2417 827893734 827244818 826982677 826897681 826521993 825748265 824948728 824508607 824301541 823867142 823059797
2437.4 823059797 822246253 821794510 821587145 821215570 820476651 819589913 818940043 818605840 818279684 817649305
$$ packed form
2298.7H34544778l98696n10513j30833J89543J3232m20987n36740j66893J36793j20163
2319.1H32599521o71804q10564l60071J6272j27852m93765n91278l07858P5996N9068
2339.5H29387665m14491n39124K73287R84848M85659p16269j580298j383961m93824
2357.8H26003492J03652n0723k87295L3498O62327R89378P68780L70920L51250P70629
2378.2H29715908J054287P58469J25825k73883j54376J52886J22726k59161m97878
2396.6H30744803k69055J10447R3520l54171o94752n45502j49369k4736l28243o89208
2417H27893734o48916k62141q4996l75688p73728p99537m40121k07066m34399q07345
2437.4H23059797q13544m51743k07365l71575p38919q86738o49870l34203l26156o30379
$$ plain form
2457.8 817649305 816837609 816257119 816000342 815739751 815171063 814368606 813711584 813426435 813264608 812813699
2478.1 812813699 812058628 811405659 811133444 811042130 810724676 810072303 809427679 809145927 809122860 808952332
2498.5 808952332 808467507 807931662 807672977 807652473 807528257 807093799 806521237 806155920 806051433 805894375
2518.9 805894375 805413246 804728866 804211020 803972602 803732276 803175211 802373230 801684678 801251531 800872743
2539.3 800872743 800285459 799463689 798675239 798158705 797815263 797328174 796553612 795733511 795170188 794791043
2559.7 794791043 794297218 793571472 792806447 792288721 791990101 791566372 790848732 790026963 789385319 789008200
2580.1 789008200 788661540 788087487 787372530 786829770 786589265 786416471 785990775 785324574 784743249 784451187
2600.5 784451187 784283876 783924162 783285558 782595396 782074034 781636178 781005383 780069768 779036999
$$ packed form
2457.8H17649305q11696n80490k56777k60591n68688q02457o57022k85149j61827m50909
2478.1H12813699p55071o52969k72215r1314l17454o52373o44624k81752k3067j70528
2498.5H08952332m84825n35845k58685k0504j24216m34458n72562l65317j04487j57058
2518.9H05894375m81129o84380n17846k38418k40326n57065q01981o88552m33147l78788
2539.3H00872743n87284q21770p88450n16534l43442m87089p74562q20101n63323l79145
2559.7G94791043m93825p25746p65025n17726k98620m23729p17640q21769o41644l77119
2580.1G89008200l46660n74053p14957n42760k40505j72794m25696o66201n81325k92062
2600.5G84451187j67311l59714o38604o90162n21362m37856o30795r35615j032769
$$ plain form
2618.9 779036999 778179765 777501583 776723981 775635779 774419844 773375213 772479177 771501482 770308197
2637.2 770308197 769003212 767834783 766870201 765900075 764733672 763429224 762224495 761272371 760405242
2655.6 760405242 759350240 758107185 756897390 755905569 755070150 754139841 753030777 751956046 751112640
2673.9 751112640 750391781 749565244 748566985 747542083 746696532 746007204 745227158 744239628 743202865
2692.3 743202865 742330432 741600513 740743101 739620626 738377929 737222672 736251354 735315263 734210432
2710.7 734210432 732998013 731903911 731023014 730213583 729282498 728223979 727231205 726458967 725811541
2729 725811541 725073695 724186897 723328471 722660601 722103357 721451879 720627785 719774365 719063103 718503535
2749.4 718503535 717938900 717240751 716502905 715908706 715482950 715027034 714378238 713619232 712949693 712456286
$$ packed form
2618.9G79036999q57234o78182p77602j088202j215935j044631q96036r77695j193285
2637.2G70308197j304985j168429r64582r70126j166403j304448j204729r52124q67129
2655.6G60405242j055002j243055j209795r91821q35419r30309j109064j074731q43406
2673.9G51112640p20859q26537r98259j024902q45551o89328p80046r87530j036763
2692.3G43202865q72433p29919q57412j122475j242697j155257r71318r36091j104831
2710.7G34210432j212419j094102q80897q09431r31085j058519r92774p72238o47426
2729G25811541p37846q86798q58426o67870n57244o51478q24094q53420p11262n59568
2749.4G18503535n64635o98149p37846n94199m25756m55916o48796p59006o69539m93407
$$ plain form
2769.8 712456286 711980045 711302519 710445702 709597290 708826542 708038807 707112670 706012607 704855025
2788.2 704855025 703792393 702744365 701513231 700094998 698601544 697132826 695696473 694145262
2804.5 694145262 692389607 690551758 688767910 687009573 685155749 683123291 680978298 678869843
2820.8 678869843 676806569 674645960 672303796 669840038 667344451 664847553 662291229 659555256
2837.1 659555256 656583667 653445125 650219023 646852791 643242478 639500082 635968804 632917523
2853.4 632917523 630319893 627901852 625338614 622484267 619358540 615868568 611812770 607220411
2869.7 607220411 602382302 597482085 592529774 587644517 583085358 579080582 575770617 573216259
2886.1 573216259 571345687 569986641 569011152 568340480 567810893 567206800 566435754 565502048 564418256
$$ packed form
2769.8G12456286m76241o77526q56817q48412p70748p87735r26137j100063j157582
2788.2G04855025j062632j048028j231134j418233j493454j468718j436353j551211
2804.5F94145262j755655j837849j783848j758337j853824k032458k144993k108455
2820.8F78869843k063274k160609k342164k463758k495587k496898k556324k735973
2837.1F59555256k971589l138542l226102l366232l610313l742396l531278l051281
2853.4F32917523k597630k418041k563238k854347l125727l489972m055798m592359
2869.7F07220411m838109m900217m952311m885257m559159m004776l309965k554358
2886.1E73216259j870572j359046r75489o70672n29587o04093p71046r33706j083792
$$ plain form
2904.4 564418256 563153744 561587393 559549868 556953132 553870499 550486624 547007084 543571532
2920.7 543571532 540329516 537537694 535482109 534300566 533945382 534476519 536108196 538886726 542630613
2939.1 542630613 547078550 551952004 557026207 562238991 567620873 573096573 578491628 583748877
2955.4 583748877 588980138 594258666 599425018 604192317 608477950 612447202 616252542 619923592
2971.7 619923592 623417139 626734495 629964352 633114457 636016309 638535440 640759528 642835021
2988 642835021 644806385 646570146 647958934 648989201 649751186 650270820 650581241 650630474 650369823
3006.4 650369823 649893999 649285853 648461759 647266865 645716548 643965065 642131507 640293956 638380408
3024.7 638380408 636294305 634138525 632005095 629864633 627583146 625090420 622569025 620145559
$$ packed form
2904.4E64418256j264512j566351k037525k596736l082633l383875l479540l435552
2920.7E43571532l242016k791822k055585j181543l55184N31137J631677K778530L743887
2939.1E42630613M447937M873454N074203N212784N381882N475700N395055N257249
2955.4E83748877N231261N278528N166352M767299M285633L969252L805340L671050
2971.7F19923592L493547L317356L229857L150105K901852K519131K224088K075493
2988F42835021J971364J763761J388788J030267P61985N19634L10421M9233k60651
3006.4F50369823m75824o08146q24094j194894j550317j751483j833558j837551j913548
3024.7F38380408k086103k155780k133430k140462k281487k492726k521395k423466
$$ plain form
3041.1 620145559 617734432 615194559 612489700 609772384 607128680 604499340 601853967 599126041
3057.4 599126041 596320987 593589365 590983212 588436007 585798442 582978606 580138803 577474177
3073.7 577474177 575019002 572614133 570024014 567268372 564513445 561811507 559176385 556525648
3090 556525648 553737223 550946832 548360050 545938194 543464482 540790379 538104177 535663128 533320069
3108.4 533320069 530819356 528316081 526031554 523824215 521489859 518937945 516213536 513553679
3124.7 513553679 511120915 508848548 506564021 504181325 501841843 499707162 497626543 495337576
3141 495337576 492922604 490618020 488474667 486506134 484637588 482597321 480319738 478073120 476010233
3159.4 476010233 474042714 472068638 470075995 468112141 466213107 464355648 462505460 460679293
$$ packed form
3041.1F20145559k411127k539873k704859k717316k643704k629340k645373k727926
3057.4E99126041k805054k731622k606153k547205k637565k819836k839803k664626
3073.7E77474177k455175k404869k590119k755642k754927k701938k635122k650737
3090E56525648k788425k790391k586782k421856k473712k674103k686202k441049k343059
3108.4E33320069k500713k503275k284527k207339k334356k551914k724409k659857
3124.7E13553679k432764k272367k284527k382696k339482k134681k080619k288967
3141D95337576k414972k304584k143353j968533j868546k040267k277583k246618k062887
3159.4D76010233j967519j974076j992643j963854j899034j857459j850188j826167
$$ plain form
3175.7 460679293 458891720 457156420 455470711 453798085 452122301 450456798 448814005 447180778
3192 447180778 445534259 443871677 442242384 440728128 439333469 437973440 436578482 435135275 433715731
3210.3 433715731 432366341 431041539 429720908 428401679 427080840 425783694 424542665 423369616
3226.7 423369616 422274679 421269774 420262754 419081658 417781502 416567087 415483713 414520890
3243 414520890 413655013 412734926 411636144 410501301 409538060 408705354 407832891 406926274 406090558 405298084
3263.4 405298084 404518962 403853953 403317034 402669251 401799023 400885880 400044471 399271786 398542762 397826612
3283.8 397826612 397143692 396528870 395976573 395422727 394768775 393985957 393114030 392264515 391591042 391113490
3304.2 391113490 390613705 389848202 388850182 387796164 386791378 385862350 384989232 384164691 383393228
$$ packed form
3175.7D60679293j787573j735300j685709j672626j675784j665503j642793j633227
3192D47180778j646519j662582j629293j514256j394659j360029j394958j443207j419544
3210.3D33715731j349390j324802j320631j319229j320839j297146j241029j173049
3226.7D23369616j094937j004905j007020j181096j300156j214415j083374r62823
3243D14520890q65877r20087j098782j134843r63241q32706q72463r06617q35716p92474
3263.4D05298084p79122o65009n36919o47783q70228r13143q41409p72685p29024p16150
3283.8C97826612o82920o14822n52297n53846o53952p82818q71927q49515o73473m77552
3304.2C91113490m99785p65503r98020j054018j004786r29028q73118q24541p71463
$$ plain form
3322.5 383393228 382618308 381720871 380690902 379678369 378766179 377926290 377161294 376357317 375376135
3340.9 375376135 374323398 373293102 372344136 371527046 370611995 369462311 368286312 367276400 366430879
3359.2 366430879 365553558 364595354 363807678 363158882 362268955 361049831 359861016 358923882 358097464
3377.6 358097464 357284814 356459588 355663925 355018228 354635537 354517221 354255676 353550047 352810055 352493584
3398 352493584 352367908 351883769 351083547 350471228 350121200 349838704 349577278 349244773 348855793 348550320
3418.4 348550320 348261625 347983599 347895414 348043501 348331451 348577261 348796159 349090070 349204689 349001467
3438.8 349001467 348850518 349051982 349470526 349833757 350092798 350427181 350909173 351472884 352136016 352893382
3459.2 352893382 353509754 354047477 354930639 356058687 356819808 357061893 357339054 358011514 358998001
$$ packed form
3322.5C83393228p74920q97437j029969j012533r12190q39889p64996q03977r81182
3340.9C75376135j052737j030296r48966q17090r15051j149684j175999j009912q45521
3359.2C66430879q77321r58204p87676o48796q89927j219124j188815r37134q26418
3377.6C58097464q12650q25226p95663o45697l82691j18316k61545p05629p39992l16471
3398C52493584j25676m84139q00222o12319l50028k82496k61426l32505l88980l05473
3418.4C48550320k88695k78026q8185J48087K87950K45810K18898K93911J14619k03222
3438.8C49001467j50949K01464M18544L63231K59041L34383M81992N63711O63132P57366
3459.2C52893382O16372N37723Q83162J128048P61121K42085K77161O72460R86487
$$ plain form
3477.5 358998001 359973103 360590786 361106455 361874521 362656534 363346666 364191085 365192354 366203129
3495.9 366203129 367162853 368168086 369170874 369900256 370481402 371215105 372121245 373207778 374309272
3514.2 374309272 375204951 376121491 377345532 378744245 379869252 380628079 381377280 382344007 383549511
3532.6 383549511 384918988 386189312 387283802 388603181 390243322 391723603 392755657 393796682
3548.9 393796682 395099461 396417677 397816271 399460673 401304841 403307617 405360043 407210797
3565.2 407210797 408841997 410630792 412677318 414803118 417058110 419513583 422194093 425172687
3581.5 425172687 428349048 431229502 433483809 435905248 438847423 441858172 444939435 448236316
3597.9 448236316 451477021 454706222 458178014 461619675 464884549 468237072 471769154 475413412
$$ packed form
3477.5C58998001R75102O17683N15669P68066P82013O90132Q44419J001269J010775
3495.9C66203129R59724J005233J002788P29382N81146P33703R06140J086533J101494
3514.2C74309272Q95679R16540J224041J398713J125007P58827P49201R66727J205504
3532.6C83549511J369477J270324J094490J319379J640141J480281J032054J041025
3548.9C93796682J302779J318216J398594J644402J844168K002776K052426J850754
3565.2D07210797J631200J788795K046526K125800K254992K455473K680510K978594
3581.5D25172687L176361K880454K254307K421439K942175L010749L081263L296881
3597.9D48236316L240705L229201L471792L441661L264874L352523L532082L644258
$$ plain form
3614.2 475413412 479021698 482403606 485768318 489345253 493131131 496815234 500021994 503286481
3630.5 503286481 506824017 510340989 513852477 517421126 521141827 525144458 529365659 533429921
3646.8 533429921 536838055 539824128 542964935 546121716 549415529 552927971 556228518 559328139
3663.1 559328139 562767863 566424668 569654465 572807908 575963438 578231275 580147505 582527041
3679.4 582527041 585196733 588236094 591610432 594748735 596771121 598177254 599986672 602095068
3695.8 602095068 604218781 606212676 607963800 609807551 612098396 614533067 616382778 617421865
3712.1 617421865 618673921 620386004 622128367 623769164 625280142 626520157 627669036 629352510
3728.4 629352510 631549299 633683801 635043144 635717034 636854589 638549328 639721513 640257716 641629934
$$ packed form
3614.2D75413412L608286L381908L364712L576935L785878L684103L206760L264487
3630.5E03286481L537536L516972L511488L568649L720701M002631M221201M064262
3646.8E33429921L408134K986073L140807L156781L293813L512442L300547L099621
3663.1E59328139L439724L656805L229797L153443L155530K267837J916230K379536
3679.4E82527041K669692L039361L374338L138303K022386J406133J809418K108396
3695.8F02095068K123713J993895J751124J843751K290845K434671J849711J039087
3712.1F17421865J252056J712083J742363J640797J510978J240015J148879J683474
3728.4F29352510K196789K134502J359343O73890J137555J694739J172185N36203J372218
$$ plain form
3746.7 641629934 643106401 643433094 643705428 644865274 646126986 646913886 647697151 648845315 650036454
3765.1 650036454 651051223 651707590 652204633 653080225 654351950 655639768 656481266 657056391 657697499
3783.5 657697499 658339739 659098625 660042703 661113977 662258744 663414538 664655209 665547311 665811241
3801.8 665811241 666364491 666913331 667044044 667699099 669048011 670309544 671156526 672132730 672711432
3820.2 672711432 672685504 673093259 673780501 674460232 675220072 676185191 677437425 678382397 678446949 678234816
3840.6 678234816 678280652 678638995 679509163 680975974 682360232 682061613 680951178 681407511 682522535
3858.9 682522535 683512568 684140384 684590816 685222983 685635269 685694456 685824513 686216176 686915040 687528491
3879.3 687528491 688024938 688582838 688759923 688895881 689345062 689588606 689805508 690493286 691383839 692019880
$$ packed form
3746.7F41629934J476467L26693K72334J159846J261712P86900P83265J148164J191139
3765.1F50036454J014769O56367M97043Q75592J271725J287818Q41498N75125O41108
3783.5F57697499O42240P58886R44078J071274J144767J155794J240671Q92102K63930
3801.8F65811241N53250N48840J30713O55055J348912J261533Q46982R76204N78702
3820.2F72711432k5928M07755O87242O79731P59840R65119J252234R44972O4552k12133
3840.6F78234816M5836L58343Q70168J466811J384258k98619j110435M56333J115024
3858.9F82522535R90033O27816M50432O32167M12286N9187J30057L91663O98864O13451
3879.3F87528491M96447N57900J77085J35958M49181K43544K16902O87778Q90553O36041
$$ plain form
3899.7 692019880 692145586 691834509 691638350 691785097 692027390 692363799 692876637 693397462 693701088 693872035
3920.1 693872035 694092691 694261253 694450796 694861829 695220470 695286393 695311010 695506275 695829690 696138322
3940.5 696138322 696373940 696671784 696997523 697192490 697309494 697428107 697583199 697810829 698081672 698313415
3960.9 698313415 698489189 698724329 699071646 699400783 699572504 699620843 699695706 699886560 700117588 700287998
3981.3 700287998 700434506 700625181 700793922 700941384 701217949 701512218 701612055 701660097
3997.6 701660097
$$ packed form
3899.7F92019880J25706l11077j96159J46747K42293L36409N12838N20825L03626J70947
3920.1F93872035K20656J68562J89543M11033L58641O5923K4617J95265L23415L08632
3940.5F96138322K35618K97844L25739J94967J17004J18613J55092K27630K70843K31743
3960.9F98313415J75774K35140L47317L29137J71721M8339P4863J90854K31028J70410
3981.3G00287998J46508J90675J68741J47462K76565K94269R9837M8042
3997.6G01660097
##END=$$ End of the data block
