##TITLE=$$ Begin of the data block
##JCAMP-DX=5.00 $$ ACD/SpecManager v 10.08
##SPECTROMETER/DATA SYSTEM=Alpha
##DATE=22 Dec 2014 10:36:42
##DATA TYPE=INFRARED SPECTRUM
##DATA CLASS=XYDATA
##ORIGIN=
##OWNER=
##NPOINTS=1765
##FIRSTX=399.76428223
##LASTX=3997.64306641
##MAXX=3997.64306641
##MINX=399.76428223
##MAXY=0.83567488
##MINY=0.28116181
##XFACTOR=1.0000000000
##YFACTOR=1.000000000000000e-9
##FIRSTY=0.55658650
##DELTAX=2.03961372
##XUNITS=1/CM
##YUNITS=ARBITRARY UNITS
##XYDATA=(X++(Y..Y))
399.8E56586504r166777m718781J237393K792239k96176j891613J491786N356132L787876
418.1E55178583l624142o258189k444089J347602r6560n336165o961763k365470K507448
436.5E31947255K648354L24905L67999M387140P891357N694747p2539k487421N44250
454.8E51246047L560126Q73983m553855n688548j985371J175582p47501n463779o856382
473.2E31560302k526701J577199P50422k810418l684342p0811L361345J904547k587795
491.5E27473748m340947j400948J599849K76446l955960n645514k691507J06811j429080
509.9E09992898n193949o420672l920794j314312k191245m635752m597604j337498
526.2D80381072K101183K186179j09762n01305L078759P441371P812530L988802O37889
$$ y = [556586504, 547419727, 542700946, 543938339, 546730578, 546434402, 544542789, 546034575, 551390707, 555178583, 551554441, 545296252, 542852163, 544199765, 544103205, 538767040, 531805277, 529439807, 531947255, 534595609, 534920514, 535288513, 539675653, 547567010, 553261757, 553189218, 550701797, 551246047, 554806173, 555680156, 551126301, 545437753, 543452382, 544627964, 543880463, 538416684, 531560302, 529033601, 530610800, 531361222, 528550804, 524866462, 524795651, 528156996, 530061543, 527473748, 523132801, 521731853, 523331702, 523608148, 519652188, 514006674, 511315167, 511421978, 509992898, 504798949, 498378277, 494457483, 493143171, 490951926, 486316174, 481718570, 480381072, 482482255, 484668434, 484558672, 484057367, 487136126, 494577497, 502390027, 506378829, 507016718]
544.6E07016718R51648K633453J499831k486408n123436l845394j463621k125621n716801
562.9D91340369q248776p248849m553288l277391l576726k870053O47187N444110P901907
581.3D75558490O828695M941076N046934O415010N814909J964808j592100j394212
597.6E03583610J144588K145767J19329k287805j606107J789331L817857K335846K027
616E11044443O23464M031539O257117M916847J882493J053989L211141M951179L349900
634.3E41322112k9504j035631J359582L597975K536535m67658j505136Q87632L538191
652.7E50204098K890766k10941j603007N86152L352940L061116k44856k424181J069606
671E56681693L985524L778755J023472j025617L00109L168762L565550O82830j992344
$$ y = [507016718, 507968366, 510601819, 512101650, 509615242, 504491806, 500646412, 499182791, 497057170, 491340369, 483091593, 475842744, 471289456, 468012065, 464435339, 461565286, 462212473, 467656583, 475558490, 482387185, 487328261, 492375195, 498790205, 504605114, 506569922, 504977822, 503583610, 504728198, 506873965, 506993294, 504705489, 503099382, 504888713, 508706570, 511042416, 511044443, 511667907, 515699446, 521956563, 526873410, 528755903, 529809892, 533021033, 537972212, 541322112, 541292608, 540256977, 541616559, 545214534, 547751069, 547283411, 545778275, 546665907, 550204098, 553094864, 552883923, 551280916, 551867068, 555220008, 558281124, 558036268, 555612087, 556681693, 560667217, 564445972, 565469444, 564443827, 564743936, 567912698, 571478248, 572161078, 570168734]
689.4E70168734j391769R69350J187861j807034m814028m537702j752257J311q03292
707.7E57221174j922667m64022L302753N947530N265832L292084L532231O259262Q172512
726.1E90606689O653071L267944J944721L702998N376756L861427J77980j888156q20279
744.5F12883151N46574j018107m701495o658494n197525k818644k637268m401385m823566
762.8E81173241j931846K330482M708469M615724M514337O613850R794831J0708094
779.1F22527182Q158624M902661M261315N880475O442785M250706J608610J855492
795.4F59887850M737973O568969M992962J960873J185835L082394M301012K540827
811.8F89258695n05686j329482P01607K344965Q09193k534449m113257k975643j824259
$$ y = [570168734, 568776965, 569746315, 570934176, 569127142, 564313114, 559775412, 558023155, 558024466, 557221174, 555298507, 554834485, 558137238, 564084768, 569350600, 572642684, 576174915, 582434177, 590606689, 597259760, 600527704, 602472425, 606175423, 611552179, 615413606, 615591586, 613703430, 612883151, 613429725, 612411618, 607710123, 601051629, 595854104, 593035460, 590398192, 585996807, 581173241, 579241395, 581571877, 586280346, 590896070, 595410407, 602024257, 611819088, 622527182, 630685806, 635588467, 639849782, 645730257, 652173042, 656423748, 658032358, 659887850, 664625823, 671194792, 676187754, 678148627, 679334462, 682416856, 686717868, 689258695, 688753009, 687423527, 688125134, 690470099, 691279292, 688744843, 684631586, 681655943, 679831684]
830.1F79831684l255248o191850p366598n617678l237486k994597m664600n562186
846.4F40941441m231214k291680k362370m647911o544650n453646j243114L607154
862.8F17774010O574094Q003116J0045468J2643636J2998104R541392M512131J353562
879.1F83445513M00424j017809m331112p585525q205772o358742m710496n107462o462991
897.4F40066028o611169n261838m358709n603194q200527r813964r574056q932173
913.7E81710398r334445j0137021r412289o472111k928853r46164p68006o40273Q49247
932.1E41920483L028810M201830L939986L503859L789723L502369O34670m563928r578585
950.5E50379217j2426555j3457656j4331460j5877635j7413646j7982334j7690986
$$ y = [679831684, 676576436, 670384586, 663017988, 657400310, 654162824, 651168227, 646503627, 640941441, 636710227, 634418547, 632056177, 627408266, 620863616, 615409970, 614166856, 617774010, 624348104, 632351220, 642396688, 655040324, 668038428, 677579820, 682091951, 683445513, 683845937, 682828128, 678497016, 670911491, 662705719, 656346977, 651636481, 646529019, 640066028, 633454859, 628193021, 623834312, 618231118, 610030591, 600216627, 590642571, 581710398, 572375953, 562238932, 552826643, 546354532, 543425679, 542479515, 541711509, 541071236, 541920483, 544949293, 549151123, 553091109, 556594968, 560384691, 563887060, 564521730, 559957802, 550379217, 537952662, 524495006, 510163546, 494285911, 476872265, 458889931, 441198945]
964.7D41198945j7546177j8118024j8867284j8861145j7770379j6098082j4432788
979C19505066j2643457j0291666p389187m500628k334654j023948j59711P06226J598388
997.4B83466429K070844J856893J231521O71596M18931K76685m2618l07023j5646Q92669
1017.8B90520281J875609K448767K691209K982021L477275L918052L871411L154427
1034.1C14939052K169222J488924J222968J012563P22021O45817J129925K292305L731757
1052.4C29354554M880071N698055O695330Q195311R722978J0088027Q016973K980203
1068.8C85631502l669471q759230r965301p844299m423886j075954J547426L083885
1085.1C54524672L731012M245460N107582N915552N882949M680008K889901J521975
$$ y = [441198945, 423652768, 405534744, 386667460, 367806315, 350035936, 333937854, 319505066, 306861609, 296569943, 289180756, 284680128, 282345474, 281321526, 281161815, 281868041, 283466429, 285537273, 287394166, 288625687, 289297283, 289716214, 289992899, 289950281, 289643258, 289627612, 290520281, 292395890, 294844657, 297535866, 300517887, 303995162, 307913214, 311784625, 314939052, 317108274, 318597198, 319820166, 320832729, 321554750, 322200567, 323330492, 325622797, 329354554, 334234625, 339932680, 346628010, 354823321, 364546299, 374634326, 382651299, 385631502, 381962031, 373202801, 363237500, 355393201, 350969315, 349893361, 351440787, 354524672, 358255684, 362501144, 367608726, 373524278, 379407227, 384087235, 386977136, 388499111]
1101.4C88499111J020431J106143J522154K270222L247738M073649M245341L547996
1117.7D09532785K401472J656383J753986K396762L120631L768802M194766L896415
1134D32722002K283186o67632m054576o585508p581175p435858o955743o377607n353213
1152.4C89993876l736853j924694m79192M87894J535654L217161N416781P484585Q955687
1170.7D10950899J0022760J1136442J2258440J2947828J2899250J2269228J1611134
1185D94095981J1089087J0134875Q279145N955696M118920L227293K866566K384067
1201.3E42151630J793802J769304K620816L820420M626154M823983M809976M859388
1217.7E71275473M628479L615201J923442L55243m41849o70373r64821j532614j920104
$$ y = [388499111, 389519542, 390625685, 392147839, 394418061, 397665799, 401739448, 405984789, 409532785, 411934257, 413590640, 415344626, 417741388, 420862019, 424630821, 428825587, 432722002, 435005188, 434337556, 430282980, 423697472, 416116297, 408680439, 401724696, 395347089, 389993876, 386257023, 384332329, 383853137, 384341031, 385876685, 389093846, 394510627, 401995212, 410950899, 420973659, 432110101, 444368541, 457316369, 470215619, 482484847, 494095981, 505185068, 515319943, 523599088, 529554784, 533673704, 536900997, 539767563, 542151630, 543945432, 545714736, 548335552, 552155972, 556782126, 561606109, 566416085, 571275473, 575903952, 579519153, 581442595, 581797838, 581355989, 580685616, 579720795, 578188181, 576268077]
1236E76268077j713812j071990m41253p5042L01599J043558J959264K464116K217114
1254.4E80951631J571894J172125J204670J339018J359820J472891J865506K310574
1270.7E93248129K297640J570523N01453k76386m81129l90768m71234p92742j051665
1289E94153821j072585j057685j314759j834094k216697k162159j864910j741588j895726
1307.4E78993618j919031j540899j087248q88884j017869j435041j931191k545535
1323.7E66627920l512264m634201n381167n378306m619122l425359k357304j678408
1340E35641789r51409q7380M71234N00143R8645l75628o60897p65919p40707p57158
1360.4E32372713j102149j260221q04425l49462N4837N23924P02680O43074O85036
$$ y = [576268077, 574554265, 573482275, 573041022, 572965980, 573267579, 574311137, 576270401, 578734517, 580951631, 582523525, 583695650, 584900320, 586239338, 587599158, 589072049, 590937555, 593248129, 595545769, 597116292, 597617745, 597341359, 596860230, 596469462, 595998228, 595205486, 594153821, 593081236, 592023551, 590708792, 588874698, 586658001, 584495842, 582630932, 580889344, 578993618, 577074587, 575533688, 574446440, 573557556, 572539687, 571104646, 569173455, 566627920, 563115656, 558481455, 553100288, 547721982, 543102860, 539677501, 537320197, 535641789, 534690380, 534603000, 535074234, 535574377, 535673022, 535297394, 534636497, 533870578, 533129871, 532372713, 531270564, 530010343, 529205918, 528856456, 528911293, 529435217, 530137897, 530780971, 531466007]
1378.8E31466007P42197J145065K343059L798902M133343L399194K584457J389444
1395.1E51001668J0967r53257j300335j328766j750589k045631j912236j834572j576483
1413.5E38310766r69231p80404j192927p67588l100L38078P66813J130164J374900
1431.8E38207471J787067J979470J516819J262426J537741J617968J270950L69787
1448.1E49549699n21422o39736l61026j155018k842307j659692L60370J736879K749741
1466.5E47217488L995776O125510Q902073R156108P699549P107437P013440O933451
1482.8F04150832O651759O701112O562650N393088M194855M350007M743457L910541
1499.1F46658301L232360L499687M422903M201591J856923J428247K114832K643406
$$ y = [531466007, 532208204, 533353269, 535696328, 539495230, 543628573, 547027767, 549612224, 551001668, 551012635, 550059378, 548759043, 547430277, 545679688, 543634057, 541721821, 539887249, 538310766, 537341535, 536561131, 535368204, 534600616, 534597516, 534935594, 535702407, 536832571, 538207471, 539994538, 541974008, 543490827, 544753253, 546290994, 547908962, 549179912, 549549699, 549028277, 548388541, 548027515, 546872497, 544030190, 542370498, 542730868, 544467747, 547217488, 551213264, 557338774, 566240847, 575396955, 583096504, 590203941, 597217381, 604150832, 610802591, 617503703, 624066353, 629459441, 633654296, 638004303, 642747760, 646658301, 649890661, 653390348, 657813251, 662014842, 663871765, 665300012, 667414844, 670058250]
1515.4F70058250K730906K558947K199471J277387Q42571Q31366J105666J595438J246571
1533.8F84446573Q90911J654625J792610k26677j281798j123309n44846j57952J371
1552.2F85451508L54766Q13783j70768k989709j968801p70390n48840o80029j212120
1570.5F78279400p40349q4639r42528j622081j046240p23124q03053j066566j282513
1588.9F69968307j328111j281321j503050j918674k110898k138138k211094k363920
1605.2F55113101k697825l270030l358663k728521k865613m267692l751338k724111
1621.5F29449308l205240l440261l354668l308177k163589j047552j701295k385259
1637.8F08843267j451731l38077P78794J425147J158595J294017K060890J824558J378298
$$ y = [670058250, 672789156, 675348103, 677547574, 678824961, 679667532, 680498898, 681604564, 683200002, 684446573, 685337484, 686992109, 688784719, 688558042, 687276244, 686152935, 685608089, 685450137, 685451508, 685806274, 686620057, 686449289, 683459580, 681490779, 680720389, 680171549, 679491520, 678279400, 677539051, 677454412, 676511884, 674889803, 673843563, 673120439, 672317386, 671250820, 669968307, 668640196, 667358875, 665855825, 663937151, 661826253, 659688115, 657477021, 655113101, 652415276, 649145246, 645786583, 643058062, 640192449, 635924757, 632173419, 629449308, 626244068, 622803807, 619449139, 616140962, 613977373, 612929821, 611228526, 608843267, 607391536, 607053459, 607832253, 609257400, 610415995, 611710012, 613770902, 615595460, 616973758]
1656.2F16973758K206564L166854L726840L751993L888071M685402M858851M033745
1672.5F47292078M200577M621089M621446M984796N621195N592465M010081L649772
1688.8F84593499M048705M045486M516185M624307L763020K829671J987338J828015
1705.1G12236226J717805J708568K168953K718568K962172K216637R86934J025736
1721.5G27741599J510739J810491K185584K705276K874016K294839J180589J200676
1737.8G43503809J778722J977324K082944K319217K544880K434909K050638K038837
1754.1G60731280K283513K265871K198100K120793J779258J749814J943230J988590
1770.4G77060449J510561P58111O48439Q71956R96411J050234J052260R75609J167655
$$ y = [616973758, 619180322, 622347176, 626074016, 629826009, 633714080, 638399482, 643258333, 647292078, 651492655, 656113744, 660735190, 665719986, 671341181, 676933646, 680943727, 684593499, 688642204, 692687690, 697203875, 701828182, 705591202, 708420873, 710408211, 712236226, 713954031, 715662599, 717831552, 720550120, 723512292, 725728929, 726715863, 727741599, 729252338, 731062829, 733248413, 735953689, 738827705, 741122544, 742303133, 743503809, 745282531, 747259855, 749342799, 751662016, 754206896, 756641805, 758692443, 760731280, 763014793, 765280664, 767478764, 769599557, 771378815, 773128629, 775071859, 777060449, 778571010, 779329121, 779977560, 780849516, 781845927, 782896161, 783948421, 784924030, 786091685]
1788.8G86091685J411617J086593O71267P49409P88868N89907N54443Q10444R67443
1807.1G93721676Q31962N60820N06639P49827P75337N52714O13868R50336J074314
1825.5H00337493R28760N20468k9803J12474N51224N75006M49240N87941N95152K50101
1845.9H04878056P6473k206k1100J57774L87430M11630K18510J06693L99589Q74043
1866.3H07486892P09831j17600l72111q35L37541M50492L29316K03967L20494O26147
1886.7H09974134P08580L30806P9274J44541K00987K36034K03193R3341J35243L05950
1907.1H12412083L20316J15036J9551K20537L58462K47002J39534j9669j35243O2942
1927.5H13740551K52963J75535J6928K0444K34127M53771L64124m2855k07186K7716
$$ y = [786091685, 787503302, 788589895, 789261162, 790010571, 790799439, 791389346, 791943789, 792754233, 793721676, 794553638, 795114458, 795621097, 796370924, 797146261, 797698975, 798312843, 799263179, 800337493, 801266253, 801786721, 801756918, 801869392, 802420616, 802995622, 803444862, 804032803, 804627955, 804878056, 804954529, 804952323, 804931223, 805088997, 805476427, 805888057, 806106567, 806213260, 806612849, 807486892, 808196723, 808079123, 807707012, 807706177, 808043718, 808494210, 808823526, 809027493, 809347987, 809974134, 810682714, 811013520, 811092794, 811237335, 811438322, 811674356, 811877549, 811970890, 812106133, 812412083, 812732399, 812847435, 812866986, 813087523, 813445985, 813692987, 813832521, 813812852, 813677609, 813740551, 813993514, 814169049, 814185977, 814206421, 814440548, 814894319, 815258443, 815215588, 815008402, 815036118]
1947.9H15036118K94089L35515J64926N1200J73211L50714L26038J98245J31428J05679
1968.3H17167163J47760K04921J18792K5570J16050K46227K15888M7088k6047J07109
1988.7H18370521K52783J37389j11043j67430m1842R9122J01865p8321k81870k75374
2009H18005800j11878k5749j48177m46439o42538n57065n20468n75125l21090n1737
2029.4H14605534p3492j45019k51650m13061m46856l06010j59681j81317l45469l88920
2049.8H11894059j83463N9486R5844o8069j76787k3007K32398K53558L5882j36614
2070.2H11983287o4432J50501K25842O4433j16765o3599J78457L10123J52111p2062
2090.6H12747896m8399K00093L59773K25544n424L278K48611M00544K41696m9054j23084
$$ y = [815036118, 815330207, 815665722, 815830648, 815881848, 816055059, 816405773, 816731811, 816930056, 817061484, 817167163, 817314923, 817519844, 817638636, 817664206, 817780256, 818026483, 818242371, 818289459, 818263412, 818370521, 818623304, 818760693, 818649650, 818482220, 818440378, 818539500, 818641365, 818563044, 818281174, 818005800, 817893922, 817868173, 817719996, 817273557, 816631019, 816073954, 815553486, 814978361, 814657271, 814605534, 814532042, 814387023, 814135373, 813722312, 813275456, 812969446, 812809765, 812628448, 812282979, 811894059, 811710596, 811770082, 811865926, 811797857, 811621070, 811598063, 811830461, 812084019, 812119901, 811983287, 811918855, 812069356, 812295198, 812359631, 812242866, 812179267, 812357724, 812667847, 812819958, 812747896, 812699497, 812899590, 813259363, 813484907, 813479483, 813482761, 813731372, 814131916, 814373612, 814324558, 814201474]
2113.1H14201474P5340K91527K46405l9994j98186j7285K42650K22683o0737k33531
2133.5H14730346n3346K46704K93791M5896j94490j33694J67311L21805J23620j27971
2153.9H15419972o0618K86937N17726L51429L4868K7597L68059O91950O35922K85507
2174.3H18559349J63912M45247P41363O68883L11077J44541M00185P35164O87063K81513
2194.6H23138297J9729K22206O08802O87360L49522M8637K16544O36161P43806L75807
2215H27046871K2412J31905N06162O54638L89516K7001L1233L99709O44684M16040
2235.4H30270171k1815j04010K47717N47647M00245j2576j46330J84238N38647M43280
2255.8H32347214J9610j91450P9811N07474N56409J58966j46449O6161M87983N36204
$$ y = [814201474, 814276814, 814568341, 814814746, 814774752, 814576566, 814559281, 814801931, 815024614, 814963877, 814730346, 814677000, 814923704, 815217495, 815263391, 815068901, 814935207, 815102518, 815424323, 815547943, 815419972, 815359354, 815646291, 816164017, 816515446, 816550314, 816577911, 816945970, 817637920, 818273842, 818559349, 818723261, 819168508, 819909871, 820578754, 820889831, 821034372, 821434557, 822169721, 822856784, 823138297, 823158026, 823380232, 823989034, 824676394, 825025916, 825074553, 825291097, 825927258, 826671064, 827046871, 827069283, 827201188, 827707350, 828361988, 828751504, 828778505, 828809738, 829209447, 829854131, 830270171, 830248356, 830144346, 830392063, 830939710, 831339955, 831327379, 831181049, 831365287, 831903934, 832347214, 832366824, 832175374, 832255185, 832762659, 833319068, 833478034, 833331585, 833397746, 833885729, 834421933]
2276.2H34421933J62065j64330m9591L59594N24045J85310k67207k41220K14636M29809
2296.6H35575044R9838l76880m71771j10090K13325N4360l99411n69224k22326J28985
2317H33921850p1287o23167p78556l39448j192j56284m79400n66065l23892O1870J25408
2339.5H30769837k97308m99785K00927R15706M74334o94215j514077j296640n17547
2357.8H27541232J6868j2815j97768P5698O54519Q85248O57081L56198L78012P60675
2378.2H31114948J009762O86109L4928l11136j09553J96874R7930l07381n13374k67923
2398.6H31631184J08599Q5950l58701o90579n19097j08242k6405l78072p20322o18756
2419H28405559k19524r2685m30226q22902p99418m13835j82449m17471q09551q37207
$$ y = [834421933, 834583998, 834419668, 834370077, 834729671, 835253716, 835439026, 835171819, 834930599, 835145235, 835575044, 835674882, 835298002, 834826231, 834716141, 834929466, 834983826, 834584415, 834015191, 833792865, 833921850, 833850563, 833227396, 832448840, 832109392, 832108200, 831951916, 831472516, 830906451, 830582559, 830644429, 830769837, 830472529, 829972744, 830173671, 831089377, 831563711, 830869496, 829355419, 828058779, 827541232, 827558100, 827545285, 827347517, 827423215, 828077734, 828962982, 829620063, 829976261, 830354273, 831114948, 832124710, 832810819, 832845747, 832534611, 832425058, 832621932, 832719862, 832412481, 831899107, 831631184, 831739783, 831825733, 831467032, 830776453, 830257356, 830149114, 830122709, 829744637, 829024315, 828405559, 828186035, 828093350, 827663124, 826840222, 826040804, 825626969, 825444520, 825027049, 824217498, 823380291]
2439.4H23380291m77790k14637l78787p57456q93652o29724l04460l16799o27160q02040
2459.8H17977786n63145k21669k52843o21975q43703o30379k43962j60038m70221p47562
2480.2H13222289o32703k76208j10150l48031o88255o53088k53201P868j68204n08606
2500.6H09591711n54145k47776N304j01089m35591o01768l78728o9380j13428m78029
2521H06617081o91354m97580k22504k80261o17266q16822o80267m27425l76523o00099
2541.4H01406980q19564p47562m75168l45349n33819q13842q18372n59509l76642m76479
2561.8G95440674p25031p69556n11706k90274l96729o93917q34227o53445l64125l46124
2582.2G89855540n96166p20799n12838k18988j98066m65274o69837n48184k84195k16424
$$ y = [823380291, 822902501, 822687864, 822309077, 821551621, 820657969, 820028245, 819723785, 819406986, 818779826, 817977786, 817414641, 817192972, 816940129, 816318154, 815474451, 814844072, 814600110, 814440072, 813969851, 813222289, 812589586, 812313378, 812203228, 811855197, 811166942, 810513854, 810260653, 810268521, 810100317, 809591711, 809037566, 808789790, 808795094, 808694005, 808258414, 807656646, 807277918, 807208538, 807095110, 806617081, 805925727, 805428147, 805205643, 804925382, 804308116, 803491294, 802811027, 802383602, 802007079, 801406980, 800587416, 799839854, 799364686, 799019337, 798485518, 797671676, 796853304, 796293795, 795917153, 795440674, 794715643, 793946087, 793434381, 793144107, 792747378, 792053461, 791219234, 790565789, 790201664, 789855540, 789259374, 788538575, 788025737, 787806749, 787608683, 787143409, 786473572, 785925388, 785641193, 785424769]
2602.6G85424769m12881o40810o44863m76300m22836o38723r34482j002431q30531
2620.9G79420912o83009q04484j116514j230777j059711q90553r23037j146376j314283
2639.3G70252168j231611j033306r68277j138210j309216j184404r16839q92162j109779
2657.6G60468364j247287j166046r65059q50141r63211j125097j055598q20637p25925
2676G51549363q63314j041591j032293q27670o67452p38204r34124j006603q93712
2694.3G43544400p80106q79943j118541j230597j122535r33766r15587j105249j232684
2712.7G34225392j109063q81136q13544r40442j063227r94683p70330o46591p64847
2731.1G26241529r18865q58665o39558n37276o74546q57591q47280o67095n42939o03676
$$ y = [785424769, 785011888, 784371078, 783726215, 783249915, 782827079, 782188356, 781253874, 780251443, 779420912, 778737903, 777933419, 776816905, 775586128, 774526417, 773635864, 772712827, 771566451, 770252168, 769020557, 767987251, 767018974, 765880764, 764571548, 763387144, 762470305, 761578143, 760468364, 759221077, 758055031, 757089972, 756239831, 755276620, 754151523, 753095925, 752275288, 751549363, 750686049, 749644458, 748612165, 747784495, 747117043, 746378839, 745444715, 744438112, 743544400, 742764294, 741884351, 740765810, 739535213, 738412678, 737478912, 736563325, 735458076, 734225392, 733116329, 732235193, 731421649, 730481207, 729417980, 728423297, 727652967, 727006376, 726241529, 725322664, 724463999, 723824441, 723287165, 722612619, 721755028, 720907748, 720240653, 719697714, 719094038]
2751.4G19094038p40707p62403o11186m44353m45008n83291p09474o74307m91441m47631
2771.8G13184237o54697q63492q67010p67111q09372r99570j129329j093805j011908
2790.2G04987943j070201j267076j441419j487553j438737j420975j540482j734018
2806.5F93587482j848757j849234j817048j855433j985133k091825k083659k067029
2822.8F77989364k180040k374411k491176k477467k475917k590239k783955l005623
2839.1F57610536l156364l229022l381133l630460l741443l521860l070235k637803
2855.5F31242216k441764k564371k848565l150344l548205m088581m583835m837871
2871.8F03178680m915834m953265m900813m626453m058480l291190k515852j878977
$$ y = [719094038, 718353331, 717590928, 716979742, 716535389, 716090381, 715507090, 714797616, 714123309, 713631868, 713184237, 712529540, 711666048, 710799038, 710031927, 709222555, 708222985, 707093656, 705999851, 704987943, 703917742, 702650666, 701209247, 699721694, 698282957, 696861982, 695321500, 693587482, 691738725, 689889491, 688072443, 686217010, 684231877, 682140052, 680056393, 677989364, 675809324, 673434913, 670943737, 668466270, 665990353, 663400114, 660616159, 657610536, 654454172, 651225150, 647844017, 644213557, 640472114, 636950254, 633880019, 631242216, 628800452, 626236081, 623387516, 620237172, 616688967, 612600386, 608016551, 603178680, 598262846, 593309581, 588408768, 583782315, 579723835, 576432645, 573916793, 572037816]
2888.1E72037816j418769j031459o88195n22256n64933p11023r25541j142919j324773
2906.5E63707948j593173k016902k566933l094674l400266l477812l443718l252089
2922.8E40862381k777278k042174j186252l49820N56767J668930K791107L729165M450023
2941.1E47702849M875243N070686N234539N405486N486488N430937N312562N254030
2957.4E89772820N269409N161464M792452M347324M040420L849447L687203L525853
2973.8F24446392L356993L234804L152430K956510K626121K292931K054929J948774
2990.1F46069884J782537J407206J046955P79450N22256L18051O6399k74956n03600
3008.4F51214182n94377p94053j186908j545190j712203j762569j794935j925647k122521
$$ y = [572037816, 570619047, 569587588, 568899393, 568377137, 567812204, 567101181, 566175640, 565032721, 563707948, 562114775, 560097873, 557530940, 554436266, 551036000, 547558188, 544114470, 540862381, 538085103, 536042929, 534856677, 534506857, 535063624, 536732554, 539523661, 543252826, 547702849, 552578092, 557648778, 562883317, 568288803, 573775291, 579206228, 584518790, 589772820, 595042229, 600203693, 604996145, 609343469, 613383889, 617233336, 620920539, 624446392, 627803385, 631038189, 634190619, 637147129, 639773250, 642066181, 644121110, 646069884, 647852421, 649259627, 650306582, 651086032, 651608288, 651926339, 651992738, 651717782, 651214182, 650619805, 649825752, 648638844, 647093654, 645381451, 643618882, 641823947, 639898300, 637775779]
3026.8F37775779k169788k121270k142787k302468k524614k539277k424419k469063
3043.1F19082093k626419k717256k693475k633810k622246k689064k806723k825737
3059.4E97467363k696097k570987k543688k669513k858519k857030k659499k440155
3075.7E76171875k398193k611935k776742k725244k686202k684236k675950k783835
3092.1E54829538k842426k659977k432406k465367k699316k704739k455354k371967
3108.4E34197986k498984k449513k236068k229273k389610k564728k720833k685428
3124.7E14423549k457440k290904k333641k426923k332627k139032k131582k321869
3141D95989531k402097k293914k161414j988500j865298k003580k233833k255261k122581
$$ y = [637775779, 635605991, 633484721, 631341934, 629039466, 626514852, 623975575, 621551156, 619082093, 616455674, 613738418, 611044943, 608411133, 605788887, 603099823, 600293100, 597467363, 594771266, 592200279, 589656591, 586987078, 584128559, 581271529, 578612030, 576171875, 573773682, 571161747, 568385005, 565659761, 562973559, 560289323, 557613373, 554829538, 551987112, 549327135, 546894729, 544429362, 541730046, 539025307, 536569953, 534197986, 531699002, 529249489, 527013421, 524784148, 522394538, 519829810, 517108977, 514423549, 511966109, 509675205, 507341564, 504914641, 502582014, 500442982, 498311400, 495989531, 493587434, 491293520, 489132106, 487143606, 485278308, 483274728, 481040895, 478785634, 476663053]
3159.4D76663053j994848j943737j983345k002895j943499j870513j846760j827300
3175.7D61250156j765519j706392j701116j725078j724809j701475j681089j657695
3192D47586983j623570j628548j638264j564145j446396j386404j412094j464009j457691
3210.3D33965862j381397j322568j300603j300037j318395j271188j211852j239091
3226.7D23620731j220584j054883r66728j179010j366079j227140j035929r63509q95619
3245D13711250r19908j082302j105070r26375q08686q75741r67473r32962q47071p58231
3265.4D04487431o16938n18322o39319q48830r10163q82447q33362p58529p15822p00324
3285.8C97063375o51092n33193m85033o41495q23110q62390p94649o43194m74304n26339
$$ y = [476663053, 474668205, 472724468, 470741123, 468738228, 466794729, 464924216, 463077456, 461250156, 459484637, 457778245, 456077129, 454352051, 452627242, 450925767, 449244678, 447586983, 445963413, 444334865, 442696601, 441132456, 439686060, 438299656, 436887562, 435423553, 433965862, 432584465, 431261897, 429961294, 428661257, 427342862, 426071674, 424859822, 423620731, 422400147, 421345264, 420378536, 419199526, 417833447, 416606307, 415570378, 414606869, 413711250, 412791342, 411709040, 410603970, 409677595, 408868909, 407993168, 407025695, 406092733, 405245662, 404487431, 403870493, 403352171, 402712852, 401864022, 400953859, 400071412, 399238050, 398479521, 397763699, 397063375, 396412283, 395879090, 395394057, 394752562, 393929452, 393067062, 392272413, 391629219, 391154915, 390628576]
3306.2C90628576q33571j083851j093328r75340r04918q77112q22842p66218p74681
3324.6C82496715r15558j047402r94265q99464q26419p37309q27014j026720j063794
3342.9C74158770j001924r08912p95275q96543j182526j251996j028985q47637q88825
3361.3C65356147r17226p47740o72281r49293j279801j217038r06020p81805q15868
3379.6C57069075q55058q18581o39796l74854j59740k66045o23554o89566l48002j45704
3400C52148175m49061p98673o45160l22819k49147k82377l43442l98606l35128k83986
3420.4C48039776k74569r1672J96010K91229J58816J78754L36171J76191j39207j34945
3440.8C48736554J35541L67225L93390L02971L32623M48764N51104O90788P81834O03408
$$ y = [390628576, 389795005, 388711154, 387617826, 386642486, 385737568, 384860456, 384037614, 383271396, 382496715, 381581157, 380533755, 379539490, 378640026, 377813607, 377076298, 376249284, 375222564, 374158770, 373156846, 372247934, 371452659, 370556116, 369373590, 368121594, 367092609, 366244972, 365356147, 364438921, 363691181, 363018900, 362069607, 360789806, 359572768, 358666748, 357884943, 357069075, 356214017, 355395436, 354755640, 354380786, 354221046, 353955001, 353331447, 352641881, 352293879, 352148175, 351699114, 350900441, 350255281, 349932462, 349683315, 349400938, 349057496, 348658890, 348323762, 348039776, 347765207, 347673535, 347869545, 348160774, 348319590, 348498344, 348834515, 349010706, 348871499, 348736554, 348872095, 349239320, 349632710, 349935681, 350268304, 350717068, 351268172, 351958960, 352740794, 353344202]
3461.2C53344202N12451Q75860J106412P30097K43306K83539O68943R73583R36538
3479.6C59674931O01947N56618Q30084Q06272O59168Q22723J003205J031816R92716
3497.9C66979480J002997R86278P23034N82189P74472J004577J154542J065076Q54283
3516.3C75126928R25601J225233J395523J110137P33047P77871J026302J234770J381398
3534.6C84936810J296937J149714J391113J710415J504481R83595J000286J309245
3551C95282596J311988J342684J622349J924455K093166K082199J859069J693308J880944
3569.3D11092758K067715K106786K235979K422005K679735L027469L201485K878368
3585.6D31712300K302825K495915K961516L016353L084570L269523L274799L326624
$$ y = [353344202, 353856653, 354732513, 355838925, 356569022, 356812328, 357095867, 357764810, 358738393, 359674931, 360276878, 360833496, 361663580, 362469852, 363129020, 363951743, 364954948, 365986764, 366979480, 367982477, 368968755, 369691789, 370273978, 371048450, 372053027, 373207569, 374272645, 375126928, 376052529, 377277762, 378673285, 379783422, 380516469, 381294340, 382320642, 383555412, 384936810, 386233747, 387383461, 388774574, 390484989, 391989470, 392973065, 393973351, 395282596, 396594584, 397937268, 399559617, 401484072, 403577238, 405659437, 407518506, 409211814, 411092758, 413160473, 415267259, 417503238, 419925243, 422604978, 425632447, 428833932, 431712300, 434015125, 436511040, 439472556, 442488909, 445573479, 448843002, 452117801, 455444425]
3601.9D55444425L536761L448159L247141L377975L585010L691316L630429L401220
3618.3D83362436L442437L645569L774702L585905L101915L315568L663540L586054
3634.6E11478126L537297L598631L702342L922463M174888M064977L435910L057241
3650.9E40971875L187537L162980L326118L554285L325403L139972L437818L591477
3667.2E67697465L228009L194750L061294K171159K065003K588272K720773K953768
3683.5E89680493L288329L125488K033234J403093J808346K119362K176940K052844
3699.8F07688129J767576J842260K256751K359569J776755J029313J344084J844705
3716.2F21909142J806080J567960J418948J253307J196563J702428K167821K082824
$$ y = [455444425, 458981186, 462429345, 465676486, 469054461, 472639471, 476330787, 479961216, 483362436, 486804873, 490450442, 494225144, 497811049, 500912964, 504228532, 507892072, 511478126, 515015423, 518614054, 522316396, 526238859, 530413747, 534478724, 537914634, 540971875, 544159412, 547322392, 550648510, 554202795, 557528198, 560668170, 564105988, 567697465, 570925474, 574120224, 577181518, 579352677, 581417680, 584005952, 586726725, 589680493, 592968822, 596094310, 598127544, 599530637, 601338983, 603458345, 605635285, 607688129, 609455705, 611297965, 613554716, 615914285, 617691040, 618720353, 620064437, 621909142, 623715222, 625283182, 626702130, 627955437, 629152000, 630854428, 633022249, 635105073]
3732.5F35105073J356423P08282J138449J634300J084268M88520J396596J465023K78532
3750.8F44655466L27230J258075J353264Q66770P67768J040637J102865J041770P72715
3769.2F53186560N86331R14335J290679J272023Q11159N83112O64831O20424P17938
3787.5F60647392R57668J128972J140713J052916J166046Q98659L09706N99384N55575
3805.9F68457031J33038O60956J329183J237333Q25942R11593N14865J6570M55976
3824.3F74542487O63101P05183Q44121R91940J215518Q99851J04547r7573Q2672L24130
3844.6F80275977Q50141J455247J328945l42548j007795N31554J063168R39966O76453
3863F85771108N27024N97775K86937N0068K17616M29750P26759O18160M68314N57601
$$ y = [635105073, 636461496, 637169778, 638308227, 639942527, 641026795, 641515315, 642911911, 644376934, 644655466, 644982696, 646240771, 647594035, 648460805, 649228573, 650269210, 651372075, 652413845, 653186560, 653772891, 654687226, 655977905, 657249928, 658061087, 658644199, 659309030, 659929454, 660647392, 661605060, 662734032, 663874745, 664927661, 666093707, 666992366, 667302072, 667901456, 668457031, 668590069, 669251025, 670580208, 671817541, 672643483, 673555076, 674069941, 674086511, 674542487, 675205588, 675910771, 676754892, 677746832, 678962350, 679862201, 679966748, 679869175, 679951847, 680275977, 681126118, 682581365, 683910310, 683567762, 682559967, 683091521, 684154689, 685094655, 685771108, 686298132, 686895907, 687182844, 687232912, 687450528, 687880278, 688607037, 689225197, 689693511, 690251112]
3883.4F90251112K02477J65582M37081K13742K63154P52092Q83698N79000J15990k88665
3903.8F93575263k63572R0838L06666M33504N54860M98414K62737J70946K37227J74880
3924.2F96041763J56343L21090L18646J42456J17838K44856M02629M12226K36213K17378
3944.6F98611438K79129J51038N0545J17063K15769K47777K18391K11179K62499K70605
3965G00635433K09093J86622J77324Q1778K0742J59085L10242L12031K09867N8949
3985.4G02361166K8372J90497L17037K43902J79410K10047
3997.6G03530431
$$ y = [690251112, 690453589, 690619171, 691056252, 691269994, 691533148, 692285240, 693168938, 693747938, 693863928, 693575263, 693311691, 693402529, 693709195, 694142699, 694697559, 695195973, 695458710, 695629656, 695866883, 696041763, 696198106, 696519196, 696837842, 696980298, 697098136, 697342992, 697745621, 698157847, 698394060, 698611438, 698890567, 699041605, 699092150, 699209213, 699424982, 699672759, 699891150, 700102329, 700364828, 700635433, 700844526, 701031148, 701208472, 701290250, 701310992, 701470077, 701780319, 702092350, 702302217, 702361166, 702389538, 702580035, 702897072, 703140974, 703320384, 703530431]
##END=$$ End of the data block
