##TITLE=2796 seco - precipitado $$ Begin of the data block
##JCAMP-DX=5.00 $$ ACD/SpecManager v 10.08
##SPECTROMETER/DATA SYSTEM=Alpha
##DATE=17 Mar 2016 10:50:26
##DATA TYPE=INFRARED SPECTRUM
##DATA CLASS=XYDATA
##ORIGIN=
##OWNER=
##NPOINTS=1765
##FIRSTX=399.76428223
##LASTX=3997.64306641
##MAXX=3997.64306641
##MINX=399.76428223
##MAXY=0.86563951
##MINY=0.41978854
##XFACTOR=1.0000000000
##YFACTOR=1.000000000000000e-9
##FIRSTY=0.80248803
##DELTAX=2.03961372
##XUNITS=1/CM
##YUNITS=ARBITRARY UNITS
##XYDATA=(X++(Y..Y))
399.8 802488029 799013853 795077264 795895755 798336923 796779215 793516695 794478774 798383534 798270702
418.1 798270702 793673873 792798102 794383347 792183578 787846625 787363052 789410055 787923157 783758879
436.5 783758879 783258498 785979331 785466969 781729400 781285405 784115851 783987343 780360818 779302359
454.8 779302359 781806529 781686783 777889609 776394010 778531671 778783619 775229514 773190439 774805248
473.2 774805248 774902284 771295369 768897533 770688951 772168458 769730031 767473400 768985093 770492852
491.5 770492852 768168271 765464842 766388893 768023968 765976489 762642741 762742281 764195979 762381911
509.9 762381911 758956313 758524954 760107100 758852780 755050182 753520906 754351139 753124416 749674678
528.3 749674678 748754919 751346707 753162026 752367258 752259791 754407644 755642414 753945529 752206504
546.6 752206504 752998173 753679812 751326442 748262227 747803271 748575568 747824132 746843934 748240292
565 748240292 750551820 750488818 748774350 748874843 750833094 751511812 750461519 750474453 752231658 752953172
585.4 752953172 751693010 751323879 753359020 755146205 754647732 754105806 755675673 757325709 756668627
603.7 756668627 755494654 756632209 758887589 759197295 758082688 758435249 760273516 760930657 760195315
622.1 760195315 760834754 763345242 764711857 763862371 763554037 765186131 766194522 764877141 763641834
640.4 763641834 764663577 766018748 765257001 763824999 764289021 765341222 764227271 762103915 762385011
658.8 762385011 765052319 767163455 767759860 769172251 774163425 778335035 779658318 781152129 784358919
677.2 784358919 786865890 786997736 787082076 789134383 791216671 790821075 789070368 788363695 788223326
695.5 788223326 786919713 785255253 785446823 787540913 789541602 790951192 793419778 797038436 799177408
713.9 799177408 798486114 797116578 797458827 798855722 799533963 800320685 802670896 804847062 804391384
732.2 804391384 802600980 802462935 803651631 803434074 801604986 800690532 801393807 801651597 800875485
750.6 800875485 801500618 804525137 807338357 808227718 809163928 811892927 814491987 814762950 814358890
768.9 814358890 815862238 817998171 817946017 816662788 817306280 819501400 819994092 818443000 817803442
787.3 817803442 818955243 819336414 817875266 817079723 818430066 819680154 819078624 818734109 820941329
805.6 820941329 824072182 825494766 826108158 828221798 831019104 831957340 831582010 832851887 835881114
824 835881114 837751567 837710679 838205993 840028405 840677261 839141250 838071704 839127779 840134680
842.4 840134680 839050531 837504983 837649226 838129580 836569667 833915949 832694948 832403481 830480099
860.7 830480099 827114403 825001240 824499309 823165238 820333421 818366826 818465650 818584263 817195535
879.1 817195535 815939307 816268981 816625178 815501809 814684153 816742957 820990384 824918866 828474104
897.4 828474104 833337009 838777006 842038870 842703581 843082488 843946338 843389332 840801299 838424981
915.8 838424981 837590873 836593270 834078729 831747532 831425488 831892848 831235886 830300152 830953658
934.1 830953658 832455933 832565606 831354082 830781937 830902100 829769850 827121377 825022936 824470222
952.5 824470222 824031353 822759092 821981728 822621584 823072374 821775258 819805086 818827987 818265617
970.9 818265617 816610456 814180017 812266052 810383141 806729078 801094055 795005918 789029837
987.2 789029837 782240987 774550617 767333508 761177003 754821777 747183800 738917470 730989695
1003.5 730989695 723050714 714379072 705576479 697962761 691698611 685938179 680559039 676298678
1019.8 676298678 673229456 670384884 667222142 664350450 662265718 660387814 658017874 655483127
1036.1 655483127 653558314 652247667 651043952 650102615 650102437 651083887 652348101 653553128 655083597
1054.5 655083597 656986535 658358514 658290446 656751752 653942883 649517179 643227279 635880828 628874540
1072.8 628874540 622947931 618134737 614732444 613469541 614546776 617224216 620721042 624985933
1089.2 624985933 630020320 635070086 639446974 643518269 647982955 652730882 657156885 661214113
1105.5 661214113 665403128 669661999 673317432 676479280 680359185 685689390 691502929 696188807
1121.8 696188807 699303508 701305568 702223301 701817453 700673878 700516343 702444255 704980373 705628574
1140.1 705628574 703479767 699245214 694560051 691555262 691864312 695800722 702364504 710049391
1156.5 710049391 717757046 724783123 730373263 734134138 736699343 738998234 741010785 742144823
1172.8 742144823 742542088 742967904 743511617 743462265 742530525 741155565 739395082 736474276 731848955
1191.1 731848955 725980103 719574869 712760866 705731392 699563205 695440471 693334579 692251623
1207.5 692251623 691636384 691661417 692295194 693152487 694279432 696185946 698863983 701426148 703111172
1225.8 703111172 704057217 704614162 704491436 703343153 701679468 700405180 699851930 699894905 700728118
1244.2 700728118 702797174 705903709 709053099 711486042 713288188 714779794 716023386 717350245
1260.5 717350245 719807804 724211097 729949534 735615790 740596116 745161116 749325931 752626419
1276.8 752626419 755051017 757215679 759323776 760885060 761731803 762455583 763467491 764348447 764715552
1295.2 764715552 765012145 765777111 766753018 767407715 767909467 768791378 769912183 770629227 770875990
1313.5 770875990 771236777 771882653 772279024 772227764 772247910 772591293 772803664 772630811 772644937 773351967
1333.9 773351967 774246752 774441183 773892879 773449540 773509562 773661077 773748815 774217069 775220931 776237965
1354.3 776237965 776857197 777342379 777811825 777435184 775655985 773244619 770792723 768442035 766234577
1372.7 766234577 764237404 762827098 761817873 760347784 758481681 757365167 756888330 755567849
1389 755567849 753257751 750571549 747596860 744553447 741642773 739719272 739546716 740473807 741538048
1407.3 741538048 742719173 744348228 746309698 748303294 750135601 751582146 752635956 753393114
1423.7 753393114 753851891 754533589 755593359 756549001 757407725 758303940 758992136 759511590 759924650
1442 759924650 760282218 760877311 761384487 761263072 760907233 761216462 762341738 762973666 762912095 763001084
1462.4 763001084 762862206 762792408 764945984 770860970 780273795 789239645 795666873 801062584 806505561
1480.8 806505561 811932921 816872954 821541131 825923502 829272151 831535101 833592355 835699558
1497.1 835699558 837617815 839586675 842013896 845208883 847665548 847847044 847730041 848387778 849838436
1515.4 849838436 851505339 852799594 853477418 853580356 853678823 853702545 853788078 854457319 855235159 855900645
1535.8 855900645 857257366 858738601 858512402 857420921 856446564 856010735 856232285 856850564 857765913
1554.2 857765913 859174192 860304952 858892977 857127905 856418729 856343269 856524646 856162906 855561554
1572.6 855561554 855408370 854874015 853575766 852299571 851111472 849971116 848852992 847567439 846025229
1590.9 846025229 844415486 842724383 840683103 838314056 835893095 833536386 831080556 828361332
1607.2 828361332 825403035 822575390 820251822 817819238 814420879 811597586 809934914 808114588
1623.5 808114588 805953920 804033399 802490890 801876783 802464962 803249478 803231955 803432047 804610550
1641.9 804610550 806916833 810168564 813078761 815454006 818794429 821785271 822845995 824244440
1658.2 824244440 826663375 829472840 831812322 833890736 836184800 837998271 839056015 839921117
1674.5 839921117 840453982 841021419 842281401 843936622 844382524 843630314 843383133 843747616 844702065
1692.9 844702065 846250713 847799003 848729312 848653853 848021567 847184837 845515132 843164325 840545774
1711.3 840545774 837501705 833094776 825230002 815077662 805633366 796128511 786607623 778416336
1727.6 778416336 772022605 767599821 764374793 763046324 764804780 769340754 775919974 783944666
1743.9 783944666 793155849 802928627 812542796 820921719 827558100 833125532 837705195 841191113
1760.2 841191113 843886912 845725656 847230315 848908186 850728095 851982415 852335334 852778077 853867114
1778.6 853867114 855192423 856209755 857042491 858016014 859295070 860563576 861167312 861287236 861657560
1796.9 861657560 862177253 862368941 862337887 862491548 862832963 863084376 863174617 863250554 863396883 863492608
1817.3 863492608 863599896 863950610 864449441 864749789 864914656 865038633 864843786 864553034 864447773 864522099
1837.7 864522099 864834785 865348220 865584731 865324199 865084529 864991546 864873350 864765167 864809930 864918590
1858.1 864918590 864884019 864782333 864957988 865440726 865639508 865206718 864748657 864635229 864591777 864457488
1878.5 864457488 864358008 864387989 864451587 864496231 864517093 864472687 864416122 864288390 864057779 863931954 863971889
1900.9 863971889 863976300 863896132 863891959 863957703 863873601 863670826 863650084 863783062 863743544 863516033 863272786
1923.4 863272786 863116801 863035142 862860203 862613857 862492085 862472832 862391114 862298727 862298608 862244189 862011909
1945.8 862011909 861681342 861438096 861367702 861323178 861155629 860978305 860953987 860978365 860899389 860745311
1966.2 860745311 860621631 860548437 860414267 860229671 860177755 860230923 860175431 859981120 859838307 859847903 859886825
1988.7 859886825 859833956 859690785 859581828 859534323 859406173 859224558 859157383 859160841 859067559 858906984 858823299
2011.1 858823299 858827412 858782113 858568311 858246505 857906580 857425213 856928289 856944501 857404649 857726395
2031.5 857726395 857749224 857643008 857574403 857575059 857529581 857404828 857306957 857259154 857183456 857055724 856949329
2053.9 856949329 856939495 856968224 856925011 856834471 856804490 856820464 856780529 856661797 856571198 856583714 856603146
2076.4 856603146 856564641 856549144 856615603 856684089 856659353 856603265 856627882 856692135 856683969 856619298 856620312 856698394
2100.8 856698394 856724322 856664002 856649637 856756270 856838882 856774628 856694281 856736720 856802404 856756389 856684685
2123.3 856684685 856742561 856867015 856878877 856794417 856800318 856929302 856964886 856839836 856793106 856921732 857010484
2145.7 857010484 856942832 856904209 857031941 857148767 857070386 856954098 857024193 857178569 857175052 857043087 857002676
2168.1 857002676 857105792 857166171 857083082 857069433 857220888 857300401 857205153 857143581 857242942 857336879 857279122
2190.6 857279122 857206762 857283652 857384086 857331812 857231319 857272089 857386053 857375562 857260764 857229352 857314587
2213 857314587 857343674 857258141 857226610 857323050 857372999 857285440 857206881 857235670 857276022 857214451 857113004 857101381
2237.5 857101381 857127845 857055366 856916785 856844783 856848180 856799424 856652439 856529117 856507897 856495917 856388152
2259.9 856388152 856245160 856187403 856176019 856086612 855937898 855860770 855873883 855842173 855704546 855591893 855591595
2282.3 855591595 855553746 855342627 855080187 854905367 854737461 854454517 854103982 853813112 853573501 853231728
2302.7 853231728 852727413 852181375 851682007 851168394 850604177 850073338 849531531 848801553 847920418 847185612
2323.1 847185612 846750438 846338868 845705390 845082700 844739497 844507337 844126403 843652070 843400121 843666911
2343.5 843666911 844631135 845724106 845918775 844931424 843283355 841657639 840468884 839988947 840101242
2361.9 840101242 840471745 841117501 842181444 843463957 844647110 845688641 846835852 848106444 849161565
2380.2 849161565 849834204 850325465 850770533 850997806 850896895 850709796 850679159 850677133 850493789 850209236
2400.6 850209236 850059986 850047886 849904060 849598706 849430919 849441588 849338949 849039376 848788440 848723292
2421 848723292 848634779 848354757 848106027 848099530 848103583 847857535 847525299 847387254 847367048 847186863 846886814
2443.5 846886814 846738636 846728802 846583128 846248329 846004426 845981836 845905900 845598757 845315933 845267117
2463.9 845267117 845240891 844996154 844680965 844563842 844572246 844433010 844175696 844057739 844064832 843934357
2484.3 843934357 843636692 843427598 843392432 843313158 843052804 842805564 842763960 842739403 842505276 842222035
2504.7 842222035 842135012 842142940 841992974 841739535 841636479 841659307 841556251 841300428 841125906 841107309
2525.1 841107309 841043234 840820670 840620458 840611100 840623498 840430081 840138614 839989543 839953184 839819610
2545.5 839819610 839597702 839479566 839461207 839322090 839023173 838803053 838757694 838676214 838410318 838126898
2565.8 838126898 838027358 837981820 837726414 837355018 837158203 837071776 836843312 836506486 836277723 836153865
2586.2 836153865 835910141 835513294 835190773 835019588 834799051 834414363 834057808 833876908 833693981 833330095
2606.6 833330095 832918346 832679093 832533717 832230508 831815958 831551909 831428885 831189215 830777586 830419540
2627 830419540 830243587 830068588 829731345 829397857 829262912 829176188 828888655 828492641 828250110 828140497
2647.4 828140497 827929378 827613533 827431023 827391386 827229738 826899707 826651871 826575100 826456487 826158941
2667.8 826158941 825885892 825845659 825862467 825678706 825401008 825280070 825234711 825023592 824704230 824518919
2688.2 824518919 824488342 824357927 824034333 823789060 823749006 823658824 823344231 823013842 822897911 822837710
2708.6 822837710 822564900 822172344 821928203 821787119 821503341 821115732 820892334 820839226 820623875 820143223
2729 820143223 819729745 819558978 819414020 819107831 818775594 818628192 818553269 818328142 818037987 817857862
2749.4 817857862 817705512 817401409 816994905 816705823 816554308 816282213 815805614 815378547 815123558 814825356
2769.8 814825356 814359248 813914001 813574791 813137829 812491000 811800301 811260164 810825229 810285330 809577167
2790.2 809577167 808906674 808372498 807748258 806915283 806062639 805324733 804549634 803621352 802717030 801933408
2810.6 801933408 801087081 800035894 798915565 797918081 796940029 795751333 794385016 793007851 791521728
2828.9 791521728 789661050 787316144 784440458 780748010 775487602 767687976 756601155 741922677
2845.3 741922677 725176752 711049914 704378605 705403209 710522294 716608226 722362280 727235079
2861.6 727235079 730787456 732657373 732853889 732001066 730851591 729587078 728115857 726627767 725250840
2879.9 725250840 723780751 722043097 720144451 718295991 716501296 714651883 712794483 710939586
2896.3 710939586 708905816 706519663 703650236 700098336 695456505 688953876 679716766 667647302
2912.6 667647302 654396653 643059909 636035979 633444250 634002686 636415839 639877677 644049883
2928.9 644049883 648782909 654018819 659710705 665761828 672091722 678525329 684609890 689788878
2945.2 689788878 693815947 696799517 698895693 700205803 701092958 702139199 703613043 705449164
2961.5 705449164 707681239 710567832 714246571 718534231 723229587 728222609 733284831 738151073
2977.8 738151073 742642581 746704042 750500560 754110217 757384539 760388851 763195813 765524149
2994.2 765524149 767267168 768606663 769707561 770648777 771324337 771745503 772221446 772881269 773381412
3012.5 773381412 773376584 773056448 772783279 772515535 772093356 771574795 771045923 770565867 770109415 769641578
3032.9 769641578 769176900 768693686 768289149 767988741 767608106 766999543 766174495 765303791 764486015 763683200
3053.3 763683200 762801588 761682272 760418713 759314120 758406818 757522643 756497622 755327582 754161716
3071.7 754161716 753074050 752122104 751286447 750279307 748948276 747458816 745931506 744462430 743035018
3090 743035018 741437018 739750326 738276720 737019181 735655248 734003186 732323050 730854273 729383230
3108.4 729383230 727661312 725992918 724702418 723438740 721803188 719827950 717718959 715695500
3124.7 715695500 713830948 712044179 710204244 708268225 706365168 704636753 702963650 701005995
3141 701005995 698739052 696473002 694399655 692569673 690812051 688708544 686230242 683798432 681509256
3159.4 681509256 679185271 676822841 674504817 672207952 669839323 667424858 665059805 662723601
3175.7 662723601 660305560 657772839 655222476 652735591 650256157 647734225 645209134 642674983
3192 642674983 640088558 637416959 634709477 632093787 629548490 626951218 624326408 621739745 619165599
3210.3 619165599 616550922 613891304 611265600 608680546 606002450 603227973 600520670 597917438
3226.7 597917438 595347643 592859209 590414405 587743580 584848940 581999838 579295278 576777518
3243 576777518 574421048 571961880 569242537 566538274 564110100 561792493 559338152 556839466 554460824
3261.3 554460824 552100956 549726427 547582209 545727849 543699145 541222394 538604796 536119044
3277.7 536119044 533777654 531475902 529136479 526830912 524678648 522713065 520755112 518570065
3294 518570065 516165435 513626933 511109889 508932531 507140815 505229354 502750695 499902576 497120231
3312.3 497120231 494554013 492097527 489708900 487436652 485289991 483182490 480854452 478302211
3328.6 478302211 475837886 473533392 471368790 469381273 467326880 465006411 462571740 460148126
3345 460148126 457917213 456024259 454025686 451570362 449074864 446930081 445009708 443048775 441124439
3363.3 441124439 439558864 438178509 436431378 434211642 432020903 430278599 428859115 427537203
3379.6 427537203 426259607 425083846 424098015 423427850 423152089 422856688 422100872 421310723 421122015
3398 421122015 421288967 421016067 420253009 419788539 419870973 420118332 420326263 420432508 420561790 420966446
3418.4 420966446 421535641 422098130 422834307 423897475 425183475 426464170 427805871 429356515 430806696
3436.7 430806696 431936920 433126211 434745610 436709046 438770831 440808803 442950428 445287406
3453.1 445287406 447706550 450211287 452889442 455602974 458314598 461274892 464462548 467460424
3469.4 467460424 470117301 472793430 475785106 479112655 482469201 485549569 488614470 491966337
3485.7 491966337 495396912 498695940 502009094 505495906 509126663 512714624 516257584 519918442
3502 519918442 523546398 526975572 530444443 534174919 538110495 541943491 545517504 549143672 553098917
3520.4 553098917 557325900 561412513 565147460 568847597 572700799 576638103 580691516 584783494
3536.7 584783494 588755786 592794657 597032249 601240933 605130851 608776569 612484396 616317332
3553 616317332 620182395 624094903 628091633 632164776 636205196 640150666 644169807 648072064 651692152
3571.3 651692152 655379713 659272254 663213730 667271912 671528578 675811350 679906309 683745980
3587.7 683745980 687437117 691062331 694711864 698426008 702147543 705781817 709274948 712689757
3604 712689757 716122508 719667137 723156869 726410627 729555130 732543528 735361159 738032341 740420997
3622.3 740420997 742837191 745400488 747908294 750147104 752010167 753783047 755520284 757223368
3638.7 757223368 759093344 761164308 763298213 765354633 767144203 768321455 768903613 769400954 770308852
3657 770308852 771377087 772135973 772732556 773602128 774735093 775767863 776677847 777355194 777620733
3675.4 777620733 777647853 777597129 777702332 778314352 779453695 780702889 781321287 781239867 781216025 781477749
3695.8 781477749 781832695 782205224 782606781 783027470 783534586 784215450 784816146 785005510 784915149 784790754
3716.2 784790754 784808099 785040617 785303295 785307467 785239577 785531163 786189497 786954284 787393451 787409723
3736.5 787409723 787467122 787609100 787547469 787640631 788135350 788294792 787943065 787567437 787448704 787448406 787379801
3759 787379801 787268817 787241220 787376642 787504256 787398040 787174582 787035942 787099779 787330866 787536860
3779.4 787536860 787545681 787324131 787018359 786863327 786962092 787184179 787397504 787717760 788113296 788201272
3799.8 788201272 788068950 787935853 787631691 787280917 787084937 787107408 787310302 787744284 788182318 788101792
3820.2 788101792 787731409 787424862 787204921 787088275 787128806 787537336 788110018 788264334 787939310 787525654
3840.6 787525654 787174165 786946595 786950350 787290156 787678719 787482858 786926985 786624074 786535680 786628187
3861 786628187 786738098 786811590 786856830 786794960 786627352 786299527 786087692 786089242 786041796 786020637 786033094
3883.4 786033094 786001682 785869777 785560071 785291374 785255909 785347998 785482764 785652637 785701334 785453498
3903.8 785453498 784995556 784545422 784291029 784281671 784373045 784440279 784472704 784459114 784318745 784103692 784024537
3926.2 784024537 784049392 783976674 783809900 783670366 783585250 783547401 783500910 783430934 783397913 783342481 783224225
3948.7 783224225 783096731 783003151 782948792 782880664 782753587 782622159 782553434 782486498 782405257 782373190 782372117
3971.1 782372117 782361209 782291055 782158434 782063842 782042384 782008469 781915784 781863272 781882286 781852067 781763554
3993.5 781763554 781700671 781663716
3997.6 781663716
##END=$$ End of the data block
