##TITLE=2796 seco - espuma $$ Begin of the data block
##JCAMP-DX=5.00 $$ ACD/SpecManager v 10.08
##SPECTROMETER/DATA SYSTEM=Alpha
##DATE=17 Mar 2016 10:50:26
##DATA TYPE=INFRARED SPECTRUM
##DATA CLASS=XYDATA
##ORIGIN=
##OWNER=
##NPOINTS=1765
##FIRSTX=399.76428223
##LASTX=3997.64306641
##MAXX=3997.64306641
##MINX=399.76428223
##MAXY=0.87136412
##MINY=0.57216835
##XFACTOR=1.0000000000
##YFACTOR=1.000000000000000e-9
##FIRSTY=0.84379643
##DELTAX=2.03961372
##XUNITS=1/CM
##YUNITS=ARBITRARY UNITS
##XYDATA=(X++(Y..Y))
399.8 843796432 841376424 840395391 841697276 842747569 841698587 839969695 839925408 841715336 842787743
418.1 842787743 840653837 838309646 838307440 838771164 837502122 835385323 834670663 835536480 835669637
436.5 835669637 833999753 832718015 833532929 834940434 834566236 832883596 832431614 833785534 834739268
454.8 834739268 833507121 831521273 831671476 833032727 832641363 830778420 830617368 832756877 833625019
473.2 833625019 831340671 829150319 829948246 832021534 831799090 829405963 828487277 830078721 830983222
491.5 830983222 829132438 827062607 827502847 828870952 827826023 824828684 823570967 824655652 824792624
509.9 824792624 822190404 819311738 818930149 819481015 817308486 812664330 808876634 807148993 805696011
528.3 805696011 803707302 803238392 806214333 811018765 813808143 813510597 812967062 814137638 815165162
546.6 815165162 813607812 810240984 807710171 806511104 804718137 802030683 801149547 803922534 808199227
565 808199227 810164332 809352517 808989823 810843825 812736034 812378943 811323583 812382996 814857781
583.3 814857781 815520048 813919365 813423455 815861046 818192303 817301631 815046549 814915419 816434741
601.7 816434741 816227078 813686013 812279284 814239323 816793025 816320777 813944280 813639700 815895319
620 815895319 817177832 816008747 815374374 817702472 820543289 820267618 817703545 816627443 817813993
638.4 817813993 818083227 815650702 813114166 813145459 813999236 812090397 807538331 804026365 803583086
656.8 803583086 804361343 804467082 805433393 809162974 816201270 823903859 827228785 829696953 834014177
675.1 834014177 838224947 839618206 839060366 839566708 841587365 842404246 840058804 835648179 831103325
693.5 831103325 827025831 823287010 819980264 817936718 818654060 822071314 825704217 828069746 830351830
711.8 830351830 832950830 833252430 829394877 824719071 824556291 828633606 832288563 833532810 834239006
730.2 834239006 835698843 836297572 834721565 833068013 833979070 836133420 835960448 833374441 832100034
748.5 832100034 834228337 837766469 839958429 841263115 844289899 849142253 852873445 853889167
764.9 853889167 854165375 856118798 858940065 859775484 858207285 857304215 859237790 862029016 862808764
783.2 862808764 862334728 863344729 865971327 867649257 867271423 866851687 868191242 869986713 869949281
801.6 869949281 868484557 868156135 869820058 871364117 870987773 869802058 869833231 870779991 870586693
819.9 870586693 868745744 867115736 867118895 867708504 867152095 865746498 865301073 866343260 867300630
838.3 867300630 866773844 865685284 865851700 867067039 867464125 866402030 865410626 865788996 866499543
856.6 866499543 865708053 863697350 862564266 863039196 863421261 862277031 860631049 860302866 860984743
875 860984743 860689998 859079421 858160317 859031677 860092282 859546542 858186781 858301103 860332370
893.4 860332370 862235427 862591863 862653315 864110649 866210043 866781592 865544498 864506900 864876211
911.7 864876211 865382254 864510179 862967193 862509429 863057852 862744749 860863507 859072328 858940423
930.1 858940423 859629750 859248877 857728958 856728375 856856763 856675386 854872942 852183878 850212872
948.4 850212872 849044859 847332656 844699144 842618704 842330575 842961550 842729092 841519833 840915740
966.8 840915740 841635048 842445970 842122614 841286659 841310322 842023253 841789722 839913428 837662339 836282670
987.2 836282670 835169852 832997680 829919279 827401280 825926185 824086607 820689678 816782594
1003.5 816782594 814168096 812744677 811015368 808566511 806567430 805841446 805498242 804172873 802020609
1021.8 802020609 800353944 799446821 798207521 796177387 794393241 793828428 793846607 793010175 791146934
1040.2 791146934 789568245 789132059 789051533 788206279 786916435 786383927 786774039 786948264 786143541
1058.6 786143541 784980774 784295738 783600688 781631231 778225839 774577200 771530211 768600166 765063465
1076.9 765063465 761386395 758971751 758541763 759336412 760291457 761394203 763123751 765061200 766076803
1095.3 766076803 765791714 765021741 764507890 763745368 761683047 758279264 754443467 750729084 747181356
1113.6 747181356 744546533 744508505 747405708 750685036 751324356 748742759 744483352 739471853 733042479
1132 733042479 726017058 720932066 717299819 711065352 699355423 683703184 669084549 659824193
1148.3 659824193 656666219 658219576 663405359 671330571 680239737 687791407 692540467 695048511
1164.6 695048511 696984053 699014902 700399697 700685740 700771153 701754570 703370690 704474390 704731226
1183 704731226 704748333 704529643 702822268 698475540 691824257 684115410 676092327 667980671 660642982
1201.3 660642982 655661643 653743088 653805077 654228806 654531956 655405998 657434940 660327792 663506210
1219.7 663506210 666881979 670515716 673807859 675680280 675692797 674467444 672795355 670814693 668520451
1238.1 668520451 666699946 666655660 668978751 673101604 678226173 684176087 691072106 698548138 705769241
1256.4 705769241 712259352 718270421 724158645 729790449 734837115 739441395 744247496 749569356
1272.7 749569356 754908860 759605587 763652444 767476618 771064281 773901939 775848985 777503014
1289 777503014 779459417 781571329 783296645 784590125 785992146 787814021 789686084 791157126 792393148
1307.4 792393148 793815553 795327485 796347678 796645522 796706736 796926737 797057629 796666324 795738161
1325.8 795738161 794762313 794235528 794238865 794538021 794847190 794869304 794307411 793362141 792732477 792873323
1346.2 792873323 793754041 795043826 796481431 798065960 799757481 801327586 802394152 802252650 800659537
1364.5 800659537 798415124 796067297 794101655 793222249 793405712 794151068 795273244 796377122 797296822
1382.9 797296822 798934042 801625788 803959429 805210054 806022584 806596577 807007730 807493508 808115304
1401.2 808115304 809252918 811029136 812873125 814427197 815525711 816304803 817298174 818444788 818459272
1419.6 818459272 816978574 815118253 813375771 811934650 810344875 808361411 806818962 805746377
1435.9 805746377 804038048 801920652 800125360 798802018 797873676 796733201 794950008 792945981
1452.2 792945981 791628838 791538715 791315556 789867163 787597001 783418238 778413832 777307153 782655358
1470.6 782655358 793690860 804262161 810976148 815735579 819956124 823964655 827705204 831385732
1486.9 831385732 834690571 836728156 837738693 838697612 839657307 840666354 842399657 845053673 848655939
1505.2 848655939 851201713 850827694 850279987 850752771 851841331 852811635 853605151 854334652 854341507 853882790
1525.6 853882790 853319466 853055298 853610039 854187787 854291379 855228543 856944382 857005060 855742991
1544 855742991 854489088 853921533 854167223 854759932 855526209 856810391 858369648 857610524 855799258
1562.4 855799258 854830861 854523003 854726911 854687214 854199469 853998721 853499413 852281630 851165295
1580.7 851165295 849979162 848490775 847153366 846191168 845140100 843626678 841786027 839937150
1597 839937150 838132560 836067021 833617389 831147254 828943372 826643884 824031293 821696579 819864511
1615.4 819864511 817681193 815414250 813788295 812286973 810764253 809391797 807984829 807246983
1631.7 807246983 808194816 810108900 810762525 810838401 811777174 814074934 817620158 820494533 822290540
1650.1 822290540 825437009 828669131 829307675 829917610 831568599 833836317 835768998 837378144 839268148
1668.4 839268148 840789020 841668129 842696726 843367040 843656242 844604492 846496880 847719908 847105563
1686.8 847105563 846514583 846585393 847326696 848690510 849831343 850262880 849700093 848159134 845985413
1705.1 845985413 842428088 837568641 831743479 824452400 814325154 798685491 780069470 763194799
1721.5 763194799 746712327 730678260 717146039 706660569 699517548 694977641 693068027 694879472
1737.8 694879472 700890422 710105062 721339941 734452188 749075711 764667988 778941572 790101647
1754.1 790101647 799595475 807757497 814002633 818886578 822210670 824778020 827369988 829941809
1770.4 829941809 832120180 833356023 834310114 835784137 837645948 839361191 840889394 842292964
1786.7 842292964 843842030 845692813 847090006 847493410 847815037 848569095 849279821 849512398 849558651
1805.1 849558651 849929988 850604296 851112247 851166964 851179481 851472199 851902246 852305949 852732837 853192866
1825.5 853192866 853713274 854139745 853913546 853454113 853451431 853773236 854079783 854480267 854961455 855092227
1845.9 855092227 854933321 854692161 854445934 854393125 854604363 854794443 854733169 854627132 854877770 855507553
1866.3 855507553 855864882 855404794 854805470 854718804 854832709 854748428 854558170 854586542 854840875 855057478
1886.7 855057478 855041981 854830146 854782164 854918957 854828775 854541123 854471803 854671776 854850709 854809999
1907.1 854809999 854645669 854565978 854630768 854741573 854737282 854605377 854598522 854629874 854351103 853958070 853799224
1929.5 853799224 853861451 853873789 853674233 853483200 853599310 853859961 853738904 853255510 852899671 852840543
1949.9 852840543 852847517 852705479 852490127 852421939 852511108 852509737 852356017 852245092 852232039 852189481 852024972
1972.3 852024972 851804912 851735592 851841390 851887882 851722062 851493657 851452589 851580560 851635575 851463437
1992.7 851463437 851248622 851235271 851289213 851168454 850956380 850884974 850938201 850903034 850699306 850509644
2013.1 850509644 850520134 850558102 850306034 849807799 849289238 849005520 849191189 849554360 849727154 849843144
2033.5 849843144 849991679 850031972 849936843 849849403 849859774 849890828 849816799 849683583 849669218 849787354 849876225
2056 849876225 849834383 849744916 849741280 849798560 849765420 849640012 849577248 849633813 849697351 849654794 849572718 849570334
2080.4 849570334 849635243 849681020 849681318 849693358 849749565 849795878 849788010 849747896 849720478 849737346 849790692 849826694
2104.9 849826694 849822879 849845111 849925935 850006580 850012302 849945307 849901617 849925280 849947035 849929750 849926174 849976778
2129.4 849976778 850039005 850042760 850003481 849972844 849981010 850016117 850018561 849985600 849977076 850008607 850035310 850016594
2153.9 850016594 849971533 849970460 850026250 850069761 850050747 849993229 849955320 849987149 850048184 850041926 850023746 850079179
2178.3 850079179 850133359 850096405 850035071 850058377 850133240 850158930 850101352 850030899 850039542 850097120 850092828 850025415
2202.8 850025415 850004137 850059748 850093484 850034475 849943161 849924386 849978626 850006461 849966347 849920213 849937797
2225.2 849937797 849990845 849972606 849868655 849801898 849818826 849813521 849721730 849617720 849608123 849664271 849638283
2247.7 849638283 849487185 849343777 849310517 849325955 849279821 849188983 849165380 849200368 849187255 849101007 848997831
2270.1 848997831 848949313 848954737 848914921 848784804 848675489 848673165 848682046 848595798 848468065 848404229 848408520 848386288
2294.6 848386288 848284185 848191500 848177075 848166049 848074257 847920418 847805440 847765744 847701967 847557306 847430885
2317 847430885 847432137 847494423 847441673 847282112 847196758 847223759 847214818 847062111 846852899 846722364 846691012
2339.5 846691012 846731842 846805274 846744955 846485674 846269965 846280575 846470475 846711218 846935332 847051501
2359.9 847051501 847036898 846956313 846813142 846633613 846484065 846343219 846174955 846002877 845846832 845695496
2380.2 845695496 845534086 845368207 845238507 845188320 845188320 845170379 845110118 845049679 845050991 845061362 844970345 844810069
2404.7 844810069 844713449 844715774 844704807 844585240 844448388 844423175 844445825 844365478 844173551 844025970 844030380
2427.2 844030380 844081402 844026089 843909562 843872428 843910933 843868494 843692064 843562841 843592107 843623579 843500793
2449.6 843500793 843304694 843223929 843282521 843295455 843141198 842961609 842932761 842971563 842889547 842716873 842646599
2472 842646599 842739642 842797101 842655420 842453003 842387021 842409551 842347980 842190206 842090905 842138410 842194915
2494.5 842194915 842072129 841825545 841687024 841716826 841720879 841577947 841416836 841399014 841455340 841360152 841096401
2516.9 841096401 840913773 840930760 840975106 840860903 840663493 840598941 840661645 840645373 840483427 840338051
2537.3 840338051 840331018 840350389 840241432 840057969 839989245 840057850 840070784 839902461 839671791 839573562 839596272
2559.7 839596272 839539647 839331865 839155912 839153349 839184582 839042604 838782728 838631094 838614464 838554859 838367581
2582.2 838367581 838183701 838147342 838169336 838058054 837810874 837607324 837531209 837464929 837305307 837116838
2602.6 837116838 837030172 837033391 836970687 836791575 836609483 836499214 836400747 836236060 836045921 835942686
2623 835942686 835925519 835858107 835665286 835437179 835307837 835269392 835199177 835065067 834953308 834923387 834905922
2645.4 834905922 834803641 834650338 834547400 834516704 834460497 834322214 834191561 834139764 834125459 834053516
2665.8 834053516 833883703 833703578 833625138 833637059 833631456 833552301 833467782 833435357 833404005 833328009 833227217
2688.2 833227217 833166778 833167732 833151281 833070934 832975805 832952678 832988024 832943201 832775772 832603276 832500398
2710.7 832500398 832408667 832250059 832033038 831886292 831873417 831843376 831678867 831434071 831237316 831136405
2731.1 831136405 831022680 830866933 830772758 830774605 830789089 830739915 830697238 830751896 830807924 830726027 830562055
2753.5 830562055 830465972 830475748 830488384 830379248 830197394 830089390 830040932 829933405 829762101 829619646
2773.9 829619646 829508841 829324722 829019606 828643858 828291833 828065634 827909470 827605844 827155769 826766491
2794.3 826766491 826468289 826096296 825566351 825017810 824572921 824142098 823582411 822879016 822146595 821442664
2814.7 821442664 820698619 819850802 818906486 817880929 816691339 815197647 813330352 811039567 808099866
2833 808099866 804027200 798146784 789493322 776753724 758598447 734747291 708507061 687709987
2849.3 687709987 679240227 682676435 692536354 704473376 716557682 727627337 736772120 743502438
2865.7 743502438 747841477 750412285 752152979 753640592 754911721 755829155 756156802 755626678 754189909
2884 754189909 751978457 749162734 745891452 742331088 738673508 734934807 730935633 726531982 721552789
2902.4 721552789 715565264 707796097 697169721 682651281 664369285 645079672 629479647 620773017
2918.7 620773017 618668258 621050000 626035392 632496357 639859140 647810459 656303167 665330589
2935 665330589 674611747 683757663 692452490 700300574 706725180 711199582 713691354 714751005 715035200
2953.4 715035200 715246797 716153204 718124330 721039951 724551558 728390038 732497334 736868918 741449237
2971.7 741449237 746026099 750340343 754441023 758396506 761973798 765127420 768097103 770971894
2988 770971894 773721457 776251733 778397024 780229330 781852901 783222616 784412324 785499871 786538959
3006.4 786538959 787661791 788887560 789980233 790717304 791177809 791545689 791851759 792071283 792153299
3024.7 792153299 792042673 791891456 791865110 791956246 792084575 792273939 792724371 793366730 793845475 794037163
3045.1 794037163 794103444 794179678 794193685 794087648 793912411 793615282 793198526 792827964 792609870 792562068
3065.5 792562068 792559385 792434335 792243302 792189240 792387664 792655230 792622149 792263627 791865289 791457176
3085.9 791457176 790965796 790453613 789956868 789586842 789426029 789341867 789118350 788671136 788195133 787873805
3106.3 787873805 787522197 786956608 786479771 786343038 786211491 785750628 785011768 784180939 783433735 782800198
3126.7 782800198 782169580 781490982 780807436 780155599 779563129 778966725 778210104 777334630 776480258 775673270
3147.1 775673270 774988711 774402261 773607254 772487342 771329939 770324290 769401908 768426836 767351568
3165.5 767351568 766253710 765194654 764171600 763124526 762024641 760921597 759814441 758648992
3181.8 758648992 757410347 756169796 754978836 753755391 752430201 751085937 749804020 748538256
3198.1 748538256 747220874 745843470 744448483 743093967 741760850 740408063 739061773 737729788
3214.4 737729788 736375928 734972179 733498394 731996894 730523527 729058504 727633774 726359606
3230.7 726359606 725137055 723646224 721911550 720271707 718790114 717398167 716118336 714792907
3247.1 714792907 713252604 711699784 710364044 709136784 707820594 706442297 705109835 703778923
3263.4 703778923 702467740 701361954 700467885 699423909 698044538 696546733 695071697 693650544
3279.7 693650544 692265689 690843046 689436138 688160896 687028885 685876906 684499204 682880998
3296 682880998 681097448 679299772 677766323 676541984 675231993 673447371 671280324 669111013 667134285
3314.4 667134285 665228963 663270414 661296487 659403801 657575965 655556142 653271079 650970757
3330.7 650970757 648771822 646726847 644842148 642794967 640411615 637937248 635496616 633129001
3347 633129001 630939245 628663838 626031816 623332858 620842576 618466139 616062105 613699794 611560702
3365.4 611560702 609495640 607119322 604403257 601762176 599468708 597385108 595373511 593448043
3381.7 593448043 591646194 589989126 588559866 587470949 586427093 585006416 583505929 582481444
3398 582481444 581740975 580613315 579098463 577850819 577024579 576306462 575550675 574681401 573799312
3416.3 573799312 573200226 572836220 572477639 572197914 572168350 572360814 572587729 572840393 573230386 573625088
3436.7 573625088 573888421 574208438 574814618 575749338 576864481 577916503 578916669 580009997 581230998
3455.1 581230998 582610428 584138393 585656703 587150812 588845253 590700507 592370033 593792021
3471.4 593792021 595253766 596893489 598708212 600598097 602322340 603930354 605691552 607542694
3487.7 607542694 609283447 610992551 612866104 614887893 616814852 618684351 620714366 622666955
3504 622666955 624382555 626175582 628149450 630183697 632177651 634087861 636030138 638177991 640566885
3522.4 640566885 642868638 644883335 646799445 648722053 650757194 653035104 655304909 657339275
3538.7 657339275 659489930 662041783 664684594 666868031 668703318 670744956 672934830 674998939
3555 674998939 677120984 679490685 681960344 684392989 687037647 689832926 692068398 693895102 695975244
3573.4 695975244 698389471 700941980 703612983 706362903 709193468 712284267 715239406 717489362
3589.7 717489362 719613850 722149372 724804759 727383137 729937017 732284904 734470963 736914754
3606 736914754 739673257 742294192 744653046 746798396 748886228 751298606 753507018 754871309 756054282
3624.4 756054282 758021593 760791659 762667120 763473153 764380932 765485942 766662061 767868280 769001961
3642.7 769001961 770318866 772309124 774575353 775380433 774958313 775063813 775872290 776451051 776646316
3661.1 776646316 776738644 777029693 777871609 779087245 779780149 780300736 781083524 780966759 780250609 779856920
3681.5 779856920 779882193 780556023 782073081 783294737 783134222 782593548 782447636 782624841 783071697
3699.8 783071697 783529401 783541799 783512414 784040809 784996271 785459101 784980714 784409523 784286797 784525394
3720.2 784525394 784812927 784906566 784741282 784503222 784737229 785696268 786723554 786816955 785968006 785220623
3740.6 785220623 785483599 786250234 786353171 786552787 787040174 786714017 786005318 785765707 785763681 785408378
3761 785408378 785039186 785094321 785347879 785553575 785400748 784924388 784680367 784936428 785234869 785076976
3781.4 785076976 784839511 784728825 784564137 784438014 784395695 784518003 784824908 785055280 785412431 785718262
3801.8 785718262 785458028 785229623 784937799 784267664 783891857 784231246 784761846 785036862 785480917 785433590
3822.2 785433590 784646749 784080744 783883393 783953071 784186244 784494698 784990430 785262227 784929574 784369230
3842.6 784369230 783801198 783297181 783135712 783732653 784892082 784878016 783793449 783100843 783088744 783413768
3863 783413768 783453226 783318222 783509552 783545792 783150733 782642126 782332182 782506049 782711864 782805562
3883.4 782805562 782924652 782623351 782326698 782272041 781894147 781528711 781741977 782278001 782628417 782588303
3903.8 782588303 782080114 781385303 780891836 780667067 780735552 781057656 781235754 781061411 780875206 780856073
3924.2 780856073 780796647 780686200 780693769 780700266 780510664 780232608 780067682 780121267 780250490 780199409 780059814
3946.6 780059814 779980004 779893458 779800296 779735982 779672086 779596210 779529572 779481292 779417217 779309690 779199243
3969.1 779199243 779146552 779138803 779097974 778976083 778844953 778802395 778804719 778745294 778643787 778596580 778572500
3991.5 778572500 778505623 778422236 778338969
3997.6 778338969
##END=$$ End of the data block
