##TITLE=$$ Begin of the data block
##JCAMP-DX=5.00 $$ ACD/SpecManager v 10.08
##SPECTROMETER/DATA SYSTEM=Alpha
##DATE=22 Dec 2014 10:36:42
##DATA TYPE=INFRARED SPECTRUM
##DATA CLASS=XYDATA
##ORIGIN=
##OWNER=
##NPOINTS=1765
##FIRSTX=399.76428223
##LASTX=3997.64306641
##MAXX=3997.64306641
##MINX=399.76428223
##MAXY=0.84906411
##MINY=0.42401031
##XFACTOR=1.0000000000
##YFACTOR=1.000000000000000e-9
##FIRSTY=0.65257102
##DELTAX=2.03961372
##XUNITS=1/CM
##YUNITS=ARBITRARY UNITS
##XYDATA=(X++(Y..Y))
399.8F52571023m846156j297116J047909R67622n36979q97228L73244J620114J721501
418.1F50723934k17557k764642l552556j963079J87635J4544k224505m036427l017246
436.5F33150101R82403M210532M058421J901984P23124J789867L692210L413439R7573
454.8F54019654l051162k808869o1929J309872l48628l665626n241394l546655l76106
473.2F36229157R23098r34363l285646k960742N305K720952K133846j185834l456414
491.5F30189359k191961P88153J763463m38691l757655m785598k477407J34289o2406
509.9F19161546k900779n447209n154073k234578L0756p16388k856970l528238j228571
528.3E95125496K238632L735363K353191O77765J607060M610956O490767M935086P84159
$$ y = [652571023, 647724867, 646427751, 647475660, 648443282, 647906303, 647009075, 647382319, 649002433, 650723934, 650506377, 647741735, 644189179, 642226100, 642413735, 642428279, 640203774, 636167347, 633150101, 634132504, 638343036, 642401457, 644303441, 645026565, 646816432, 650508642, 653922081, 654019654, 650968492, 648159623, 648097694, 649407566, 649058938, 645393312, 640151918, 636605263, 636229157, 637152255, 636217892, 632932246, 629971504, 629976809, 632697761, 634831607, 633645773, 630189359, 627997398, 628785551, 630549014, 630110323, 626352668, 621567070, 619089663, 619223952, 619161546, 616260767, 610813558, 605659485, 603424907, 603455663, 602739275, 599882305, 596354067, 595125496, 597364128, 601099491, 603452682, 604130447, 605737507, 610348463, 616839230, 621774316, 622558475]
546.6F22558475k538920k414405j00076R52065r88067m234075n742729m601061k795458
565F00095749k885282m845143n986690m248977k39908L601968N041003M335880L642321
583.3E98510921M465401O048620O144345L722846L16978j403809n36680J378179J895189
601.7F20541990K76863j628995j697301L41117K657175L083527J452446Q8513J107752
620F26223087L638387N225122M356742J849115J69754Q33273K713680L381729J803279
638.4F50194168n45800j248121L20017K403200K873361J174689j003385j275420P26223
656.8F53618932K724409K491355M29570j226127r13322J986802L364027K059996O4253
675.1F64599895j103937J21236K403855L138185J446247j014173j815319l51191J410365
$$ y = [622558475, 620019555, 617605150, 617505074, 618457139, 617469072, 613234997, 607492268, 602891207, 600095749, 597210467, 592365324, 586378634, 582129657, 581889749, 585491717, 590532720, 594868600, 598510921, 602976322, 609024942, 615169287, 618892133, 619209111, 617805302, 617268622, 618646801, 620541990, 620818853, 619189858, 617492557, 617833674, 620490849, 623574376, 625026822, 625115335, 626223087, 629861474, 635086596, 639443338, 641292453, 641462207, 642295480, 645009160, 648390889, 650194168, 649648368, 648400247, 648720264, 651123464, 653996825, 655171514, 654168129, 652892709, 653618932, 656343341, 658834696, 659264266, 658038139, 657124817, 659111619, 662475646, 664535642, 664599895, 663495958, 663617194, 666021049, 669159234, 670605481, 669591308, 667775989, 667424798, 668835163]
693.5F68835163J212955j249552l820360l993928j803994M34637O77824o86109j189709
711.8F58416927P33673L879130N734444N036056K884626J974702L527582N787253O057799
730.2F94032192L618062O06119k06112J469254L155649K254665r94087l834664m039526
748.5F96061552k131641q89600k268016m956484n940258l948808o07848J378417J110792
766.9F77808106L24368J286269M353523P497966Q232177O176292L635168L246904N020738
785.3G17581511O308436N006432K074719L41654J407742M163802N688250M243016J369894
803.6G48185456o2347J040221L035724L276169J103580j340091j653910K04384J872063
822G55661249J119375j679957m152297m473746l086567k149940l064513m928470n702674
$$ y = [668835163, 670048118, 668798566, 664978206, 660984278, 659180284, 659614921, 660292745, 659606636, 658416927, 659150600, 663029730, 668764174, 673800230, 676684856, 678659558, 682187140, 687974393, 694032192, 697650254, 698256373, 698050261, 699519515, 702675164, 704929829, 703935742, 700101078, 696061552, 693929911, 693040311, 690772295, 685815811, 679875553, 675926745, 675318897, 676697314, 677808106, 678132474, 679418743, 683772266, 691270232, 699502409, 705678701, 709313869, 712560773, 717581511, 723889947, 728896379, 730971098, 731312752, 732720494, 736884296, 742572546, 746815562, 748185456, 748123109, 749163330, 752199054, 755475223, 756578803, 755238712, 753584802, 753789186, 755661249, 756780624, 755100667, 750948370, 746474624, 743388057, 741238117, 738173604, 733245134, 727542460]
840.3G27542460m441142k292931j266420k257526m113674m831135l817797k303481
856.6G02218354j586139j260519J59263L151000O787419R511173R839952P606566M504442
875G40931511K557456J988709J159907j247883m450321o346584n862116m023493k923429
893.4G21783757l613174n065858n479872m395187l164232l430426n408883p644773
909.7F83581352q469641p612824o359756o005288o282746n779803l742159r52839J015484
928F39391780J278937N22315L06428J530647L533065M656196L693879R44972k109707
946.4F53748512m322409n970180q144558j0996997j3278246j3906658j3251245j2719035
962.7E71159184j3390720j4939725j6075731j6011357j5024155j3963819j3331830
$$ y = [727542460, 723101318, 720808387, 719541967, 717284441, 713170767, 708339632, 704521835, 702218354, 700632215, 699371696, 699530959, 702681959, 709469378, 718980551, 728820503, 736427069, 740931511, 743488967, 745477676, 746637583, 745389700, 740939379, 734592795, 728730679, 724707186, 721783757, 718170583, 713104725, 707624853, 703229666, 700065434, 696635008, 691226125, 683581352, 675111711, 667498887, 661139131, 655133843, 648851097, 643071294, 639329135, 638376296, 639391780, 640670717, 641193032, 641499460, 643030107, 646563172, 651219368, 654913247, 655858219, 653748512, 649426103, 643455923, 635311365, 624314368, 611036122, 597129464, 583878219, 571159184, 557768464, 542828739, 526753008, 510741651, 495717496, 481753677, 468421847]
977D68421847j2731403j1275799q633703n535721l029466j651138j086205m68105O20603
995.3D24630910J724333K150804J632720O70820Q9228J57595M58449M08262o2883l49849
1015.7D31510389J85609J410633K570093L002614K755105K493441K687633L207624
1032D49823141L369153K548813J055420m292L5733P98494J452565J555979J547039
1050.4D62182045K296865L993809N829275O951421P264942P284344P261931O363094
1066.7E09427726L102482k456010p527172r087473o958724l306835j53244J671463
1083D84712213K347857K651602L408730M667938N523950N145132L680587K083004J196622
1101.4E15417635J183212J544416J758695J849830K251387L123819L893137L743589
$$ y = [468421847, 455690444, 444414645, 435780942, 430245221, 427215755, 425564617, 424478412, 424010307, 424630910, 426355243, 428506047, 430138767, 430809587, 430898815, 431056410, 431514859, 431923121, 431860238, 431510389, 431695998, 433106631, 435676724, 438679338, 441434443, 443927884, 446615517, 449823141, 453192294, 455741107, 456796527, 456792235, 456827968, 457626462, 459079027, 460635006, 462182045, 464478910, 468472719, 474301994, 481253415, 488518357, 495802701, 503064632, 509427726, 512530208, 510074198, 502547026, 493459553, 486500829, 483193994, 483040750, 484712213, 487060070, 489711672, 493120402, 497788340, 503312290, 508457422, 512138009, 514221013, 515417635, 516600847, 518145263, 519903958, 521753788, 524005175, 527128994, 531022131, 534765720]
1117.7E34765720K558768J218915P93457J669049L214717M160881L752768K369345
1134E54503620Q07464o40929k250791m231512o118417p003784o401777m783929l189802
1152.4E20690143k369702k132058j567602p5817K022087L828049M837811N457878O525219
1170.7E37216008Q332967J0185242J0981918J0385215R322166Q982361R447157R618282
1187.1F14471316Q408547N956828L618837K609491K834916L048361K261996R72748
1203.4F44183040N28574J541078L274142M343093M019558K980113K461017K806961
1219.7F66137576L148019K380670M58776j351237j803934r84729j03950k87414j368284
1238.1F66225493k020896j303732L18170J554668J575052Q01385M27604J036167J995742
$$ y = [534765720, 537324488, 538543403, 539336860, 541005909, 544220626, 548381507, 552134275, 554503620, 555311084, 554670155, 552419364, 548187852, 542069435, 535065651, 528663874, 523879945, 520690143, 518320441, 516188383, 514620781, 514544964, 516567051, 520395100, 525232911, 530690789, 537216008, 545548975, 555734217, 566716135, 577101350, 586423516, 595405877, 604853034, 614471316, 622879863, 628836691, 632455528, 635065019, 637899935, 640948296, 643210292, 644183040, 644711614, 646252692, 649526834, 653869927, 657889485, 660869598, 663330615, 666137576, 669285595, 671666265, 672125041, 670773804, 668969870, 667985141, 667881191, 667593777, 666225493, 664204597, 662900865, 663219035, 664773703, 666348755, 667150140, 667577744, 668613911, 670609653]
1256.4F70609653K169013J168907m5538j67310J011073K407909K686083J583218J87755
1274.8F81610763k83658K39849P74979M47631o16073j446367j243472l25620J55032
1293.1F79313064n27382j863897k603889k103150r78648m55797j051605k000272k187371
1311.5F65541053j300931j80900L7193q32379k043426k738118k714694k561390k975821
1329.8F50230587l847242m269421l543317j873911j83761L69668k32875p82669m47750
1348.2F35419309L94285P36534Q8156j048744j699030j341999k80857L66449k01165
1366.6F32432938j101256j106798l5227J350284J637220O04451m10974j52767J599014
1384.9F34816885L786385M146576K301991N61893J4543M28916O34729j22130j454353
$$ y = [670609653, 672778666, 673947573, 673902035, 673734725, 674745798, 677153707, 679839790, 681423008, 681610763, 681327105, 681566954, 682341933, 682789564, 682173491, 680727124, 679483652, 679158032, 679313064, 678785682, 676921785, 674317896, 672214746, 671236098, 670780301, 669728696, 667728424, 665541053, 664240122, 664059222, 664096415, 663264036, 661220610, 658482492, 655767798, 653206408, 650230587, 646383345, 642113924, 638570607, 636696696, 636512935, 636882603, 636649728, 635867059, 635419309, 635813594, 636550128, 636638284, 635589540, 633890510, 632548511, 632267654, 632634103, 632432938, 631331682, 630224884, 630189657, 631539941, 633177161, 633781612, 633370638, 633217871, 634816885, 638603270, 642749846, 645051837, 645613730, 645628273, 646057189, 646691918, 646569788, 645115435]
1403.3F45115435k249718j746773p94351n04196j109064j969933k185405r88245O04034
1421.6F34171784R83357M47750k55525q4340J044690J831413J995980J502395O42121
1440F42279625O77705J333356J568019Q07345o49810j677632j754642j206994k02894
1458.3F41174078J22428j87814L25322K107620L567815M616976O158471O318152N527735
1476.7F69730783N656123O175458N989492M530251L262878L546059M793763M574776
1493G08259583L630757K967656K294361K111554K205491K622187L435731K340973J131594
1511.4G30999887J245141K036810K679288K001524R36449P96616J508236K479493K272666
1529.7G46956110J093447J65403J5915L40521J541257K181530Q07404k19881k42830
$$ y = [645115435, 642865717, 641118944, 640324593, 639820397, 638711333, 636741400, 634555995, 633567750, 634171784, 635155141, 635602891, 635347366, 635263026, 636307716, 638139129, 640135109, 641637504, 642279625, 642957330, 644290686, 645858705, 646666050, 646016240, 644338608, 642583966, 641376972, 641174078, 641296506, 641108692, 641434014, 643541634, 647109449, 651726425, 657884896, 664203048, 669730783, 675386906, 681562364, 687551856, 692082107, 695344985, 698891044, 703684807, 708259583, 711890340, 714857996, 717152357, 719263911, 721469402, 724091589, 727527320, 729868293, 730999887, 732245028, 734281838, 736961126, 738962650, 739899099, 740695715, 742203951, 744683444, 746956110, 748049557, 748214960, 748230875, 748571396, 750112653, 752294183, 753101587, 752881706, 752638876]
1548.1G52638876N16892J093864O20187o56486j913607j037061M23252K82288n59747
1566.4G51408458j940549k566158j578570p86722p52747j398980k293766k598941j794338
1584.8G35697687q76963r63033j986861k875507k715647j648903q44896j211524k378762
1603.2G20195591l130257k764284j751423j158655j715124l203630l990114k434432
1619.5G00047672j209855j148880j800239k744675k747178j592695n02468K48969J66297
1637.8F88716948m45187l77894L71457J608014K349436J242816N56529K175987L181040
1656.2F99379146K983153K765834K363503K113462K111315L123224M450202L604293
1672.5G22894132K521336K576053K914787L185451L589451M264832L171742K234160
$$ y = [752638876, 753155768, 754249632, 754869819, 754213333, 752299726, 751262665, 751685917, 751968205, 751408458, 749467909, 746901751, 745323181, 744536459, 743783712, 742384732, 740090966, 737492025, 735697687, 734820724, 733857691, 731870830, 728995323, 726279676, 724630773, 723785877, 722574353, 720195591, 717065334, 714301050, 712549627, 711390972, 709675848, 706472218, 702482104, 700047672, 698837817, 697688937, 695888698, 693144023, 690396845, 688804150, 688301682, 688550651, 688716948, 688271761, 687893867, 688265324, 689873338, 692222774, 693465590, 694022119, 696198106, 699379146, 702362299, 705128133, 707491636, 709605098, 711716413, 714839637, 719289839, 722894132, 725415468, 727991521, 730906308, 734091759, 737681210, 741946042, 745117784, 747351944]
1688.8G47351944K811432L032327K903819K324820J364767J743555K235413K338827
1705.1G66106904K217590J132429K15471K48909J055479K234578K184272Q78811K56002
1723.5G76530445P89582J601756J841068J224697N62131P08342J148403J907706K259075
1741.9G88573205J489342O39558O12616J785040L028095K625346J541734Q37862Q82447
1760.2H02015245J838207K399981J762569P00772k4736M72724J680673J939773J274526
1778.6H14059734K94030j64211L62456J266182J416802P08222k1457q0288M49836J212597
1799H19503903J544357Q66532j09613k99692M57704J376390J340151L79145m15205
1817.3H24643672k42889N71131J168609J007318N6982n80847J9253R56177J208842
$$ y = [747351944, 750163376, 753195703, 756099522, 758424342, 759789109, 761532664, 763768077, 766106904, 768324494, 769456923, 769672394, 769921303, 770976782, 773211360, 775395632, 776274443, 776530445, 777320027, 778921783, 780762851, 781987548, 782549679, 783258021, 784406424, 786314130, 788573205, 790062547, 790702105, 791314721, 793099761, 796127856, 798753202, 800294936, 801132798, 802015245, 803853452, 806253433, 808016002, 808716774, 808692038, 809164762, 810845435, 812785208, 814059734, 814353764, 814189553, 814552009, 815818191, 817234993, 817943215, 817921758, 817841470, 818291306, 819503903, 821048260, 821914792, 821805179, 821505487, 821963191, 823339581, 824679732, 825058877, 824643672, 824400783, 824971914, 826140523, 827147841, 827204823, 826623976, 826643229, 827599406, 828808248]
1835.7H28808248O88434k57016q13543l09050Q95798J176536M23849m77195o67930
1854H29468131L9220Q41618Q68201P2837p27654p75635J26958J156807R76205J8060
1874.4H32064748n95987l04520N04315R69410O43491j68263o56188k26319O25193R92716
1894.8H33848596N75006k26140n56231j03295N91219P30693J93357m16517n31494r3162
1915.2H34012032N66601P80106J98305m22299l93153J58310P07567O67691q821n96345
1935.6H35669994m80473J28687O47425O25253J0252n23448l37005L83020Q53479N71847
1956H37549031j90437o50168l11911M57824Q56816M79937l09408o74486k00927N99742
1976.4H37606013Q35001K58029n12183o82235q0585O47724P28249N4836o65545o30021
$$ y = [828808248, 829496682, 829239666, 828426123, 828117073, 829012871, 830189407, 830613256, 830136061, 829468131, 829507351, 830348969, 831217170, 831290007, 830562353, 829786718, 829913676, 831070483, 832046688, 832064748, 831468761, 831164241, 831668556, 832637966, 833281457, 833113194, 832457006, 832230687, 832855880, 833848596, 834423602, 834197462, 833641231, 833537936, 834129155, 834859848, 835053205, 834636688, 834105194, 834012032, 834578633, 835358739, 835557044, 835134745, 834741592, 834899902, 835607469, 836275160, 836266339, 835669994, 835189521, 835318208, 835965633, 836590886, 836601138, 836077690, 835740685, 836123705, 836977184, 837549031, 837358594, 836708426, 836396515, 836854339, 837711155, 838191092, 837881684, 837207198, 837006271, 837606013, 838441014, 838699043, 838186860, 837504625, 837424040, 838071764, 838800013, 838854849, 838189304, 837559283]
1996.8H37559283J28090P86483N91636k86817r32098o69956K04444P28845K88368o68347
2017.2H37729931j118779o49691J65403N07355J10805o37055r35077l59118M58598
2035.6H35272372N69343j48892q86500q53419p7248O41287N30183k73466q67546n75662
2056H33330452L23058Q67903M89890l66032p66813k96236N35012Q50320K86936n48601
2076.4H34705889p41780q6605P04825P80165Q8513o13332n54800K03669Q21829O64949
2096.8H35973322o0141o08444m18723L14475P99357N42462j61469n71608k54870M28439
2117.1H35982800O91652K34783m28916o08980j64211M36962O06596J73628l86476m96984
2137.5H36040854q0883M28081M85003M1484m18722l99888R6083N53787M97937J4722
$$ y = [837559283, 837687373, 838473856, 839065492, 838778675, 837846577, 837176621, 837381065, 838109910, 838398278, 837729931, 836611152, 835961461, 836126864, 836634219, 836745024, 836107969, 835172892, 834813774, 835272372, 835841715, 835692823, 834806323, 833952904, 833875656, 834516943, 835047126, 834773660, 833906114, 833330452, 833653510, 834521413, 835011303, 834645271, 833878458, 833582222, 834117234, 834967554, 835254490, 834705889, 833964109, 833877504, 834582329, 835362494, 835451007, 834837675, 834282875, 834486544, 835308373, 835973322, 835913181, 835304737, 834886014, 835200489, 835999846, 836542308, 836380839, 835809231, 835554361, 835982800, 836674452, 836909235, 836480319, 835871339, 835707128, 836144090, 836750686, 836924314, 836537838, 836040854, 835959971, 836388052, 836873055, 836914539, 836495817, 836095929, 836192012, 836745799, 837243736, 837258458]
2157.9H37258458l38435j81198L16441O47247M94480Q4519j51872J1146M72307P86245
2178.3H39399338N95331Q9407j81019N3763N12600P32422M55439q1599k98202M0650
2198.7H41318130N66721P40946L86536j20342k46107J51753O62506P08818K39253k41756
2219.1H44166458k68996J87099O74426O40393P7903l83139k35378L13878O62028M40121
2239.5H46274793j43349m36902j11580M53651O80625L31462k58565m72367p9572N12242
2259.9H46750438O64771K04027l41058l66390J58846O60718N66423o914m21465k65837
2280.3H47603559K56718O08682M23014j48117n24044k84553L12269N80132K36452l10779
2300.7H48753333m87864j58369L01659M07159K5511m40181m84943j17481K64824K96354
$$ y = [837258458, 836920023, 836738825, 837055266, 837702513, 838196993, 838281512, 838129640, 838140786, 838613093, 839399338, 839994669, 840084076, 839903057, 839956820, 840469420, 841201842, 841657281, 841575682, 841277480, 841318130, 841884851, 842625797, 843012333, 842891991, 842645884, 842797637, 843460143, 844168961, 844408214, 844166458, 843897462, 844084561, 844758987, 845399380, 845477283, 845094144, 844858766, 845172644, 845834672, 846274793, 846131444, 845694542, 845582962, 846036613, 846717238, 847048700, 846790135, 846317768, 846238196, 846750438, 847415209, 847619236, 847278178, 846911788, 847070634, 847731352, 848297775, 848290861, 847869396, 847603559, 847860277, 848468959, 848891973, 848743856, 848219812, 847935259, 848247528, 848827660, 849064112, 848753333, 848265469, 848107100, 848408759, 848815918, 848841429, 848401248, 847916305, 847798824, 848063648, 848360002]
2321.1H48360002j07825n01632m33267j5974L09527J46926l84033o58512l91007K4915
2341.5H46349120K81572K61963j27852m93169m45008j6689K52008m5359n17607n32389
2361.9H44966590j33574K68281L97622J58966j98483k59638N7876L72827L21329m1843
2382.3H45909953l54349l57450j00433J58310J50084j58369m35830l85224j07289J09017
2402.7H44428420R835l50595n76079m32729j00017O5625j29819n03183o68108m53293
2423.1H41290057r1255j490k88308o20842o88493m62413j32441o1453l70741o94155
2443.5H37878466o76871l55661o6578j05321m78626p98166o60002k46703p868j15037
2463.9H34367633m28975o34014n14806j97529l3260k43962o31332p33137m06921P331
$$ y = [848360002, 848252177, 847750545, 847317278, 847301304, 847610831, 847757757, 847373724, 846715212, 846324205, 846349120, 846630692, 846892655, 846764803, 846271634, 845826626, 845809937, 846061945, 846016586, 845498979, 844966590, 844833016, 845101297, 845498919, 845657885, 845459402, 845199764, 845257640, 845630467, 845951796, 845909953, 845555604, 845198154, 845097721, 845256031, 845406115, 845247746, 844811916, 844426692, 844319403, 844428420, 844438255, 844087660, 843511581, 843078852, 842978835, 843044460, 842914641, 842411458, 841743350, 841290057, 841198802, 841197312, 840909004, 840288162, 839599669, 839137256, 839004815, 838943362, 838572621, 837878466, 837201595, 836845934, 836779356, 836674035, 836195409, 835397243, 834737241, 834490538, 834482670, 834367633, 833938658, 833304644, 832789838, 832592309, 832559049, 832315087, 831683755, 830950618, 830543697, 830551028]
2484.3H30551028J00136j98781n45919n59867k53081K6464k503l12448n76734m84705
2504.7H27743590j32024J14917J9789l17395n40554m03941p6234K2292k43425n62191
2525.1H25624824o23107m07458j45375j05441l30865o23465o73235l99887j29819k03669
2545.5H21982503n50628p64370o36458l25263j29878k47121n23865o26087m63903k34008
2565.8H17480922j80304l74079n96285o15716m59492k77877k34246l64781m91023m45783
2586.2H13441336k75791j67787k28881l88742m99844m37379k44856j30296j96755l68237
2606.6H10502768m89533m65572l72947l74019n25832p01070p28130o21915n41508n44071
2627H05138171o40333p90358q48710p92325p11381o80685p55131q58546q81374q13126
$$ y = [830551028, 830651164, 830452383, 829906464, 829346597, 829093516, 829119980, 829117477, 828805029, 828228295, 827743590, 827611566, 827726483, 827746272, 827428877, 826888323, 826484382, 826408148, 826430440, 826187015, 825624824, 825001717, 824594259, 824448884, 824343443, 824012578, 823389113, 822715878, 822315991, 822186172, 821982503, 821431875, 820667505, 820031047, 819705784, 819575906, 819328785, 818804920, 818178833, 817714930, 817480922, 817300618, 816926539, 816330254, 815714538, 815255046, 814977169, 814742923, 814378142, 813887119, 813441336, 813165545, 812997758, 812768877, 812380135, 811880291, 811442912, 811198056, 811067760, 810871005, 810502768, 810013235, 809547663, 809174716, 808800697, 808274865, 807573795, 806845665, 806223750, 805682242, 805138171, 804497838, 803707480, 802858770, 802066445, 801355064, 800674379, 799919248, 799060702, 798179328, 797366202]
2647.4G97366202o80208n99087o50644p44939p79330p22707o41167o41108p32183q04424
2667.8G90370405p71523o18756m44948m41611n68211o64711o85454o05166n04732n33104
2688.2G84532189o89327q06034p38859n69880m80235n35309p05123q61347q36253o72579
2708.6G77637243o00695p26521q96335r02295p00772m60565m15504n72324p25686p15077
2729G70921469n58734m18842m23074n69880p07328o51181m37140k83242l48508n31077
2749.4G65992463o01530n14687l70740l18945m23908n48124n59450m33385k76089k78294
2769.8G61667311m32133n66304n95510n44369n37754o34729p64490q39412p95543p28428
2790.2G55228639p59066q36253r18507j022995j120031j132846j074969j124084j306176
$$ y = [797366202, 796685994, 796086907, 795436263, 794691324, 793911994, 793189287, 792548120, 791907012, 791174829, 790370405, 789598882, 788980126, 788535178, 788093567, 787525356, 786860645, 786175191, 785570025, 785065293, 784532189, 783842862, 783036828, 782297969, 781728089, 781247854, 780712545, 780007422, 779146075, 778309822, 777637243, 777036548, 776310027, 775413692, 774511397, 773810625, 773350060, 772934556, 772362232, 771636546, 770921469, 770362735, 769943893, 769520819, 768950939, 768243611, 767592430, 767155290, 766872048, 766523540, 765992463, 765390933, 764876246, 764505506, 764186561, 763762653, 763214529, 762655079, 762221694, 761945605, 761667311, 761235178, 760668874, 760073364, 759528995, 758991241, 758356512, 757592022, 756752610, 755957067, 755228639, 754469573, 753633320, 752714813, 751691818, 750571787, 749438941, 748363972, 747239888, 745933712]
2808.6G45933712j437784j420974j311124j269340j374007j532614j623273j593828
2824.9G34370768j520872j570165j764178j928747j958430j889348j886308k071858
2841.2G19780862k330660k520800k590060k558232k438187k254844k128661k059281
2857.5G00900137k002418k076625k287090k595723l032863l383875l479302l504455
2873.8F78537786l575265l545881l307163k892077k360821j757145j231790r33230
2890.1F58934414p36177n12540l60608l53754m56869o76334r60350j115918j123905
2908.5F52637959j241267j626849k162934k587616k698362k528966k232849j935363
2924.8F35623753j554787r50337j78873O90579J530052K162039K630830L125667L625334
$$ y = [745933712, 744495928, 743074954, 741763830, 740494490, 739120483, 737587869, 735964596, 734370768, 732849896, 731279731, 729515553, 727586806, 725628376, 723739028, 721852720, 719780862, 717450202, 714929402, 712339342, 709781110, 707342923, 705088079, 702959418, 700900137, 698897719, 696821094, 694534004, 691938281, 688905418, 685521543, 682042241, 678537786, 674962521, 671416640, 668109477, 665217400, 662856579, 661099434, 659867644, 658934414, 658198237, 657685697, 657325089, 656971335, 656514466, 655838132, 654877782, 653761864, 652637959, 651396692, 649769843, 647606909, 645019293, 642320931, 639791965, 637559116, 635623753, 634068966, 633118629, 632939756, 633630335, 635160387, 637322426, 639953256, 643078923, 646704257]
2943.2F46704257L902375L868819L706872L660500L728032L833294L929555L817201
2959.5F77150905L478706L170669K987385K871632K739430K554178K383292K290666
2975.8F99626863K359688K447367K257586J888453J623273J500070J469434J382112
2992.1G14554846J082123P34627M54962K37107J68205J14381p9513k79665m20808n71847
3012.5G15994418p45952r83060j243591j418770j465618j432359j410902j392245j405418
3030.9G04496503j488984j649260j772166j645386j515925j717567k036214k100885
3047.2F90570116j897514j765609j827538j896381j977086k047122j963913j823008
3063.5F75371945j783729j915991k094626k095223j924872j683176j599133j839876
$$ y = [646704257, 650606632, 654475451, 658182323, 661842823, 665570855, 669404149, 673333704, 677150905, 680629611, 683800280, 686787665, 689659297, 692398727, 694952905, 697336197, 699626863, 701986551, 704433918, 706691504, 708579957, 710203230, 711703300, 713172734, 714554846, 715636969, 716371596, 716826558, 717063665, 717231870, 717346251, 717266738, 716987073, 716566265, 715994418, 715248466, 714265406, 713021815, 711603045, 710137427, 708705068, 707294166, 705901921, 704496503, 703007519, 701358259, 699586093, 697940707, 696424782, 694707215, 692671001, 690570116, 688672602, 686906993, 685079455, 683183074, 681205988, 679158866, 677194953, 675371945, 673588216, 671672225, 669577599, 667482376, 665557504, 663874328, 662275195, 660435319]
3079.8F60435319k055585k021194j964152j952052j983642k119542k168595j986146
3096.1F44184411j747847j703739j886070j998246j878023j790523j866460j785338
3112.4F29528165j567900j633525j866579k017439k093434k004862j827776j775861
3128.8F14740789j834273j824439j660585j485825j578510j914382k040207j806200
3145.1F00596368j528680j373470j385808j619577j826048j754701j613379j614451
3161.4E87880254j669586j649618j516223j347244j304030j391888j489401j529693
3177.7E75982571j441360j331448j364947j431227j425504j379848j279413j196504
3194E65132320j231015j307010j331747j273394j160919j102031j158118j255870j276612
$$ y = [660435319, 658379734, 656358540, 654394388, 652442336, 650458694, 648339152, 646170557, 644184411, 642436564, 640732825, 638846755, 636848509, 634970486, 633179963, 631313503, 629528165, 627960265, 626326740, 624460161, 622442722, 620349288, 618344426, 616516650, 614740789, 612906516, 611082077, 609421492, 607935667, 606357157, 604442775, 602402568, 600596368, 599067688, 597694218, 596308410, 594688833, 592862785, 591108084, 589494705, 587880254, 586210668, 584561050, 583044827, 581697583, 580393553, 579001665, 577512264, 575982571, 574541211, 573209763, 571844816, 570413589, 568988085, 567608237, 566328824, 565132320, 563901305, 562594295, 561262548, 559989154, 558828235, 557726204, 556568086, 555312216, 554035604]
3212.4E54035604j166642r99570r19342r94265j133799j164317j051724q90673p53164
3230.7E44962108p76291j061022j268804j137614r09806p55369o81639p75158r99809
3249.1E36596596j026749p78199o41703q03590r42171q30233o45756n17905m08054
3267.5E30002236l86834o10888q48889q50737p86185p42257p39098p53581o70016m83513
3287.8E23130238k75195k70843n42760q38637r48072p74622m55618l10659n18501q95858
3308.2E17299473j059770r46880q15630q53300r39071q92937p28667o43015q45611
3326.6E09574592j104951j092911r01520o66201n10335o86109j025259j125634j085937
3345E01375735r59993p30842q53062j262933j306593r80765p29859p81267r29267q48204
$$ y = [554035604, 552868962, 551869392, 550950050, 549955785, 548821986, 547657669, 546605945, 545715272, 544962108, 544185817, 543124795, 541855991, 540718377, 539808571, 539053202, 538371563, 537596405, 536596596, 535569847, 534791648, 534149945, 533346355, 532404184, 531573951, 530928195, 530410290, 530002236, 529615402, 529004514, 528155625, 527304888, 526518703, 525776446, 525037348, 524283767, 523613751, 523130238, 522855043, 522584200, 522041440, 521202803, 520254731, 519480109, 519024491, 518713832, 518195331, 517299473, 516239703, 515292823, 514477193, 513623893, 512684822, 511791885, 511063218, 510420203, 509574592, 508469641, 507376730, 506475210, 505809009, 505298674, 504612565, 503587306, 502461672, 501375735, 500415742, 499684900, 498831838, 497568905, 496262312, 495281547, 494551688, 493770421, 492841154, 491992950]
3365.4D91992950p50839q95977j137227j204372j058310r43363q78900p77006o67334
3383.7D83679622n82307m51297k68072l36080o48648o88940l29107j92643o14553r03219
3404.1D78664756n58138j54853j61409l76195n51790n20796l00169j81645k30312j77741
3424.5D75451708P8738L21567L30835K96205K97845N9098k45363j69992J50859L31998
3444.9D76903498L24011K89172L75211N07653N81801O47515O82563N78343N81533R02951
3465.3D82374251J096994P10845J59263J96845O62088J009107R68575O09100M99546
3483.6D88286614P47890Q48055P83741P93725Q38161Q64833Q38846R03368J042188
3502D95947421R15587O26415N91486Q75145J214356J178145Q04067O28054Q63433J288771
$$ y = [491992950, 491242111, 490346134, 489208907, 488004535, 486946225, 486002862, 485123962, 484346956, 483679622, 483097315, 482646018, 482377946, 482041866, 481393218, 480704278, 480375171, 480182528, 479567975, 478664756, 478106618, 477951765, 477790356, 477414161, 476862371, 476341575, 476041406, 475859761, 475629449, 475451708, 475530446, 475852013, 476182848, 476479053, 476776898, 476835996, 476590633, 476420641, 476571500, 476903498, 477227509, 477516681, 477891892, 478399545, 478981346, 479628861, 480311424, 480889767, 481471300, 482374251, 483471245, 484182090, 484341353, 484538198, 485200286, 486209393, 487177968, 487787068, 488286614, 489034504, 489882559, 490666300, 491460025, 492298186, 493163019, 494001865, 494905233, 495947421, 496863008, 497489423, 498080909, 498956054, 500170410, 501348555, 502152622, 502780676, 503644109, 504932880]
3522.4E04932880J332164R82762R03785J059115J128852J242817J318454J214862J196385
3540.8E15312076J230597J167238J139045J234471J313210J324654J380801J505673
3557.1E25607765J642286J636267J314223J074731J684606K453566K334058K013922
3573.4E39761424J978219K052962K263189K530157K475262K094090K059698K537251
3589.7E57752252K586066K535284K871632L056109K882481K743661K623320K469599
3606E79520404K650380K854050K767086K810538K754092K870261L530622L438771K610326
3624.4F05806530J882791K261639L618478L489256K913356K734006K632260K704978
3640.7F28043294K754807K380610J920700K415299L411532L092587K526760K882123
$$ y = [504932880, 506265044, 507247806, 508151591, 509210706, 510339558, 511582375, 512900829, 514115691, 515312076, 516542673, 517709911, 518848956, 520083427, 521396637, 522721291, 524102092, 525607765, 527250051, 528886318, 530200541, 531275272, 532959878, 535413444, 537747502, 539761424, 541739643, 543792605, 546055794, 548585951, 551061213, 553155303, 555215001, 557752252, 560338318, 562873602, 565745234, 568801343, 571683824, 574427485, 577050805, 579520404, 582170784, 585024834, 587791920, 590602458, 593356550, 596226811, 599757433, 603196204, 605806530, 607689321, 609950960, 613569438, 617058694, 619972050, 622706056, 625338316, 628043294, 630798101, 633178711, 635099411, 637514710, 640926242, 644018829, 646545589, 649427712]
3657F49427712L009737K358496K044141K133250J869679J680791K118230J842618J674890
3675.4F68159544K531231K558947K135336J913607J670897J531661J707136J977265
3691.7F84185624J944304J671433J365006J170397J298785J489997J189709P18712
3708F95033967O29724J326024J960814J615465J038253P47502Q05914R46641J072765
3726.4G05177069J087665O65605L16918O96600J519918J721502R44018j00076K3961
3744.7G12053180R56714O22630M75407J228153J210153P14839P23898J069904Q83579
3763.1G19938457N55635N31196N81861Q43107R40085O57975M40360M77254N80788N46753
3783.5G26093471O72340Q53241P43568N18441K83301K26974L64781J10209J52886P06911
$$ y = [649427712, 652437449, 654795945, 656840086, 658973336, 660843015, 662523806, 664642036, 666484654, 668159544, 670690775, 673249722, 675385058, 677298665, 678969562, 680501223, 682208359, 684185624, 686129928, 687801361, 689166367, 690336764, 691635549, 693125546, 694315255, 695033967, 695663691, 696989715, 698950529, 700565994, 701604247, 702351749, 703157663, 704104304, 705177069, 706264734, 706930339, 707247257, 707943857, 709463775, 711185277, 712129295, 712029219, 712053180, 713009894, 713632524, 714107931, 715336084, 716546237, 717261076, 717984974, 719054878, 719938457, 720494092, 721025288, 721607149, 722450256, 723390341, 724048316, 724488676, 724965930, 725546718, 726093471, 726765811, 727619052, 728362620, 728881061, 729164362, 729391336, 729756117, 729866326, 730019212, 730726123]
3803.9G30726123O40631P82847J017153O13630K7180O1333L77417J38163N08547Q30054
3824.3G35723078N22614M09186L37004M38571N66304K20239J0431L43144O80447Q58247
3844.6G40109265O26922M17p52390q02815R42767J626790Q29160J29401j21414K19643
3865G42807746L48866O4552K70128N20408O13332M82619R9718K92182M27783K73347
3885.4G46200681M06742K17795J28448M56810K94388k10524l16620M6909M99308P97749
3905.8G48521686O71327L41117J63138K6047j03116J431J78218J50084K20597M71890
3926.2G50642419L56078O855P2121K95282J92582Q1003O0618K0325O8188J02102J95623
3948.7G52093196M00126M07815K06232K5451N722R9719J89423J81735Q7678N8413J05679
$$ y = [730726123, 731366754, 732149601, 733166754, 733780384, 733807564, 733868897, 734246314, 734384477, 734893024, 735723078, 736245692, 736654878, 736991882, 737430453, 737996757, 738216996, 738227427, 738570571, 739251018, 740109265, 740736187, 740736604, 739984214, 739181399, 740124166, 741750956, 742580116, 742709517, 742588103, 742807746, 743156612, 743221164, 743491292, 744011700, 744625032, 745107651, 745207369, 745499551, 745927334, 746200681, 746607423, 746825218, 746953666, 747410476, 747704864, 747494340, 747177720, 747224629, 747723937, 748521686, 749193013, 749534130, 749697268, 749723315, 749620199, 749621630, 749799848, 749949932, 750170529, 750642419, 750998497, 751005352, 751077473, 751372755, 751565337, 751646340, 751706958, 751727283, 751795471, 751897573, 752093196, 752493322, 752901137, 753107369, 753132820, 753138542, 753238261, 753427684, 753609419, 753697097, 753755510, 753861189]
3971.1G53861189K10345L26752K31445J7584J9311J82689K28822R7036o6280j04725
3991.5G55004168R775J77502K70844
3997.6G55462289
$$ y = [753861189, 754071534, 754398286, 754629731, 754647315, 754666626, 754849315, 755078137, 755175173, 755108893, 755004168, 755013943, 755191445, 755462289]
##END=$$ End of the data block
