##TITLE=$$ Begin of the data block
##JCAMP-DX=5.00 $$ ACD/SpecManager v 10.08
##SPECTROMETER/DATA SYSTEM=Alpha
##DATE=22 Dec 2014 10:36:42
##DATA TYPE=INFRARED SPECTRUM
##DATA CLASS=XYDATA
##ORIGIN=
##OWNER=
##NPOINTS=1765
##FIRSTX=399.76428223
##LASTX=3997.64306641
##MAXX=3997.64306641
##MINX=399.76428223
##MAXY=0.84974819
##MINY=0.42387924
##XFACTOR=1.0000000000
##YFACTOR=1.000000000000000e-9
##FIRSTY=0.64899415
##DELTAX=2.03961372
##XUNITS=1/CM
##YUNITS=ARBITRARY UNITS
##XYDATA=(X++(Y..Y))
399.8F48994148l875137j033425J059830J081884l35514q30770M96328J751780J654268
418.1F48963392l83735k652943k988398j592755k8372l98636k549350l906608k538025
436.5F31924570J000166L958523M219830K115249P79450J946450L599584L159880K01881
454.8F52905583k906978k859592j53244J088798m27246l417194n047977l519833k41399
473.2F35420918J184345p53045l327549l093898j01268K516985K093136r68337l378511
491.5F29592776k223551Q80778J802206o26385l970683m775584k278208L27825J3769
509.9F18742943k910912n474031n187154k305865O258o61015k828420l559708j252592
528.3E94569504K232909L678978K355874Q96215J769841M492938O354690M904687P78079
$$ plain form
399.8 648994148 645119011 644085586 645145416 646227300 645891786 645061016 645557344 647309124 648963392
418.1 648963392 648579657 645926714 642938316 641345561 641317189 640918553 638369203 634462595 631924570
436.5 631924570 632924736 636883259 641103089 643218338 643997788 645944238 649543822 652703702 652905583
454.8 652905583 649998605 647139013 646985769 648074567 647647321 644230127 639182150 635662317 635420918
473.2 635420918 636605263 635852218 632524669 629430771 629329503 631846488 633939624 632971287 629592776
491.5 629592776 627369225 628250003 630052209 629425824 625455141 620679557 618401349 618729174 618742943
509.9 618742943 615832031 610358000 605170846 602864981 602871239 602210224 599381804 595822096 594569504
528.3 594569504 596802413 600481391 602837265 603733480 605503321 609996259 616350949 621255636 622033715
546.6F22033715k498865k327382m5181R53198r26316m143298n730986m676938k914906
565E99723041k877235m759431o002903m247725j90556L547191M922152M243076L566921
583.3E97924531M465401O163776O300985L812969K77758j446426m79996J414001J876115
601.7F20309114K69652j681447j761794L87430K732277L098190J548290K96116J202702
620F26400530L569603N103886M250110J841902K15710Q34584K739668L427148J816868
638.4F50200009m95314j223326K37405K332032K878308J173437j022458j250684P81297
656.8F53610706K802074K556861L78012j363873j041591J979828L439664K086401R0123
675.1F64538205j047075J15514K323627L115237J539707q93295j787245m22180J351834
$$ plain form
546.6 622033715 619534850 617207468 617162287 618115485 617189169 613045871 607314885 602637947 599723041
565 599723041 596845806 592086375 586083472 581835747 581645191 585192382 590114534 594357610 597924531
583.3 597924531 602389932 608553708 614854693 618667662 618945420 617498994 617018998 618432999 620309114
601.7 620309114 620578766 618897319 617135525 617522955 620255232 623353422 624901712 625197828 626400530
620 626400530 629970133 635074019 639324129 641166031 641381741 642216325 644955993 648383141 650200009
638.4 650200009 649704695 648481369 648718774 651050806 653929114 655102551 654080093 652829409 653610706
656.8 653610706 656412780 658969641 659347653 657983780 656942189 658922017 662361681 664448082 664538205
675.1 664538205 663491130 663606644 665930271 669045508 670585215 669691920 667904675 667482495 668834329
693.5F68834329J189112j291990l843069l922939j697481N10812P91132n77807j237989
711.8F58754110N42283L761888N775392N106211K957165K015531L492951N780697O103099
730.2F94289327L626525N14448l25322J471281L243804K309322j000702l858745m071773
748.5F96198165k203345r34780k241969m887938n891860l969967o69897J320124J081765
766.9F77800298L16620J314938M409313P551730Q259832O171644L640890L211975M942835
785.3G17620075O294250N075991K156437L51906J351416M118144N654455M193365J324892
803.6G48140931q2612J103997L152490L311455J064539j357019j625836K23279J840473
822G55771697J057148j765073m226744m439175k996743k104461l064096n020142n849003
$$ plain form
693.5 668834329 670023441 668731451 664888382 660965443 659267962 659778774 660569906 659992099 658754110
711.8 658754110 659296393 663058281 668833673 673939884 676897049 678912580 682405531 688186228 694289327
730.2 694289327 697915852 698430300 698104978 699576259 702820063 705129385 704128683 700269938 696198165
748.5 696198165 693994820 693060040 690818071 685930133 680038273 676068306 675398409 676718533 677800298
766.9 677800298 678116918 679431856 683841169 691392899 699652731 705824375 709465265 712677240 717620075
785.3 717620075 723914325 728990316 731146753 731498659 732850075 736968219 742622674 746816039 748140931
803.6 748140931 748058319 749162316 752314806 755626261 756690800 755333781 753707945 753931224 755771697
822 755771697 756828845 755063772 750837028 746397853 743401110 741296649 738232553 733212411 727363408
840.3G27363408m497946k230107j209260k254247m102290m856169l887773k358675
856.6G01966941j645624j300454K38418L340244O928504R518981R743929P463515M431665
875G40686119K581656K013206J144826j285076m482388o341458n834758m028916k978504
893.4G21474707l677189n052984n396724m350304l161133l439426n436480p668138
909.7F83292329q477390p591307o335020o024360o290317n761445l736019r18984J078606
928F39236093J329004N52178L00109J457989L433764M605949L715635J017093k057075
946.4F53590739m317165n994558q195341j1018991j3260067j3924300j3286114j2709022
962.7E70885181j3369321j4967502j6145229j6030550j4947861j3871283j3314753
$$ plain form
840.3 727363408 722865462 720635355 719426095 717171848 713069558 708213389 704325616 701966941
856.6 701966941 700321317 699020863 699259281 702599525 709528029 719047010 728790939 736254454 740686119
875 740686119 743267775 745280981 746425807 745140731 740658343 734316885 728482127 724453211 721474707
893.4 721474707 717797518 712744534 707347810 702997506 699836373 696396947 690960467 683292329
909.7 683292329 674814939 667223632 660888612 654864252 648573935 642812490 639076471 638157487 639236093
928 639236093 640565097 641117275 641417384 642875373 646309137 650915086 654630721 655647814 653590739
946.4 653590739 649273574 643279016 635083675 624064684 610804617 596880317 583594203 570885181
962.7 570885181 557515860 542548358 526403129 510372579 495424718 481553435 468238682
977D68238682j2742073j1236965q610577n562186l052771j649678j056611m48585N87851
995.3D24467087J684695K180457J722962P00533P123R2536M74632M23730q2791l53694
1015.7D31317270K10255J419932K575785L061741K813787K477973K664239L206670
1032D49747652L349930K511561J024186j7255M6670Q63731J528740J571596J533508
1050.4D62160319K292216L973842N798012O932795P245242P285118P274390O324052
1066.7E09285986L044784k456367p471501r053856o996066l351718j32620J713872
1083D84582514K326101K593934L421605M750043N586237N158662L644109K021730J189769
1101.4E15274704J231729J569570J748561J842201K238751L098070L884495L767013
$$ plain form
977 468238682 455496609 444259644 435649067 430086881 427034110 425384432 424327821 423879236 424467087
995.3 424467087 426151782 428332239 430055201 430755734 430762857 430855393 431330025 431753755 431670964 431317270
1015.7 431317270 431527525 432947457 435523242 438584983 441398770 443876743 446540982 449747652
1032 449747652 453097582 455609143 456633329 456616074 456662744 457526475 459055215 460626811 462160319
1050.4 462160319 464452535 468426377 474224389 481157184 488402426 495687544 502961934 509285986
1066.7 509285986 512330770 509874403 502402902 493349046 486352980 483001262 482868642 484582514
1083 484582514 486908615 489502549 492924154 497674197 503260434 508419096 512063205 514084935 515274704
1101.4 515274704 516506433 518076003 519824564 521666765 523905516 527003586 530888081 534655094
1117.7E34655094K586305J232803Q00491J656353L183484M150212L760040K370417
1134E54395199Q14676o26206k228380m216492o140113p026612o389618m774273l216743
1152.4E20591438k385318k101481j524151m7505K017081L789306M793286N438686O523668
1170.7E37095010Q331597J0182142J0964632J0363400R311319Q987367R475172R652555
1187.1F14363194Q431196N964517L623069K612412K800703K996146K240420R74059
1203.4F44005716N34713J547158L302812M394234M029452K934576K453088K858341
1219.7F66060090L164113K345562M29034j359880j788378r49800j08719l51667j406729
1238.1F66033626j996577j262486L59535J596451J599491P83324L81350J014471J995981
$$ plain form
1117.7 534655094 537241399 538474202 539274693 540931046 544114530 548264742 552024782 554395199
1134 554395199 555209875 554583669 552355289 548138797 541998684 534972072 528582454 523808181 520591438
1152.4 520591438 518206120 516104639 514580488 514532983 516550064 520339370 525132656 530571342 537095010
1170.7 537095010 545426607 555608749 566573381 576936781 586248100 595235467 604710639 614363194
1187.1 614363194 622794390 628758907 632381976 634994388 637795091 640791237 643031657 644005716
1203.4 644005716 644540429 646087587 649390399 653784633 657814085 660748661 663201749 666060090
1219.7 666060090 669224203 671569765 671998799 670638919 668850541 667900741 667792022 667440355 666033626
1238.1 666033626 664037049 662774563 663134098 664730549 666330040 667113364 667494714 668509185 670505166
1256.4F70505166K175927J183868m0591j58012J018167K380251K659262J584768J93715
1274.8F81502521k76446K45750P85231M62651o13868j429260j214385l29196J25647
1293.1F79258645n41270j833320k559185k084732r75907m44948j043678k024054k215803
1311.5F65535748j308739j77264L9100q52167k065957k731740k673209k523482k988636
1329.8F50253654l875137m274905l553986j887500j56701M16696k22146p96378m43101
1348.2F35460496M16279P55429P7069j085639j711846j313924k23160L91960k40743
1366.6F32525921j142323j122713m8042J333416J619935O07848m03225j67609J583279
1384.9F34786487L795862M184067K322257N33700j1564M43757O56664j19447j477182
$$ plain form
1256.4 670505166 672681093 673864961 673824370 673666358 674684525 677064776 679724038 681308806 681502521
1274.8 681502521 681226075 681471825 682257056 682719707 682105839 680676579 679462194 679132998 679258645
1293.1 679258645 678717375 676884055 674324870 672240138 671264231 670819283 669775605 667751551 665535748
1311.5 665535748 664227009 664049745 664088845 663236678 661170721 658438981 655765772 653242290 650253654
1329.8 650253654 646378517 642103612 638549626 636662126 636505425 636922121 636699975 635903597 635460496
1348.2 635460496 635876775 636632204 636709273 635623634 633911788 632597864 632374704 632766664 632525921
1366.6 632525921 631383598 630260885 630212843 631546259 633166194 633774042 633370817 633203208 634786487
1384.9 634786487 638582349 642766416 645088673 645622373 645610809 646054566 646711230 646591783 645114601
1403.3F45114601k264321j720071p56264m92692j132846k006054k204477r54867O51658
1421.6F34234667R85384M39465k43068o0677J066386J824618J972317J518965O70850
1440F42408907O71804J321018J569748P92742o83904j702070j774013j223803j79291
1458.3F41201138J65165j65224L33190K106368L547252M578113O125689O311178N534887
1476.7F69737756N669892O174266N979181M525184L238678L525257M823328M593431
1493G08266973L598869K955735K355158K157510K185046K557934L396868K390445J183092
1511.4G31047630J239181K005160K666771J970589Q87454Q24749J588047K536595K293646
1529.7G47059822J086772J49786r835K90036J531363K217352Q24035j78695k03669
$$ plain form
1403.3 645114601 642850280 641130209 640373945 639881253 638748407 636742353 634537876 633583009 634234667
1421.6 634234667 635220051 635659516 635416448 635355771 636422157 638246775 640219092 641738057 642408907
1440 642408907 643080711 644401729 645971477 646764219 646080315 644378245 642604232 641380429 641201138
1458.3 641201138 641366303 641201079 641534269 643640637 647187889 651766002 657891691 664202869 669737756
1476.7 669737756 675407648 681581914 687561095 692086279 695324957 698850214 703673542 708266973
1493 708266973 711865842 714821577 717176735 719334245 721519291 724077225 727474093 729864538 731047630
1511.4 731047630 732286811 734291971 736958742 738929331 739816785 740641534 742229581 744766176 747059822
1529.7 747059822 748146594 748296380 748286545 748576581 750107944 752325296 753149331 752970636 752766967
1548.1G52766967N40197J096785N69284p80583k050697r44496N82934L32832n83410
1566.4G51529813j963377k541721j570523q20279p16388j320005k285897k600253j767159
1584.8G35944211q51094r54747k003611k887070k693653j630604q81255j281380k400995
1603.2G20359802l088236k715885j722396j156211j732349l205121l957152k401829
1619.5G00380623j210093j178146j808404k727271k753138j608968m97580K80440K12968
1637.8F89090431m23670l98100L14713J562297K380610J255453N18560K254546L284037
1656.2F99838877K982676K716601K336681K149045K152205L110289M398346L562689
1672.5G23247409K516210K607822K934099L159642L528058M261136L234685K260923
$$ plain form
1548.1 752766967 753307164 754403949 754973233 754192650 752141953 751197457 751780391 752113223 751529813
1566.4 751529813 749566436 747024715 745454192 744633913 743917525 742597520 740311623 737711370 735944211
1584.8 735944211 735093117 734138370 732134759 729247689 726554036 724923432 724042177 722760797 720359802
1603.2 720359802 717271566 714555681 712833285 711677074 709944725 706739604 702782452 700380623
1619.5 700380623 699170530 697992384 696183980 693456709 690703571 689094603 688597023 688877463 689090431
1637.8 689090431 688666761 688268661 688583374 690145671 692526281 693781734 694300294 696554840 699838877
1656.2 699838877 702821553 705538154 707874835 710023880 712176085 715286374 719684720 723247409
1672.5 723247409 725763619 728371441 731305540 734465182 737993240 742254376 745489061 747749984
1688.8G47749984K823472L021419K835870K260685J351059J772403K279997K359271
1705.1G66454160K214670J119316K05517K28762J018703K232075K225280R03130K59459
1723.5G76861072P82251J574516J810253J195729N05924O81996J178921J959979K312005
1741.9G88862646J528918O40929N60105J758993L082871K667308J526713Q05378Q67725
1760.2H02301586J854598K417803J748681O75440o5029M31121J712203J989245J263797
1778.6H14329445K71857j23203M31002J279771J354515O36161l8266m4942N11944J251161
1799H19859445J528859Q55983j02640l06904M65274J411736J362324L72767m24445
1817.3H25022399k41398N61893J139760R75310L6359n66840O6996R81629J208603O85871
$$ plain form
1688.8 747749984 750573456 753594875 756430745 758691430 760042489 761814892 764094889 766454160
1705.1 766454160 768668830 769788146 769993663 770222425 771241128 773473203 775698483 776601613 776861072
1723.5 776861072 777643323 779217839 781028092 782223821 782729745 783411741 784590662 786550641 788862646
1741.9 788862646 790391564 791032493 791592598 793351591 796434462 799101770 800628483 801433861 802301586
1760.2 802301586 804156184 806573987 808322668 808998108 808933079 809364200 811076403 813065648 814329445
1778.6 814329445 814601302 814478099 814909101 816188872 817543387 818179548 818141282 818096340 818608284 819859445
1799 819859445 821388304 822244287 822141647 821834743 822300017 823711753 825074077 825446844 825022399
1817.3 825022399 824781001 825342894 826482654 827457964 827494323 826927483 826994479 827976108 829184711 829870582
1837.7H29870582k81215q54254l09706R45568J203836M14490m96924o79493M2320Q47458
1858.1H30702662Q83639Q6427p54952q32379J11997J192868J006424L8803n88298l04580
1878.5H31542611N20945R93609O39796k23100p03156j85609O86765R87053N31733k48373
1898.9H34542274n38349p8439N87523P28130K06709m16398n43177j02938N75483Q08537
1919.3H35769355K11418m25577l79205J96636P26461O55055j8358o04212n06282R7692
1939.7H35722983O48200O54161K4617n20646l18766M11153Q76665N64933k22743o47783
1960.1H37192774k79427M65214Q29816M49181l29375o70731j61529O36339Q32379K20597
1980.5H39185238n50449o94573p0989O54757P16448N0723o46591o19650J23143P95365
$$ plain form
1837.7 829870582 829589367 828735113 828425407 829370975 830574811 830989301 830492377 829812884 829855204 830702662
1858.1 830702662 831586301 831672728 830917776 830085397 830197394 831390262 832396686 832435489 831847191 831542611
1878.5 831542611 832063556 833057165 833696961 833473861 832770705 832585096 833271861 834258914 834790647 834542274
1898.9 834542274 834003925 833925486 834513009 835241139 835447848 835031450 834488273 834385335 834960818 835769355
1919.3 835769355 835980773 835555196 835175991 835372627 836099088 836754143 836735785 836131573 835625291 835722983
1939.7 835722983 836371183 837025344 837049961 836529315 836210549 836621702 837498367 838063300 837840557 837192774
1960.1 837192774 836913347 837378561 838208377 838657558 838328183 837657452 837495923 838132262 838964641 839185238
1980.5 839185238 838634789 837940216 837869227 838523984 839240432 839291155 838644564 838024914 838148057 838943422
2000.9H38943422O18040k65300r21726o53625K10703P14838K85507o52194j105011
2019.2H37174654o54459J47343M91082J20521o20604r53376l69251M96090N99205j78039
2039.6H36253166r39190q65162m7505O68586N44309k67565q74638n82517L23952Q78751
2060H35092187N05745l69072p88748k98738N47707Q45492K87532n32627p42137j04845
2080.4H34442496O87242P78794J10030n86629n53965J76072Q05736O72280m9174n95211
2100.8H35887671m04120L37660Q21770N28693k04921o07550k81215M03881P13289L02851
2121.2H37498009l97146o25491j74939M44531O07312J43230m26531m85241k8134M61459
2141.6H37017059N00739L7253m52280m34220R1493N79000N16593j132l70443j79410
$$ plain form
2000.9 838943422 839561462 839296162 838374436 837720811 837931514 838646352 838931859 838279665 837174654
2019.2 837174654 836520195 836667538 837158620 837279141 836658537 835705161 835335910 835832000 836431205 836253166
2039.6 836253166 835313976 834448814 834401309 835069895 835614204 835346639 834472001 833889484 834213436 835092187
2060 835092187 835597932 835228860 834440112 834141374 834689081 835534573 835822105 835289478 834547341 834442496
2080.4 834442496 835129738 835908532 836018562 835431933 834877968 835054040 835859776 836532056 836482882 835887671
2100.8 835887671 835483551 835821211 836642981 837171674 836966753 836359203 836077988 836481869 837195158 837498009
2121.2 837498009 837100863 836475372 836300433 836744964 837352276 837495506 837068975 836583734 836555600 837017059
2141.6 837017059 837517798 837555051 837102771 836668551 836760044 837339044 837855637 837854505 837484062 837304652
2162H37304652L47256O63758N07176J17004j20402J0312M45962P57992N80370J00375
2182.4H40714455j65284N1260N29766P58648M24564j43469l24249O7473O19769P73251
2202.8H43306184L60548j87516k70307J91927O98388P16984K35855k54273k66075K21610
2223.2H44753325P01547O30736M7565l98338k21968L33250O78837M58896j36614m48108
2243.6H46399128j22129M52160O75798L18169k59876m47154n2273N16653O44386J72138
2264H48297000l67820l89338J31607O48558N98908K8789m23610k47956L05653O26683
2284.4H49208474M11868j48713n12421l08037K58445N68629K69949k71380m60505j65582
2304.8H48850727K60115L59237l934m47452m70817p9692K67625K18690j86205n16713
$$ plain form
2162 837304652 837651908 838315666 838822842 838939846 838819444 838829756 839275718 840033710 840614080 840714455
2182.4 840714455 840549171 840600431 841130197 841888845 842313409 842169940 841845691 841913164 842532933 843306184
2202.8 843306184 843666732 843479216 843208909 843400836 844099224 844816208 845052063 844797790 844531715 844753325
2223.2 844753325 845454872 846085608 846133173 845734835 845512867 845846117 846524954 846983850 846847236 846399128
2243.6 846399128 846276999 846729159 847404957 847723126 847463250 847016096 846963823 847480476 848124862 848297000
2264 848297000 847929180 847539842 847671449 848320007 848918915 848947704 848524094 848276138 848581791 849208474
2284.4 849208474 849620342 849471629 848959208 848651171 848909616 849478245 849748194 849476814 849016309 848850727
2304.8 848850727 849110842 849470079 849466145 849018693 848547876 848468184 848735809 848954499 848768294 848251581
2325.2H48251581m46796n5015L10123J78277l66866p14958n24819J1980M05252L40164
2345.6H47388923n7816m21107m94659k10703M9830r4593l69548l79563n1677L60131
2366H45719218M37141J25289k26796k44439P0215L47077L24369K1458k84672l21269
2386.4H45967591q4937J65880J22487k13444m60446l56912n0307J34111j8954l88921
2406.8H44816148n97000m27067q2672O9857j26004n00381o63042m39704q4996J0848
2427.2H41975987k69532o38604p45833m98414j17004k1816l42547o81103o53326l29197
2447.6H37678611p8439j66476n16772p67649o22272k35796o497j22666m60506o56485
2467.9H34045053m78566j50442k6405k45631o19411p33137m31419l0100O1810k15888
$$ plain form
2325.2 848251581 847804785 847749770 848059893 848238170 847871304 847156346 846631527 846643507 847048759 847388923
2345.6 847388923 847331107 846910000 846415341 846204638 846254468 846159875 845790327 845410764 845359087 845719218
2366 845719218 846156359 846281648 846054852 845810413 845880628 846227705 846552074 846573532 846288860 845967591
2386.4 845967591 845882654 846048534 846171021 845957577 845497131 845140219 845089912 845224023 845205069 844816148
2406.8 844816148 844219148 843792081 843709409 843779266 843653262 843152881 842489839 842050135 841965139 841975987
2427.2 841975987 841706455 841067851 840322018 839823604 839706600 839684784 839342237 838661134 838007808 837678611
2447.6 837678611 837600172 837433696 836916924 836149275 835527003 835291207 835284710 835162044 834701538 834045053
2467.9 834045053 833566487 833416045 833389640 833144009 832524598 831791461 831360042 831329942 831391752 831175864
2488.3H31175864n35906n25355k00033O4134p987l57151o31332m98354q1063J57297
2508.7H28560114j0073l55184n19276l53992m5776M3511k25723n81741o43790l81946
2529.1H25486124j20402j11162l58344o37590o48320l99828j76013k39432n51104p29323
2549.5H21514606n96344l03626j20640k51353n20408o22809m89890k66254j98663l91900
2569.9H17752719o16789o21974m35234k40683k22564l71337m91619m49300k74121j31309
2590.3H13897789j84894l99172n25892m36127k57016j50978k04802l56853m52578m33922
2610.7H10495555l67045l81172n35011o95050p40051o83248n71787n20885o08266p58409
2631.1H04634631q36492p76112o80506o84500p77662q73029q94189q01623o60836n95093
$$ plain form
2488.3 831175864 830639958 830114603 829914570 829978704 829970717 829613566 828982234 828483880 828402817 828560114
2508.7 828560114 828550041 828194857 827675581 827321589 827275813 827319324 827093601 826511860 825868070 825486124
2529.1 825486124 825365722 825254560 824896216 824258626 823610306 823210478 823034465 822795033 822243929 821514606
2549.5 821514606 820918262 820614636 820493996 820242643 819722235 819099426 818609536 818343282 818144619 817752719
2569.9 817752719 817135930 816513956 816078722 815838039 815615475 815244138 814752519 814303219 814029098 813897789
2590.3 813897789 813712895 813313723 812787831 812351704 812094688 811943710 811738908 811382055 810929477 810495555
2610.7 810495555 810128510 809747338 809212327 808517277 807777226 807093978 806522191 806001306 805393040 804634631
2631.1 804634631 803798139 803022027 802341521 801657021 800879359 800006330 799112141 798310518 797649682 797054589
2651.5G97054589o38902p25091p83920p73847o91772o33478o95705p96199p64966o10948
2671.9G89939761m77195m51803n48243o70910o83844n95928n35190n59389o59228p57694
2692.3G84000337p11977n68867n00739n59985p13289q40366q02338o70791o33180p46310
2712.7G77252495r04739q98242o82413m78387m61519n91338p18534o95645n20051l84152
2733.1G70917475m22954n80371p05182o64175m61876k58625k87890n26011o54519n44190
2753.5G65811682l34382k57075m18484n99504n85854m20511k77579k97904m35769n46932
2773.9G61637688n66960n38230n60939o47545p53939q29220p85768p09772p41601q43525
2794.3G54660189r59933j058101j100838j082540j078606j186013j332998j404345
$$ plain form
2651.5 797054589 796415687 795690596 794906676 794132829 793441057 792807579 792111874 791315675 790550709 789939761
2671.9 789939761 789462566 789010763 788462520 787791610 787107766 786511838 785976648 785417259 784758031 784000337
2692.3 784000337 783288360 782719493 782218754 781658769 780945480 780105114 779302776 778631985 777998805 777252495
2712.7 777252495 776347756 775449514 774767101 774288714 773827195 773235857 772517323 771821678 771301627 770917475
2733.1 770917475 770494521 769914150 769208968 768544793 768082917 767824292 767536402 767010391 766355872 765811682
2753.5 765811682 765477300 765220225 764801741 764202237 763616383 763195872 762918293 762620389 762184620 761637688
2773.9 761637688 761070728 760532498 759971559 759324014 758570075 757740855 756955087 756245315 755503714 754660189
2794.3 754660189 753700256 752642155 751541317 750458777 749380171 748194158 746861160 745456815
2810.6G45456815j381278j298666j269162j374304j557648j663089j615346j536250
2826.9G33761072j581013j746655j909732j963318j888036j891375k097666k328694
2843.2G18354583k495527k578557k548337k443790k289534k143502k044738j988232
2859.5F99822366k063393k319217k684116l076792l360331l466785l529608l604353
2875.9F75717771l558636l340065k940953k371609j749754j217663q90792p08699n17190
2894.2F58422410l82483l95238m86374o91831r59098j071275j087904j261353j660228
2912.6F50426626k163529k565503k676905k542436k290666j958668j530647r40323
2928.9F33757949j93179O67095J528681K182722K638280L121615L655910L958106L872216
$$ plain form
2810.6 745456815 744075537 742776871 741507709 740133405 738575757 736912668 735297322 733761072
2826.9 733761072 732180059 730433404 728523672 726560354 724672318 722780943 720683277 718354583
2843.2 718354583 715859056 713280499 710732162 708288372 705998838 703855336 701810598 699822366
2859.5 699822366 697758973 695439756 692755640 689678848 686318517 682851732 679322124 675717771
2875.9 675717771 672159135 668819070 665878117 663506508 661756754 660539091 659648299 658939600 658422410
2894.2 658422410 658039927 657644689 657158315 656466484 655507386 654436111 653348207 652086854 650426626
2912.6 650426626 648263097 645697594 643020689 640478253 638187587 636228919 634698272 633757949
2928.9 633757949 633564770 634231865 635760546 637943268 640581548 643703163 647359073 651317179 655189395
2947.2F55189395L683031L669560L746330L839076L917098L821075L536641L214300
2963.6F84616506K978623K868235K755225K560079K387226K344012K458215K508580
2979.9G05476701K224744J808285J581610J512765J519204J438558J105129P25925
2996.2G17392921M53651K72751K18213J35839r2805k86400l84688n37098p82132j051605
3016.6G15338647j250803j366794j402199j371384j387358j435578j465976j527548
3032.9G04131007j680612j769364j611650j518369j740932k033413k102852j917898
3049.2F89755917j773000j829684j902759j961887k021313j970768j857757j792789
3065.5F74645960j891076k093196k111674j909017j663148j587809j799285k030313
$$ plain form
2947.2 655189395 658872426 662541986 666288316 670127392 674044490 677865565 681402206 684616506
2963.6 684616506 687595129 690463364 693218589 695778668 698165894 700509906 702968121 705476701
2979.9 705476701 707701445 709509730 711091340 712604105 714123309 715561867 716666996 717392921
2996.2 717392921 717846572 718119323 718337536 718473375 718380570 718094170 717709482 717172384 716390252 715338647
3016.6 715338647 714087844 712721050 711318851 709947467 708560109 707124531 705658555 704131007
3032.9 704131007 702450395 700681031 699069381 697551012 695810080 693776667 691673815 689755917
3049.2 689755917 687982917 686153233 684250474 682288587 680267274 678296506 676438749 674645960
3065.5 674645960 672754884 670661688 668550014 666640997 664977849 663390040 661590755 659560442
3081.9F59560442k045751k002239j983464j986622k106190k189458k021670j753151
3098.2F43471897j707495j900613k007067j893342j788437j830399j789868j631439
3114.5F28923237j642883j841068k065658k142370k000094j822948j758635j812339
3130.8F13837242j838386j696825j549244j648664j937569k017736j772642j516998
3147.1E99859178j362801j374602j635253j845300j791001j660406j618445j658082
3163.4E86913288j659990j538098j364052j279235j357972j510501j568616j456320
3179.8E75178504j337707j363874j424133j420737j375198j293302j216769j222431
3196.1E64524353j297713j360416j310408j174569j123667j179695j227737j213372
$$ plain form
3081.9 659560442 657514691 655512452 653528988 651542366 649436176 647246718 645225048 643471897
3098.2 643471897 641764402 639863789 637856722 635963380 634174943 632344544 630554676 628923237
3114.5 628923237 627280354 625439286 623373628 621231258 619231164 617408216 615649581 613837242
3130.8 613837242 611998856 610302031 608752787 607104123 605166554 603148818 601376176 599859178
3147.1 599859178 598496377 597121775 595486522 593641222 591850221 590189815 588571370 586913288
3163.4 586913288 585253298 583715200 582351148 581071913 579713941 578203440 576634824 575178504
3179.8 575178504 573840797 572476923 571052790 569632053 568256855 566963553 565746784 564524353
3196.1 564524353 563226640 561866224 560555816 559381247 558257580 557077885 555850148 554636776
3212.4E54636776j125216j012683r70662j030743j112103j121819j062691r45211p75576
3230.7E45480072p65681j070440j300096j129031q33094p07329p31945q50618j009166
3249.1E37082672j007676p97093o39439p46488r09925q58068o88553n50449m31657
3267.5E30453324l95536o00040q26061q07702p39694p61688p94410p45297o15060m68493
3287.8E23699343l02315k97606n70058q37624q96454p35343m57227l64959o29783r84311
3308.2E17623663j087308r26316p55846q19385r49085q78811o86467n92827p93577
3326.6E10134041j110136j151979r49025o89268n06700o70552j047194j180112j073718
3345E01755357q64506o83546q87841j312822j376093j023501o60538o73652r40204
$$ plain form
3212.4 554636776 553511560 552498877 551528215 550497472 549385369 548263550 547200859 546255648 545480072
3230.7 545480072 544714391 543643951 542343855 541214824 540381730 539674401 538942456 538091838 537082672
3249.1 537082672 536074996 535277903 534638464 533891976 532982051 532123983 531435430 530884981 530453324
3267.5 530453324 530057788 529457748 528631687 527823985 527084291 526322603 525528193 524782896 524167836 523699343
3287.8 523699343 523397028 523099422 522529364 521691740 520795286 520059943 519602716 519237757 518607974 517623663
3308.2 517623663 516536355 515610039 514854193 514034808 513085723 512206912 511520445 510927618 510134041
3326.6 510134041 509023905 507871926 506922901 506233633 505726933 505056381 504009187 502829075 501755357
3345 501755357 500890851 500207305 499319464 498006642 496630549 495607048 494946510 494272858 493332654
3363.3D93332654r42677p63416q40456j082122j153439j052946r73612q98779p97063
3381.7D84828144o77228n55724m45038l27110m04805o72668o80029k97159j48476n88923
3402.1D80030984q77351n43594j84030j95294l82990n34624m95732k66373j60336k64436
3422.5D76126224k03073J05530L49134L43621K50935K09153N3793j73419j32114J23262
3442.9D77053046K83450L13997L21508M10557N43892O20306O88970P16090N34892N13047
3463.2D81999755R23604J142800P20292J40786J34736O16342J028508R80437N80430
3481.6D88267690M94212P69347Q38369P41720P94947Q76189Q51213Q07912Q80241R77308
3502D96299148Q38726N95689O49393R98676J285225J157522P80940O76870R38237J287997
$$ plain form
3363.3 493332654 492389977 491626561 490786105 489703983 488550544 487497598 486523986 485625207 484828144
3381.7 484828144 484150916 483595192 483150154 482823044 482418239 481745571 481065542 480768383 480619907 480030984
3402.1 480030984 479153633 478610039 478426009 478230715 477847725 477313101 476817369 476550996 476390660 476126224
3422.5 476126224 475923151 476028681 476377815 476721436 476972371 477181524 477235317 477061898 476929784 477053046
3442.9 477053046 477336496 477650493 477972001 478382558 478926450 479546756 480235726 480951816 481486708 481999755
3463.2 481999755 482923359 484066159 484786451 484927237 485061973 485678315 486706823 487687260 488267690
3481.6 488267690 488761902 489531249 490369618 491111338 491906285 492782474 493633687 494441599 495321840 496299148
3502 496299148 497137874 497733563 498382956 499381632 500666857 501824379 502605319 503282189 504220426 505508423
3522.4E05508423J279473R51708Q68618J029730J150787J286089J323283J172721J156688
3540.8E15727520J237810J232028J211762J259685J310825J318336J369833J496375
3557.1E26164174J645744J669288J342177J055717J674653K453744K291024J995444
3573.4E40291965K054334K158224K301276K516627K452612K108991K128184K547920
3589.7E58560133K539933K508640K870500L065705K880693K783537K689421K436042
3606E80334604K560556K822101K771199K845823K809167K916456L594517L489018K593338
3624.4F06736779J839400K283334L658116L460348K907276K778113K637386K673805
3640.7F28974557K770960K429545J886487K339423L471255L156841K501607K867341
$$ plain form
3522.4 505508423 506787896 507739604 508608222 509637952 510788739 512074828 513398111 514570832 515727520
3540.8 515727520 516965330 518197358 519409120 520668805 521979630 523297966 524667799 526164174
3557.1 526164174 527809918 529479206 530821383 531877100 533551753 536005497 538296521 540291965
3573.4 540291965 542346299 544504523 546805799 549322426 551775038 553884029 556012213 558560133
3589.7 558560133 561100066 563608706 566479206 569544911 572425604 575209141 577898562 580334604
3606 580334604 582895160 585717261 588488460 591334283 594143450 597059906 600654423 604143441 606736779
3624.4 606736779 608576179 610859513 614517629 617977977 620885253 623663366 626300752 628974557
3640.7 628974557 631745517 634175062 636061549 638400972 641872227 645029068 647530675 650398016
3657F50398016L048539K383113K020776K087534J809180J604795K088845J858592J733303
3675.4F69032693K645254K595544K088725J867414J646221J559257J824081K067268
3691.7F85326457J900554J576185J312256J142740J260281J476943J217783P18236
3708F95931435N76794J309335K009153J648426J029790P51197Q27968R57907J077652
3726.4G06119657J050889N86033K75612P19428J592994J797258R48310j40428q762
3744.7G12940991R42409N94139M15385J199663J254260P88331P59602J090586R33885
3763.1G20919251N71549M82679N72204R01640R75013O32166L68417M45366O52313O55055
3783.5G27175653P40051Q10683O30796M82559L19004K24412L37481J14739J78754P02858
$$ plain form
3657 650398016 653446555 655829668 657850444 659937978 661747158 663351953 665440798 667299390 669032693
3675.4 669032693 671677947 674273491 676362216 678229630 679875851 681435108 683259189 685326457
3691.7 685326457 687227011 688803196 690115452 691258192 692518473 693995416 695213199 695931435
3708 695931435 696508229 697817564 699826717 701475143 702504933 703256130 704084098 705042005 706119657
3726.4 706119657 707170546 707756579 708032191 708751619 710344613 712141871 713090181 712949753 712940991
3744.7 712940991 713883400 714477539 714892924 716092587 717346847 718135178 718894780 719985366 720919251
3763.1 720919251 721490800 721973479 722545683 723447323 724422336 725054502 725422919 725868285 726520598 727175653
3783.5 727175653 727915704 728726387 729357183 729839742 730158746 730383158 730720639 730835378 731014132 731716990
3803.9G31716990O24896P99834J026213O15776M4286L2664L21865J18375N44250Q76605
3824.3G36721754M99725M05372L99947M77254N33700R9063n7280M43637P74920Q76606
3844.6G41174698O15895j5676p17581p68423Q69274J577735Q64446J83285j45614J65760
3865G43803799L72827J19269K92540M83811N51164M89771J77384L54766M29988K15352
3885.4G47290671L66270K83003K18332M34876K27749k28763l42607N841N32627Q83103
3905.8G49671102P11500L31819J41382O736p2956N4300K01344J52350J48594L95596
3926.2G51741767L77715N4001J07408L21388J99557O5743K6405L9041J15693Q1182
3946.6G53129900J43468L61144L81411J94847K5451R179J00673K02179J89900L6836
$$ plain form
3803.9 731716990 732341886 733141720 734167933 734783709 734827995 734860659 735182524 735300899 735845149 736721754
3824.3 736721754 737221479 737626851 738026798 738504052 739037752 739136815 739079535 739523172 740298092 741174698
3844.6 741174698 741790593 741774917 741057336 740288913 741158187 742735922 743600368 743783653 743638039 743803799
3865 743803799 744176626 744295895 744588435 745072246 745623410 746113181 746290565 746645331 747075319 747290671
3885.4 747290671 747656941 747939944 748158276 748593152 748820901 748592138 748249531 748255372 748787999 749671102
3905.8 749671102 750382602 750714421 750855803 750862539 750789583 750843883 751045227 751197577 751346171 751741767
3926.2 751741767 752119482 752173483 752280891 752602279 752801836 752867579 752893984 752933025 753048718 753129900
3946.6 753129900 753273368 753634512 754015923 754210770 754236221 754245400 754346073 754548252 754738152 754774988
3967G54774988j1504J42932K95997L29196K14815K1577L3736K12789K16067M5597n3227
3989.5G56222963j19O1810J06514K00271
3997.6G56591439
$$ plain form
3967 754774988 754763484 754906416 755202413 755531609 755746424 755768001 755801737 756014526 756230593 756276190 756222963
3989.5 756222963 756222844 756284654 756391168 756591439
3997.6 756591439
##END=$$ End of the data block
