##TITLE=$$ Begin of the data block
##JCAMP-DX=5.00 $$ ACD/SpecManager v 10.08
##SPECTROMETER/DATA SYSTEM=Alpha
##DATE=22 Dec 2014 10:36:42
##DATA TYPE=INFRARED SPECTRUM
##DATA CLASS=XYDATA
##ORIGIN=
##OWNER=
##NPOINTS=1765
##FIRSTX=399.76428223
##LASTX=3997.64306641
##MAXX=3997.64306641
##MINX=399.76428223
##MAXY=0.85063952
##MINY=0.42413631
##XFACTOR=1.0000000000
##YFACTOR=1.000000000000000e-9
##FIRSTY=0.65117353
##DELTAX=2.03961372
##XUNITS=1/CM
##YUNITS=ARBITRARY UNITS
##XYDATA=(X++(Y..Y))
399.8F51173532m275322j086652R98616O41704q28922r32813N06044J639723J652122
$$ 651173532 646898210 645811558 646810174 647451878 646622956 645690143 646196187 647835910 649488032
418.1F49488032l37422k918661l214955j374066L73423o8486k350032l990352k694607
$$ 649488032 649150610 646231949 643016994 641642928 642016351 641947865 639597833 635607481 632912874
436.5F32912874J037479L993392M079342J960158O78420J899838L839136L549039L02255
$$ 632912874 633950353 637943745 642023087 643983245 644661665 646561503 650400639 653949678 654251933
454.8F54251933k974450l038705m90188J077592j51098l341317n188823l646135k28882
$$ 654251933 651277483 648238778 647748590 648826182 648675084 645333767 640144944 636498809 636269927
473.2F36269927J199305q75711l484071l222048j34468K675712K138198j226306l569663
$$ 636269927 637469232 636593521 633109450 629887402 629752934 632428646 634566844 633340538 629770875
491.5F29770875k148747J043856J959622n30780l911078m664302k183437L47972m2319
$$ 629770875 627622128 628665984 630625606 630094826 626183748 621519446 619336009 619683981 619641662
509.9F19641662k966524n437493n097508k321959j86264q35419k857208l513873j171470
$$ 619641662 616675138 611237645 606140137 603818178 603631914 602796495 599939287 596425414 595253944
528.3E95253944K338231L766716K333521P44284J737952M669130O485223M949809R08732
$$ 595253944 597592175 601358891 603692412 604436696 606174648 610843778 617329001 622278810 623187542
546.6F23187542k363861k441883l42726P91847r70304m283905n857765m597605k757251
$$ 623187542 620823681 618381798 618039072 618830919 617860615 613576710 607718945 603121340 600364089
565F00364089k873778m754424n829752m175603k49565L603399M980147M143119L471970
$$ 600364089 597490311 592735887 586906135 582730532 582480967 586084366 591064513 595207632 598679602
583.3E98679602M450441O108701O248534L877222L80039j453578o01471J349867J905977
$$ 598679602 603130043 609238744 615487278 619364500 619744539 618290961 617689490 619039357 620945334
601.7F20945334K21551j715839j624584N24998K741098L105938J612604L05355J138091
$$ 620945334 621166885 619451046 617826462 618351460 621092558 624198496 625811100 626116455 627254546
620F27254546L485024N039274M270554J913428K52486Q17060K668798L373504J862585
$$ 627254546 630739570 635778844 640049398 641962826 642215312 643032372 645701170 649074674 650937259
638.4F50937259m05192j136720K81214K272845K775073J115739r79781j148760Q03887
$$ 650937259 650532067 649395347 649676561 651949406 654724479 655840218 654860437 653711677 654515564
656.8F54515564K723039K496779M19974j236320r24110J861513L239572K019286O4552
$$ 654515564 657238603 659735382 660155356 658919036 657994926 659856439 663096011 665115297 665179849
675.1F65179849j063168J94549K461136L153085J425326j038134j807451l15011J480162
$$ 665179849 664116681 664311230 666772366 669925451 671350777 670312643 668505192 668190181 669670343
693.5F69670343J216531j347899l846050l883242j698375M29571O60300o39677j156628
$$ 669670343 670886874 669538975 665692925 661809683 660111308 660540879 661201179 660561502 659404874
711.8F59404874P24017L900171N778611N040228K843082J892209L508568N890011O119371
$$ 659404874 660128891 664029062 669807673 674847901 677690983 679583192 683091760 688981771 695101142
730.2F95101142L540516M81367k77281J495898L285646K371252j058221m002213m129231
$$ 695101142 698641658 699123025 698845744 700341642 703627288 705998540 704940319 700938106 696808875
748.5F96808875k155900q93593k237797m925549n973160m000783o05166J408040J109958
$$ 696808875 694652975 693759382 691521585 686596036 680622876 676622093 676016927 677424967 678534925
766.9F78534925K49147J230479M418313P576466Q219123O142497L662646L262758M966855
$$ 678534925 678784072 680014551 684432864 692009330 700228453 706370950 710033596 713296354 718263209
785.3G18263209O304085N130291K171755L21865J358569M079461N594015M219115J366794
$$ 718263209 724567294 729697585 731869340 732191205 733549774 737629235 743223250 747442365 748809159
803.6G48809159k2948J182199L120482L170669R09984j441658j557350M05192J958490
$$ 748809159 748786211 749968410 753088892 756259561 757169545 755727887 754170537 754575729 756534219
822G56534219J030981j846313m282892m487514l037453k108336l068983n041719n849003
$$ 756534219 757565200 755718887 751435995 746948481 743911028 741802692 738733709 733691990 727842987
840.3G27842987m506290k290309j242876k206683m045188m818321l839135k282441
$$ 727842987 723336697 721046388 719803512 717596829 713551641 708733320 704894185 702611744
856.6G02611744j594841j353264J14083L234506O907582R565533R798884P519662M442096
$$ 702611744 701016903 699663639 699777722 703012228 709919810 719485343 729284227 736803889 741245985
875G41245985K497435J901686J073241j325965m498720o347418n849719m006922k900779
$$ 741245985 743743420 745645106 746718347 745392382 740893662 734546244 728696525 724689603 721788824
893.4G21788824l613174n088568n508721m420519l186881l451884n428255p648945
$$ 721788824 718175650 713087082 707578361 703157842 699970961 696519077 691090822 683441877
909.7F83441877q424401p544219o325067o022930o324291n795538l724218r22799J025260
$$ 683441877 675017476 667473257 661148190 655125260 648800969 643005431 639281213 638358414 639383674
928F39383674J268446N47588L54767J513898L457725M601181L671229R12726k124370
$$ 639383674 640652120 641199708 641554475 643068373 646526098 651127279 654798508 655711234 653586864
946.4F53586864m277825n956054q212149j1065483j3310909j3916373j3239503j2707889
$$ 653586864 649309039 643352985 635140836 624075353 610764444 596848071 583608568 570900679
962.7E70900679j3401866j4976859j6127944j6020656j4957309j3903647j3341010
$$ 570900679 557498813 542521954 526394010 510373354 495416045 481512398 468171388
977D68171388j2717098j1197627q579313n520285l023833j623809r88215l84897N65916
$$ 468171388 455454290 444256663 435677350 430157065 427133232 425509423 424521208 424136311 424702227
995.3D24702227J618773K134919J683325O84589M7922J34051M80652M19825r8348l72588
$$ 424702227 426321000 428455919 430139244 430823833 430871755 431005806 431486458 431906283 431807935 431435347
1015.7D31435347J99407J432449K614945L066689K781897K442718K632677L200174
$$ 431435347 431634754 433067203 435682148 438748837 441530734 443973452 446606129 449806303
1032D49806303L351837K511054J054466M4585Q0943Q14467J427353J541197J614511
$$ 449806303 453158140 455669194 456723660 456768245 456849188 457663655 459091008 460632205 462246716
1050.4D62246716K356887L972828N798340O935358P210046P204205P227421O374061
$$ 462246716 464603603 468576431 474374771 481310129 488520175 495724380 502951801 509325862
1066.7E09325862L086209k493024p504642r008675o896168l300608j59055J678259
$$ 509325862 512412071 509919047 502414405 493405730 486509562 483208954 483049899 484728158
1083D84728158K331405K640814L446490M734575N553693N097508L601790K036392J241148
$$ 484728158 487059563 489700377 493146867 497881442 503435135 508532643 512134433 514170825 515411973
1101.4E15411973J290083J598477J736820J796961K198219L086865L877103L771008
$$ 515411973 516702056 518300533 520037353 521834314 524032533 527119398 530996501 534767509
1117.7E34767509K621471J231850P51555J662612L230988M155875L728926K330661
$$ 534767509 537388980 538620830 539372385 541034997 544265985 548421860 552150786 554481447
1134E54481447P91251o22987k225995m213095o119967p002174o358743m726649l163158
$$ 554481447 555272698 554649711 552423716 548210621 542090654 535088480 528729737 524003088 520839930
1152.4E20839930k365172k129972j553297m4108K039969L816724M787743N394101O502688
$$ 520839930 518474758 516344786 514791489 514747381 516787350 520604074 525391817 530785918 537288606
1170.7E37288606Q329272J0170401J0955870J0362684R321332Q991242R453237R617090
$$ 537288606 545617878 555788279 566744149 577106833 586428165 595419407 604872644 614489734
1187.1F14489734Q402109N937755L614366K655387K864480L012121K222359R73642
$$ 614489734 622891843 628829598 632443964 635099351 637963831 640975952 643198311 644171953
1203.4F44171953N48005J569152L309846M369736M016876K940059K411186K773524
$$ 644171953 644719958 646289110 649598956 653968692 657985568 660925627 663336813 666110337
1219.7F66110337L131568K386332M83155j346111j804233r40800p8618l31223j407802
$$ 666110337 669241905 671628237 672111392 670765281 668961048 668020248 667941630 667610407 666202605
1238.1F66202605k015949j277983L74615J625419J578331P41184M01139J061142K015948
$$ 666202605 664186656 662908673 663283288 664908707 666487038 667228222 667629361 668690503 670706451
1256.4F70706451K182186J181125n0902j67668J011848K375305K642870J579225K12610
$$ 670706451 672888637 674069762 674018860 673851192 674863040 677238345 679881215 681460440 681673050
1274.8F81673050k65658K73526Q24928M45187o64294j460909j225353l07739J62363
$$ 681673050 681407392 681680918 682505846 682951033 682286739 680825830 679600477 679292738 679455101
1293.1F79455101n36799j849294k557873k065778r50396m11451j019836k037942k229631
$$ 679455101 678918302 677069008 674511135 672445357 671494961 671083510 670063674 668025732 665796101
1311.5F65796101j293123j80065R834q68678k071738k734125k668321k523541k993107
$$ 665796101 664502978 664322913 664332747 663464069 661392331 658658206 655989885 653466344 650473237
1329.8F50473237l869414m257977l531635j866281j64092L72827k47538p77244m20928
$$ 650473237 646603823 642345846 638814211 636947930 636783838 637156665 636909127 636131883 635710955
1348.2F35710955M25875P61747O9261j105011j718282j308978k50340L60370k33352
$$ 635710955 636136830 636898577 636967838 635862827 634144545 632835567 632585227 632945597 632712245
1366.6F32712245j139343j135289m7446J354337J639664O01232m12702j64271J570165
$$ 632712245 631572902 630437613 630390167 631744504 633384168 633985400 633572698 633408427 634978592
1384.9F34978592L763855M130661K262831N11527l815M60506O80029j02281j466453
$$ 634978592 638742447 642873108 645135939 645647466 645643651 646104157 646784186 646681905 645215452
1403.3F45215452k245546j688361p33375m88639j137674k018333k226054r72927O56307
$$ 645215452 642969906 641281545 640548170 640059531 638921857 636903524 634677470 633704543 634360850
1421.6F34360850R91702M33803k25902j1504J107991J834750J939953J468181O60777
$$ 634360850 635352552 635786355 635560453 635548949 636656940 638491690 640431643 641899824 642560601
1440F42560601O92189J332641J566767P99060o66857j697540j794696j248121j61648
$$ 642560601 643252790 644585431 646152198 646951258 646284401 644586861 642792165 641544044 641382396
1458.3F41382396J91212j65522L24309K123117L587902M592418O064773O250978N567967
$$ 641382396 641573608 641408086 641732395 643855512 647443414 652035832 658100605 664351583 669919550
1476.7F69919550N738914O208837N977393M521429L229141L499628M814088M603684
$$ 669919550 675658464 681867301 687844694 692366123 695595264 699094892 703908980 708512664
1493G08512664L592968K927184K361298K217412K229988K525509L343522K413154J222372
$$ 708512664 712105632 715032816 717394114 719611526 721841514 724367023 727710545 730123699 731346071
1511.4G31346071J268089J983702K609133J948417R22441Q84891J594603K516210K301872
$$ 731346071 732614160 734597862 737206995 739155412 740077853 740962744 742557347 745073557 747375429
1529.7G47375429J086235J43945N126K62618J446962K219081Q89957j33455j66356
$$ 747375429 748461664 748605609 748610735 748873353 750320315 752539396 753429353 753295898 753129542
1548.1G53129542N71430J101493N53191p89761k065599r63629O08504L93033n50985
$$ 753129542 753700972 754802465 755355656 754565895 752500296 751536667 752145171 752538204 751987219
1566.4G51987219k006173k569855j520097p69317p32183j349688k283096k610624j784206
$$ 751987219 749981046 747411191 745891094 745121777 744389594 743039906 740756810 738146186 736361980
1584.8G36361980q33988r45925k053082k953053k708793j582384q04841j205147k367198
$$ 736361980 735527992 734582067 732528985 729575932 726867139 725284755 724479914 723274767 720907569
1603.2G20907569l103674k721250j711487j157463j756728l244638l942609k355695
$$ 720907569 717803895 715082645 713371158 712213695 710456967 707212329 703269720 700914025
1619.5G00914025j203417j158059j791000k744318k711296j552701n35071J98544K22921
$$ 700914025 699710608 698552549 696761549 694017231 691305935 689753234 689218163 689416707 689639628
1637.8F89639628l72768l72946K88606J486301K359271J279831M81367K217174L326535
$$ 689639628 689266860 688893914 689182520 690668821 693028092 694307923 694789290 697006464 700332999
1656.2G00332999L040672K781570K379536K148986K127349L092111M458248L631652
$$ 700332999 703373671 706155241 708534777 710683763 712811112 715903223 720361471 723993123
1672.5G23993123K496302K571940K933443L147065L454984M160344L233850K308846
$$ 723993123 726489425 729061365 731994808 735141873 738596857 742757201 745991051 748299897
1688.8G48299897K857566L035247K816796K204836J291573J752019K297878K386033
$$ 748299897 751157463 754192710 757009506 759214342 760505915 762257934 764555812 766941845
1705.1G66941845K244115J129806J86563J99020J005173K245247K261042R47297K79307
$$ 766941845 769185960 770315766 770502329 770701349 771706522 773951769 776212811 777160108 777439415
1723.5G77439415P66755J568615J816392J168370M67301O89566J202941J965344K293229
$$ 777439415 778206170 779774785 781591177 782759547 783226848 783916414 785119355 787084699 789377928
1741.9G89377928J484155O04094N85734J808584L087282K650678J510144P78556Q33749
$$ 789377928 790862083 791466177 792051911 793860495 796947777 799598455 801108599 801887155 802720904
1760.2H02720904J860619K483189J789928O33180j34528M37975J758456J999319J283169
$$ 802720904 804581523 807064712 808854640 809487820 809353292 809791267 811549723 813549042 814832211
1778.6H14832211L14712j07527M24385J300514J390457O33717o9678o7055M88281J230955
$$ 814832211 815146923 815039396 815463781 816764295 818154752 818788469 818718791 818651736 819140017 820370972
1799H20370972J527250Q44657j15275k83480M96030J420975J365900L77297m14490
$$ 820370972 821898222 822742879 822627604 822344124 822840154 824261129 825627029 826004326 825589836
1817.3H25589836k11478O06776J158297R33587l1411o07551Q6666J043737J248359
$$ 825589836 825378358 825985134 827143431 828077018 828045607 827438056 827524722 828568459 829816818
1835.7H29816818O88136k92480q77202l28362R64165J243055M20272n20885o78718
$$ 829816818 830504954 830212474 829335272 829006910 829971075 831214130 831634402 831113517 830434799
1854H30434799P1287Q65758Q58486M2438p56443q05377J19626J183927R92775M1068
$$ 830434799 830506086 831371844 832230330 832272768 831516325 830710948 830830574 832014501 833007276 833048344
1874.4H33048344n74112l25859M95792J007378O43253k33173o88494j69992O87063
$$ 833048344 832474232 832148373 832644165 833651543 834294796 834061623 833373129 833203137 833890200
1892.8H33890200R81033N29050k48313n47707q9109N96226P53522K16662m21524n31375
$$ 833890200 834871233 835400283 835151970 834604263 834515154 835111380 835864902 836081564 835660040 835128665
1913.2H35128665o7651N99205P93576J68503m77255l95238K25306P52151O45279l9041
$$ 835128665 835061014 835660219 836453795 836622298 836145043 835749805 835975111 836727262 837372541 837333500
1933.6H37333500o02662m70996J60277O89745O38008k2411n45562l03387M28497Q63731
$$ 837333500 836730838 836259842 836420119 837109864 837747872 837725461 837179899 836876512 837305009 838168740
1954H38168740N40138k37108o53684k71261M85301Q49307M50730l31103o47843j19865
$$ 838168740 838708878 838471770 837818086 837546825 838032126 838881433 839332163 839001060 838353217 838233352
1974.4H38233352O78360Q37624J79172n86510o84440k6166O85572O90460K98o63638
$$ 838233352 838911712 839749336 839928508 839341998 838657558 838631392 839316964 840007424 840007722 839344084
1994.8H39344084o03497J45614Q10683O11663l07083r59993o53564K35676P26402K68161
$$ 839344084 838740587 838886201 839696884 840308547 840001464 839041471 838387907 838623583 839349985 839618146
2015.2H39618146o72102j113891o46234J75059N20110J17958o46413r48131l33428
$$ 839618146 838946044 837832153 837185919 837360978 837881088 837999046 837352633 836404502 836071074
2033.5H36071074N19812N97000j97589r55045q56817p630P12693N40912l27289r37342
$$ 836071074 836590886 837187886 836990297 836035252 835178435 835170805 835883498 836424410 836097121 835159779
2053.9H35159779n82278L77238R04142M77374m01795p70092k33710N95510Q33750K41459
$$ 835159779 834577501 834954739 835858881 836336255 835934460 835164368 834930658 835526168 836359918 836601377
2074.3H36601377n43535o99043o4552O90400P53045O9976o14285n52893K03073Q29578
$$ 836601377 836057842 835358799 835294247 835984647 836737692 836807668 836193383 835640490 835843563 836673141
2094.7H36673141O59406q0407o00696l84092L39449P96973N04911k05517n73098k24591
$$ 836673141 837332547 837252140 836651444 836267352 836606801 837403774 837908685 837703168 837130070 836905479
2115.1H36905479M50910P01189K43723m22716o07491j56939M42684N97298J42038m27485
$$ 836905479 837356389 838057578 838301301 837878585 837271094 837114155 837556839 838154137 838296175 837868690
2135.5H37868690m85360j8835M77016N13136M4406m36604m10915R4056N47111M84586
$$ 837868690 837383330 837364495 837841511 838354647 838399053 837962449 837551534 837645590 838192701 838677287
2155.9H38677287J1385l36349j79351L33786O69718M93169N8293j67787K6286N00023
$$ 838677287 838688672 838352323 838172972 838506758 839176476 839669645 839727938 839560151 839586437 840086460
2176.3H40086460Q11815O05882O0260k22683N9485N58854P61568M41194j01149k90156
$$ 840086460 840898275 841504157 841564417 841341734 841401219 841960073 842721641 843162835 843061686 842771530
2196.7H42771530N8174N77808P39395L57449j60455k44856J89006O89328P22110K28167
$$ 842771530 842829704 843407512 844146907 844504356 844343901 844099045 844288051 844977379 845699489 845927656
2217.1H45927656k72394k54869K43962O95526O09398L5465l99172j96934L81053O98387
$$ 845927656 845655262 845400393 845644355 846339881 846949279 846984744 846585572 846388638 846769691 847468078
2237.5H47468078M22239j89960m76539j32620M65155P17461L34322k84672m36306k324
$$ 847468078 847890317 847700357 847223818 847091198 847556353 848273814 848608136 848323464 847887158 847884834
2257.9H47884834N19514O06894J46926l75986l79026J47700O54280N93126K9266l97980
$$ 847884834 848404348 849011242 849158168 848782182 848403156 848550856 849205136 849798262 849827528 849429548
2278.3H49429548k16603L20851O09875L56138j98543n16832k77996K98083N94616K40385
$$ 849429548 849212945 849533796 850143671 850499809 850301266 849784434 849506438 849804521 850399137 850639522
2298.7H50639522l50058m84943j04666L20673L62515m8041m90248m87566j08242K10225
$$ 850639522 850289464 849804521 849699855 850020528 850383043 850335002 849844754 849357188 849248946 849459171
2319.1H49459171J95444j42694n01036m76420n6565K98500J19746m57466p65562m33683
$$ 849459171 849654615 849511921 849010885 848534465 848477900 848776400 848896146 848438680 847673118 847239435
2339.5H47239435J46210M68194L82901n8651m97401n58078k02954M9889j23739l60072
$$ 847239435 847385645 847853839 848236740 848178089 847680688 847122610 846919656 846969545 846845806 846485734
2359.9H46485734l37780j00195K08497L92735K65122n0426j32203J54853M14669L20018
$$ 846485734 846147954 846047759 846256256 846648991 846914113 846863687 846731484 846886337 847301006 847621024
2380.2H47621024l4273l23772l34800q6665J75357J42157j87814m35174l36170m8339
$$ 847621024 847586751 847262979 846928179 846841514 847016871 847159028 846971214 846536040 846199870 846151531
2400.6H46151531J21414l4511l83138n57602m12106r9600O1214j18673m66465o23286
$$ 846151531 846272945 846238434 845855296 845297694 844885588 844785988 844847202 844728529 844262064 843638778
2421H43638778m36604j47939r3341l40164o43015p04169m51982j13129n6625l49700
$$ 843638778 843202174 843054235 842960894 842620730 841977715 841273546 840821564 840708435 840651810 840302110
2441.4H40302110o47307o25968l08990o4969j74999n28574p73371o27458k21729K6822
$$ 840302110 839654803 839028835 838719845 838654876 838479877 837951303 837177932 836550474 836328745 836355567
2461.8H36355567j13130m80294o94871n21004j31249K7835k55466o69479p40230l87549
$$ 836355567 836242437 835762143 835067272 834546268 834415019 834442854 834187388 833517909 832777679 832390130
2482.2H32390130J6272O8605k36333n65231n65111k13683Q1956R239l32653n94139
$$ 832390130 832406402 832475007 832238674 831673443 831108332 830894649 830976605 830985844 830653191 830059052
2502.6H30059052m65334q3506J26958l6001l92795n46932l34144k3782L3855k47478
$$ 830059052 829593718 829510212 829637170 829601169 829208374 828661442 828327298 828303516 828337371 828089893
2523H28089893o02901o70552l90470q6606r0957l76165o44266o33061l64065j30356
$$ 828089893 827486992 826816440 826425970 826339364 826248407 825872242 825227976 824594915 824230850 824100494
2543.4H24100494k33292n77808p35640n71132k80559j22666k63155n57959o78837n03242
$$ 824100494 823867202 823289394 822553754 821982622 821702063 821579397 821316242 820758283 820079446 819576204
2563.8H19576204k40565j77383l76046o02722o18696m24027k15054k21133m01378n07832
$$ 819576204 819335639 819158256 818782210 818179488 817560792 817136765 816921711 816700578 816299200 815791368
2584.2H15791368m35531k63691j52945k32339m39286n32508l99232k07186j37269k08795
$$ 815791368 815355837 815092146 814939201 814706862 814267576 813735068 813335836 813128650 812991381 812782586
2604.6H12782586l45052m43935m55916m05371l95477n19454o76811p22707o70254n84364
$$ 812782586 812437534 811993599 811537683 811132312 810736835 810217381 809540570 808817863 808147609 807563245
2625H07563245n31137n89072p40946q44598q01861o96599o60718p29203q42333q97407
$$ 807563245 807032108 806443036 805702090 804857492 804055631 803359032 802698314 801969111 801126778 800229371
2645.4H00229371q25584o88017o06060o43492p70032q25226p46131o52790o16133o69957
$$ 800229371 799403787 798715770 798109710 797466218 796696186 795870960 795124829 794472039 793855906 793185949
2665.8G93185949p74324p68721o09576m60923m81129n92112o57916o63221n92411n05328
$$ 793185949 792411625 791642904 791033328 790572405 790091276 789499164 788841248 788178027 787585616 787080288
2686.2G87080288n30779o75917p90060p24911n67258m91976n52476p20739q68440q32975
$$ 787080288 786549509 785873592 785083532 784358621 783791363 783299387 782746911 782026172 781157732 780324757
2706.6G80324757o65963n97357p09415q70645q87930p00414m84348m44293n76019p21037
$$ 780324757 779658794 779061437 778352022 777481377 776593447 775893033 775408685 774964392 774388373 773667336
2727G73667336p22647n59688m06265m10914n52714o83606o36280m44829k93970l26276
$$ 773667336 772944689 772385001 771978736 771567822 771015108 770331502 769695222 769250393 768956423 768630147
2747.4G68630147n04911o25432n55574l83437l19243m44889n79357n37455l67641k46764
$$ 768630147 768125236 767499804 766944230 766560793 766241550 765796661 765217304 764679849 764312208 764065444
2767.8G64065444l02791m79102n89550n78224n42462n43118n97775p37488q48472p97987
$$ 764065444 763762653 763283551 762694001 762115777 761573315 761030197 760432422 759694934 758846462 758048475
2788.2G58048475p20918p50900q33153r45032j064658j108885j076639j077175j178384
$$ 758048475 757327557 756576657 755743504 754798472 753733814 752624929 751548290 750471115 749292731
2806.5G49292731j319647j421332j402974j279950j246214j380861j558900j650274
$$ 749292731 747973084 746551752 745148778 743868828 742622614 741241753 739682853 738032579
2822.8G38032579j629471j560688j585842j759588j917959j921653j851559j898229
$$ 738032579 736403108 734842420 733256578 731496990 729579031 727657378 725805819 723907590
2839.1G23907590k112508k365053k536833k592862k560555k446175k283931k167642
$$ 723907590 721795082 719430029 716893196 714300334 711739779 709293604 707009673 704842031
2855.5G04842031k083063k017260k068102k280951k652883l116250l439307l482223
$$ 704842031 702758968 700741708 698673606 696392655 693739772 690623522 687184215 683701992
2871.8F83701992l479779l587365l593206l378451k970934k384067j732230j220524
$$ 683701992 680222213 676634848 673041642 669663191 666692257 664308190 662575960 661355436
2888.1F61355436r51767p85589n53191l62515l55363m54784o50823r18150j076102
$$ 661355436 660403669 659618080 659064889 658702374 658347011 657892227 657241404 656323254 655247152
2906.5F55247152j113236j263797j676679k216041k618611k695799k511382k239823
$$ 655247152 654133916 652870119 651193440 648977399 646358788 643662989 641151607 638911784
2922.8F38911784j949072j555503r39369j71661O57975J488269K163470K655685L139555
$$ 638911784 636962712 635407209 634467840 634296179 634954154 636442423 638605893 641261578 644401133
2941.1F44401133L657460L969312L912806L719628L666401L719092L825724L939152
$$ 644401133 648058593 652027905 655940711 659660339 663326740 667045832 670871556 674810708
2957.4F74810708L864228L563106L217399L004730K929449K790511K568424K417922
$$ 674810708 678674936 682238042 685455441 688460171 691389620 694180131 696748555 699166477
2973.8F99166477K351045K409458K481878K275408J894116J644790J556516J550674
$$ 699166477 701517522 703926980 706408858 708684266 710578382 712223172 713779688 715330362
2990.1G15330362J446545J098156P26104M79758L17752K51055J44601q3923k80202
$$ 715330362 716776907 717875063 718601167 719080925 719398677 719649732 719794333 719710410 719430208
3008.4G19430208m06682n39601p28190j013339j266062j402378j439333j400351j402617
$$ 719430208 719023526 718483925 717755735 716742396 715476334 714073956 712634623 711234272 709831655
3026.8G09831655j428843j444697j513898j649142j714229j602113j536787j708209
$$ 709831655 708402812 706958115 705444217 703795075 702080846 700478733 698941946 697233737
3043.1F97233737j998604k105594j913130j788080j889169j932084j926899j988352
$$ 697233737 695235133 693129539 691216409 689428329 687539160 685607076 683680177 681691825
3059.4F81691825j985430j887322j804530j895965k100348k122760j934051j698375
$$ 681691825 679706395 677819073 676014543 674118578 672018230 669895470 667961419 666263044
3075.7F66263044j619101j821637k036631k036273j990557j976907j989961k117336
$$ 666263044 664643943 662822306 660785675 658749402 656758845 654781938 652791977 650674641
3092.1F50674641k192736k017378j749993j691103j886367k014518j906157j817882
$$ 650674641 648481905 646464527 644714534 643023431 641137064 639122546 637216389 635398507
3108.4F35398507j884162j843512j668990j669347j821757j987099k105475k025664
$$ 635398507 633514345 631670833 630001843 628332496 626510739 624523640 622418165 620392501
3124.7F20392501j828372j744926j827777j896858j757741j550436j612484j910389
$$ 620392501 618564129 616819203 614991426 613094568 611336827 609786391 608173907 606263518
3141F06263518k015412j811504j549125j376330j403392j672685j866877j757681j631022
$$ 606263518 604248106 602436602 600887477 599511147 598107755 596435070 594568193 592810512 591179490
3159.4E91179490j653671j695156j657903j510084j344085j310468j413643j542568
$$ 591179490 589525819 587830663 586172760 584662676 583318591 582008123 580594480 579051912
3175.7E79051912j591921j480997j334667j330495j438439j511871j443088j293958
$$ 579051912 577459991 575978994 574644327 573313832 571875393 570363522 568920434 567626476
3192E67626476j186907j194775j286566j334191j279175j198292j172066j193761j223505
$$ 567626476 566439569 565244794 563958228 562624037 561344862 560146570 558974504 557780743 556557238
3210.3E56557238j238763j161576r97960r46820j063108j182974j167953j027286q95858
$$ 556557238 555318475 554156899 553158939 552212119 551149011 549966037 548798084 547770798 546874940
3228.7E46874940q07345q08537j060485j285136j132906q61644p42615p23242q13544
$$ 546874940 546067595 545259058 544198573 542913437 541780531 540918887 540176272 539453030 538639486
3247.1E38639486r93848j006544q01682o97136q36372r31621q13544o42240n46455
$$ 538639486 537645638 536639094 535837412 535140276 534303904 533372283 532558739 531916499 531370044
3265.4E31370044m87030m40359n90444q14855q29696p48456p10130p29680p20739o27160
$$ 531370044 530883014 530442655 529852211 529037356 528207660 527459204 526749074 526019394 525298655 524671495
3285.8E24671495n02288l47376l47018n97954q12590q61228p50899m87149l55601o07133
$$ 524671495 524169207 523821831 523474813 522876859 522064269 521203041 520452142 519964993 519609392 519002259
3306.2E19002259r53436j034260r29117q17776q21113q98779q70824p41482o75201
$$ 519002259 518048823 517014563 516085446 515267670 514446557 513547778 512676954 511935472 511260271
3324.6E11260271q36253j074135j079798r23932p05898m96804o32823r99927j153350
$$ 511260271 510424018 509349883 508270085 507346153 506640255 506143451 505510628 504510701 503357351
3342.9E03357351j079500q85606p08759q82297j272977j328021j016140p29024p52956
$$ 503357351 502277851 501392245 500683486 499801189 498528212 497200191 496184051 495455027 494702071
3361.3D94702071r25273q52376p12365q56429j149863j231373j055866r22918q68529
$$ 494702071 493776798 492924422 492212057 491355628 490205765 488974392 487918526 486995608 486127079
3379.6D86127079p76589o79911n89996m36515k75045l63082o36876o42925l07501j81347
$$ 486127079 485350490 484670579 484080583 483644068 483369023 483005941 482369065 481726140 481418639 481237292
3400D81237292o01202r10580n54353j65075k19256m03315n07146m71055k65152j44660
$$ 481237292 480636090 479725510 479171157 479006082 478786826 478383511 477876365 477405310 477140158 476995498
3420.4D76995498k23994j88381P5907K84850K62022K49297K90274P5192k38449j70529
$$ 476995498 476771504 476583123 476659030 476943880 477205902 477455199 477745473 477820665 477582216 477411687
3440.8D77411687J58430L14056K95520K91497M16845N90265O71833P12991O75798M78595
$$ 477411687 477570117 477884173 478179693 478471190 478888035 479478300 480150133 480863124 481538922 482017517
3461.2D82017517N15252R36419J122177O80208J13159J38820O30319J047581J001120
$$ 482017517 482532769 483469188 484591365 485271573 485384732 485523552 486153871 487201452 488202572
3479.6D88202572N94348N10245P59304P80582O91593P61539Q32498Q68529Q89301R23127
$$ 488202572 488796920 489307165 490066469 490847051 491538644 492300183 493132681 494001210 494890511 495813638
3500D95813638R73076Q55535O38515O53714R62168J261293J151562Q02458P19904R37939
$$ 495813638 496786714 497642249 498280764 498934478 499896646 501157939 502309501 503111959 503831863 504769802
3520.4E04769802J256585J272440R59277Q81851J023352J129806J318872J385391J191080
$$ 504769802 506026387 507298827 508258104 509139955 510163307 511293113 512611985 513997376 515188456
3538.7E15188456J154720J262188J249612J198470J264096J318276J286506J313329
$$ 515188456 516343176 517605364 518854976 520053446 521317542 522635818 523922324 525235653
3555E25235653J468182J703679J761794J368046J016974J633466K477407K353132K038300
$$ 525235653 526703835 528407514 530169308 531537354 532554328 534187794 536665201 539018333 541056633
3573.4E41056633K104580K201736K288223K515196K519548K137721K040803K497375
$$ 541056633 543161213 545362949 547651172 550166368 552685916 554823637 556864440 559361815
3589.7E59361815K588213K560615K878368L052414K894521K819538K705395K411067
$$ 559361815 561950028 564510643 567389011 570441425 573335946 576155484 578860879 581271946
3606E81271946K545298K869725K806961K851963K863586K982319L555357L423691K635479
$$ 581271946 583817244 586686969 589493930 592345893 595209479 598191798 601747155 605170846 607806325
3624.4F07806325J917422K247691L574967L485620K949000K749264K606511K682448
$$ 607806325 609723747 611971438 615546405 619032025 621981025 624730289 627336800 630019248
3640.7F30019248K800524K452969J823724K218961L489375L244997K523064K835930
$$ 630019248 632819772 635272741 637096465 639315426 642804801 646049798 648572862 651408792
3657F51408792L031015K426743K077461K082646J800000J636684K066493J746774J611710
$$ 651408792 654439807 656866550 658944011 661026657 662826657 664463341 666529834 668276608 669888318
3675.4F69888318K618432K703845K245546J927435J610756J497328J703441J982928
$$ 669888318 672506750 675210595 677456141 679383576 680994332 682491660 684195101 686178029
3691.7F86178029J971244J697839J361727J128555J252651J508713J227915O73831
$$ 686178029 688149273 689847112 691208839 692337394 693590045 695098758 696326673 697000504
3708F97000504N46932J344859K047480J636445J004636P07925P69496R82701J127422
$$ 697000504 697547436 698892295 700939775 702576220 703580856 704288781 705058277 706040978 707168400
3726.4G07168400J050413O29246L38376O69121J503230J777649R17792k44439j01626
$$ 707168400 708218813 708848059 709186435 709855556 711358786 713136435 714054227 713809788 713708162
3744.7G13708162R29892N72682M13060J298428J374781Q54551P74563J102447R74417
$$ 713708162 714638054 715210736 715623796 716922224 718297005 719151556 719926119 721028566 722002983
3763.1G22002983O12795M89355N67555R15587R99272O77526M26292M42386N64277N55217
$$ 722002983 722615778 723105133 723672688 724588275 725587547 726265073 726691365 727133751 727698028 728253245
3783.5G28253245O99938Q54492P12037N01215K74122K03371L08752J7107J12533P54357
$$ 728253245 728953183 729807675 730519712 731020927 731295049 731498420 731807172 731824279 731936812 732691169
3803.9G32691169O76513Q29875J087606O39558N424j9729K42173L0935N48303R43959
$$ 732691169 733367682 734197557 735285163 735924721 735930145 735910416 736152589 736183524 736731827 737675786
3824.3G37675786N89073M92751M18365M38273N04971J14262l5763M35650P61271Q78692
$$ 737675786 738264859 738757610 739175975 739614248 740119219 740233481 740197718 740633368 741394639 742273331
3844.6G42273331O35445L4451p00950q79169Q27015J686155R21071J56045j60396J73271
$$ 742273331 742908776 742943227 742242277 741363108 742190123 743876278 744797349 744953394 744792998 744966269
3865G44966269L54051M9591J92940M83156O48796N64814J86026L35991M43638K84433
$$ 744966269 745320320 745369911 745562851 746046007 746694803 747259617 747445643 747781634 748225272 748509705
3885.4G48509705L82364J96397J71900M70340K51889k12788k87771M9948N06640Q49485
$$ 748509705 748892069 749088466 749260366 749730706 749982595 749769807 749482036 749531984 750038624 750888109
3905.8G50888109P05958L24785J47045N2094n2750J7166J83702J93834J93358L37898
$$ 750888109 751594067 751918852 752065897 752117991 752065241 752082407 752266109 752459943 752653301 752991199
3926.2G52991199K76506K5511J00553L07858K35975J37210O8247M2320J31726J19626
$$ 752991199 753267705 753293216 753393769 753701627 753937602 754074812 754143059 754185379 754317105 754436731
3946.6G54436731J87934L93569L35276J09792M7565Q4817J09315K01046K03133K8193
$$ 754436731 754624665 755018234 755353510 755463302 755510867 755595684 755704999 755906045 756109178 756137371
3967G56137371m2498Q3744K55347L48866K46465L2902J0550J44779J72794P7963j0907
$$ 756137371 756094873 756178617 756433964 756782830 757029295 757062197 757072747 757217526 757390320 757468283 757457376
3989.5G57457376J609R4235J98722K63989
$$ 757457376 757458985 757553220 757751942 758015931
3997.6G58015931
$$ 758015931
##END=$$ End of the data block
