##TITLE=$$ Begin of the data block
##JCAMP-DX=5.00 $$ ACD/SpecManager v 10.08
##SPECTROMETER/DATA SYSTEM=Alpha
##DATE=22 Dec 2014 10:36:42
##DATA TYPE=INFRARED SPECTRUM
##DATA CLASS=XYDATA
##ORIGIN=
##OWNER=
##NPOINTS=1765
##FIRSTX=399.76428223
##LASTX=3997.64306641
##MAXX=3997.64306641
##MINX=399.76428223
##MAXY=0.81444055
##MINY=0.24660175
##XFACTOR=1.0000000000
##YFACTOR=1.000000000000000e-9
##FIRSTY=0.53497344
##DELTAX=2.03961372
##XUNITS=1/CM
##YUNITS=ARBITRARY UNITS
##XYDATA=(X++(Y..Y))
399.8 534973443 530568600 526688576 524093747 523886502 525668859 527623653 528924167 530043840 530970335
418.1 530970335 530590057 529013991 526746273 523859620 521018445 518317938 515379667 512602210 510835230
436.5 510835230 511013448 513763607 518215299 522513032 525936604 528973401 531907260 534051061 534619570
454.8 534619570 533775032 532355845 531046510 529389083 526860476 523513496 519998670 516954124 514069855
473.2 514069855 511080980 508324981 506309867 505511105 505635679 505735755 505400836 504979908 504719496
491.5 504719496 504166961 502767265 500642121 498338073 496208072 494157583 491749495 488576651 484777391
509.9 484777391 480883688 477214307 473464161 469154149 464714050 461180955 459050030 458186507 458123326
528.3 458123326 458387583 459264457 461708575 466074914 471609890 477182716 481861442 485252023 487393975
546.6 487393975 488183528 487398654 485301852 482693285 479898542 476373732 471772432 466308653 460145503
565 460145503 453389913 446738392 441278070 437800467 436806589 438459933 442490846 448444277 455574483
583.3 455574483 462831914 469335079 474539578 478198379 480254084 481009215 481017649 480767459 480582207
601.7 480582207 480565071 480589479 480658144 481273144 482772022 484880835 487261355 490038007 493424207
620 493424207 497371614 501765549 506036222 509469628 512100935 514527738 517056465 519356370 520932376
638.4 520932376 521791697 522485554 523516357 524829745 525958002 526623130 527190506 528242469 529781997
656.8 529781997 531223774 532050252 532476544 532697380 532821357 534374177 536721885 538220227 539558828
675.1 539558828 541468024 543556511 545069456 545916975 546737254 547982514 549231529 549580574 548566341
693.5 548566341 546667695 544638515 542509973 539735913 536321998 533365250 532084882 532679021 534554482
711.8 534554482 537152588 540431678 544771492 550518513 557141483 563413382 568924129 574250937
728.1 574250937 579843521 585174143 589196324 591578424 593041241 594448209 595556200 595208466 592712402
746.5 592712402 588600934 584035933 579639494 575043023 569768488 564274311 559805989 557378709
762.8 557378709 557084739 558480978 561415493 566320479 573638439 582864523 592489600 601128459 608550370
781.2 608550370 615407228 621989012 627648294 631731153 634744048 638113558 642649889 647823393
797.5 647823393 652494431 656173110 659476757 663022935 666477501 669026554 670363426 671052694 671904504
815.8 671904504 672894776 673149943 671952426 669539213 666674554 663548291 659574330 654196620 647765040
834.2 647765040 641343236 635699809 630752742 625977814 621185124 616821408 613295615 610241234
850.5 610241234 606800437 602436006 597487807 593307972 591858149 594515264 601096928 610471427
866.8 610471427 621789157 634211719 645984113 655059576 660479009 662585437 662082970 659279883
883.2 659279883 654179990 647141993 639293492 631931186 625554800 619794011 614110827 608355403
899.5 608355403 602666378 596968889 590708613 583158433 574121118 564150393 553931117 543839574
915.8 543839574 534219980 525728881 519230664 515224516 513409019 512937963 513162136 514113426 516146481
934.1 516146481 519376099 523523629 528045893 532190442 534746110 534273088 529837191 521311164 509346962
952.5 509346962 495082051 479528785 463197351 446138531 428279579 409770072 390935391
966.8 390935391 372014076 353106201 334341764 316107422 299114943 284112126 271630079
981.1 271630079 261892825 254811049 250127375 247511595 246601745 246943444 248025894 249487206 251176685
999.4 251176685 252940297 254500270 255550534 255950153 255874425 255668342 255635351 255953401 256790966 258283556
1019.8 258283556 260403663 263065189 266176015 269539595 272937328 276226491 279199272 281593502
1036.1 281593502 283253819 284262359 284927756 285649925 286719412 288288802 290558726 293823779 298312813
1054.5 298312813 304029763 310914934 318994045 328192204 337841183 345981807 349426001 345980734
1070.8 345980734 337069482 326975971 319350451 315266132 314152330 315169871 317698091 321335793
1087.1 321335793 325845301 331049353 336592972 341872275 346277177 349458456 351376712 352411330
1103.4 352411330 353354186 354999810 357695401 361290008 365352571 369325846 372740954 375433087
1119.8 375433087 377497494 379250228 381274283 384120107 387921214 392189920 395798892 397424817
1136.1 397424817 396222413 392140657 385825723 378316253 370599359 363382757 357139319 352197558
1152.4 352197558 348718911 346667141 345950276 346548438 348565310 352180600 357568920 364849418 373972207
1170.7 373972207 384661943 396533072 409199178 422343075 435652345 448744774 461253881
1185 461253881 472796202 482940465 491314590 497757882 502450585 505787373 508215666 510250807
1201.3 510250807 512363374 514847279 517853379 521522820 525970697 531084597 536466181 541527927
1217.7 541527927 545684099 548612118 550320566 550920367 550540268 549428403 547942042 546437562 545110106
1236 545110106 543969810 542995572 542315125 542234182 543007970 544556618 546507597 548499703 550372779
1254.4 550372779 552119076 553689063 554954708 555974901 557113647 558737159 560868084 563110054
1270.7 563110054 564890563 565860331 566110134 565951645 565571010 564972699 564121544 563064516 561936140
1289 561936140 560808420 559530318 557921588 556037664 554133892 552428007 550879598 549261808 547488272
1307.4 547488272 545845032 544668794 543841004 542945981 541757524 540284932 538499415 536082387 532559454
1325.8 532559454 527842700 522486687 517320871 512946784 509553373 507053018 505404472 504700601
1342.1 504700601 504801393 505284071 505641580 505561590 505112588 504492342 503734827 502737939 501449227 499964952
1362.5 499964952 498657346 497766018 497159004 496808410 496852249 497281313 497872680 498508871 499164850 500130951
1382.9 500130951 502192497 505857170 510011733 513159633 515240133 516335428 516479731 515967131 515071750
1401.2 515071750 513892412 512320042 510577917 508990228 507504821 506075799 504879415 504002631
1417.5 504002631 503423035 503264308 503536820 504039586 504797578 505988836 507479012 509086430 510989368
1435.9 510989368 512922823 514494896 516109407 517702758 518851042 519176602 518680632 517798424 516825497
1454.3 516825497 515423179 513464212 512410700 512776017 514785111 518191516 522378445 528225541
1470.6 528225541 537205756 547173381 555821776 563590705 570998371 578174949 584820867 591361880
1486.9 591361880 598131835 604229808 608767390 612998068 617914915 622410893 625828385 628677547
1503.2 628677547 632065415 636436403 639405489 641315758 643252611 645371258 647684097 649984062
1519.5 649984062 652352214 654163420 655348301 656449199 657493949 658720016 659919322 660601437
1535.8 660601437 661285877 662404954 662876904 662609041 662172854 661744237 661448896 661286592 661216676 661166728
1556.2 661166728 660699069 659041464 657643497 656757832 656010985 655142605 653940022 652904332 652310014
1574.6 652310014 651598275 650481701 649382651 648384094 647485554 646545947 645391762 643948793 642339706
1593 642339706 640650749 638832092 636782765 634391010 631700397 628876805 625992954 622846723 619429350
1611.3 619429350 616081893 612632155 608699143 605365694 602513671 599164128 595742524 592667580
1627.6 592667580 589818001 587461591 585524380 583413124 581516206 580397904 579875171 579849005 580353022
1646 580353022 581156075 582005560 583855271 586839855 588819027 590756953 593683541 597693741 601849556
1664.3 601849556 605425596 609630167 614784896 619415998 624245942 629437387 633949041 638283789
1680.7 638283789 643570483 650338054 655625820 659674704 664001584 668183982 672934711 678072333
1697 678072333 682617307 687163651 690694451 693817973 697023988 699596465 701835394 704073906 706236482
1715.3 706236482 707530856 707003295 705836475 705391705 706220806 707955718 710008740 712049425 714343965
1733.7 714343965 716370821 717856944 719615877 721527576 723389030 725512385 728106141 731271029
1750 731271029 734542131 737370491 740241885 743226826 745905817 748399913 750427186 752136528 753930688
1768.4 753930688 755775213 757535636 758870006 759875894 760973811 762202144 763331771 764350295
1784.7 764350295 765324056 766311407 767480254 768707275 769583285 770315826 771169782 772073984 772888720
1803 772888720 773643613 774454653 775317430 776119351 776760280 777384818 778113246 778865755 779554248 780249238
1823.4 780249238 780996382 781711996 782383204 782854140 783154666 783528209 784014344 784492075 784940302 785397947
1843.8 785397947 785725236 785918832 786152065 786430001 786659300 786836982 787047923 787343025 787660539 787933052
1864.2 787933052 788185537 788481951 788770139 789023161 789284170 789523900 789790988 790154099 790582657 790982842
1884.6 790982842 791297615 791591585 791939974 792337239 792722642 792965651 793041825 793143272 793396652 793712854
1905 793712854 793912172 793945312 793957949 794099271 794372559 794656277 794771671 794768512 794895351 795159340 795392573
1927.5 795392573 795488536 795479655 795520484 795701444 795958519 796140969 796227694 796316266 796504319 796774268 796998739
1949.9 796998739 797121525 797218561 797419846 797754467 798074603 798219204 798277318 798446178 798744261 799023271
1970.3 799023271 799141169 799109221 799124241 799341083 799642205 799810052 799780786 799704611 799779773 800022244
1990.7 800022244 800206780 800150216 799979866 799919724 800017893 800112665 800030589 799764395 799485028 799341381
2011.1 799341381 799252033 799024820 798565984 797953069 797388852 796915531 796468973 796152234 795930445 795667231
2031.5 795667231 795419455 795175433 794780850 794252038 793819249 793603182 793478727 793262839 792932034 792645574
2051.9 792645574 792577803 792693615 792777419 792703629 792561531 792563200 792770147 792998731 793046653 792919338 792822599
2074.3 792822599 792919040 793119729 793214381 793149412 793088496 793191433 793426991 793636024 793698013 793684840 793758154
2096.8 793758154 793979228 794252932 794424117 794478238 794558704 794776499 795038998 795151234 795080841 795011163
2117.1 795011163 795090139 795263469 795357823 795273960 795115232 795106471 795313120 795494735 795450926 795262635 795142114
2139.6 795142114 795231164 795442104 795542598 795446754 795333743 795420945 795686185 795911729 795997381 796070039
2160 796070039 796308637 796729565 797132134 797375023 797605395 798026800 798630238 799242377 799688280 799983740
2180.4 799983740 800337672 800883591 801505029 801985085 802271903 802531183 802946329 803502977 804006577 804314256
2200.8 804314256 804518402 804852486 805401683 805976331 806361794 806594491 806866169 807277143 807762682 808172882
2221.2 808172882 808429718 808628798 808904827 809273839 809640825 809897780 810042083 810187340 810402811 810627878
2241.6 810627878 810818911 810975254 811090052 811239183 811475158 811665833 811729550 811774790 811915636 812169135
2262 812169135 812419236 812531233 812573433 812760413 813097119 813382268 813552499 813698232 813889802 814133942
2282.3 814133942 814362466 814440548 814322174 814100742 813911259 813807309 813675046 813387692 812962294 812517107
2302.7 812517107 812077463 811533451 810847044 810113490 809455812 808846712 808092773 807087004 805957556
2321.1 805957556 805008590 804300368 803574145 802847385 802318811 801880121 801342726 800764501 800280392 800029278
2341.5 800029278 800437450 801951647 803390145 803092778 800994098 798201442 795825362 794231355 793474793
2359.9 793474793 793571413 794387877 795712173 797380030 799292088 801305473 803206146 804932475 806557596
2378.2 806557596 808088422 809399843 810333788 810795307 810856521 810731292 810578227 810393512 810119510
2396.6 810119510 809794962 809504330 809295654 809123874 808841884 808393657 807925820 807564020 807250619 806861162
2417 806861162 806345165 805763543 805229664 804793537 804375112 803847551 803186059 802522480 801974773 801486611
2437.4 801486611 800944865 800326705 799671113 799038529 798475802 797932327 797334075 796690285 796067595 795513988
2457.8 795513988 794985950 794422805 793843627 793281078 792741895 792247951 791786373 791290820 790746093 790207863
2478.1 790207863 789716899 789270163 788834274 788384795 787934840 787493289 787073493 786697447 786352575 786027730
2498.5 786027730 785737038 785457432 785149515 784815550 784495115 784214735 783925056 783573210 783186734 782788992
2518.9 782788992 782374024 781949222 781497657 780982196 780418456 779853761 779289842 778686345 778050184 777429819
2539.3 777429819 776810586 776165783 775518060 774857104 774174631 773516715 772891760 772264242 771628439 771010339
2559.7 771010339 770415008 769824922 769232929 768641710 768055916 767458260 766823232 766182959 765590668 765039563
2580.1 765039563 764524758 764035344 763513088 762972295 762472391 762013018 761564136 761123300 760713875 760315359
2600.5 760315359 759908259 759486794 758999109 758413017 757731915 757016420 756337643 755629063 754773080 753784299
2620.9 753784299 752779186 751808882 750831068 749801934 748708844 747548878 746366560 745246530 744152188
2639.3 744152188 742978215 741751432 740562320 739427209 738306940 737144291 735917985 734718502
2655.6 734718502 733642876 732635260 731564999 730405569 729253590 728232920 727332413 726425529 725449145
2673.9 725449145 724433661 723481119 722634196 721785188 720863461 719922006 719015241 718163133 717343509
2692.3 717343509 716458380 715443254 714395046 713419974 712447822 711377740 710205615 708994508 707859695
2710.7 707859695 706862032 705900073 704851270 703752995 702731669 701835215 700963259 700016141 699053109
2729 699053109 698185503 697428167 696713686 695952356 695109963 694293022 693606555 692965746 692228198 691405654
2749.4 691405654 690625608 689981222 689452708 688925982 688310742 687637389 687019885 686501443 685980380 685348630
2769.8 685348630 684610426 683834493 683093309 682386100 681600988 680659056 679626107 678601086 677587390
2788.2 677587390 676489294 675217390 673835874 672477603 671139657 669711888 668124974 666417658
2804.5 666417658 664679289 662943840 661161065 659256876 657228410 655163944 653136373 651095748
2820.8 651095748 648907602 646521688 644043922 641586721 639117658 636519551 633725762 630765140
2837.1 630765140 627713203 624557018 621180654 617505491 613620222 609784663 606252313 603140116
2853.4 603140116 600368917 597678363 594843149 591776729 588393927 584500015 579994440 575061738
2869.7 575061738 569956660 564795971 559625924 554559469 549811304 545644164 542252839 539634824
2886.1 539634824 537620544 536045134 534849048 534007251 533388197 532772720 531988621 530963600 529745817
2904.4 529745817 528356194 526663184 524510205 521798313 518549025 514992416 511436641 508026719
2920.7 508026719 504835844 502100348 500137985 499088168 498908490 499642611 501417160 504240155 508004665
2939.1 508004665 512496233 517407000 522531033 527819693 533270061 538812101 544294417 549656391
2955.4 549656391 554982364 560331702 565587699 570541620 575093925 579303443 583303630 587237418
2971.7 587237418 591129363 594838381 598374069 601869166 605219424 608233094 610855401 613153398
2988 613153398 615306795 617353320 619112015 620478153 621462286 622133255 622562945 622718334 622572780
3006.4 622572780 622191370 621600866 620746672 619611681 618233621 616648078 614893019 613060713 611201704
3024.7 611201704 609219313 607055426 604803324 602575779 600310147 597908854 595462918 592983723
3041.1 592983723 590368390 587655127 584946036 582284451 579616725 576864302 574082196 571299016
3057.4 571299016 568471849 565694690 563036501 560391486 557623804 554744661 551902771 549160779
3073.7 549160779 546523213 543950438 541284978 538515210 535726547 532897234 530097425 527392328
3090 527392328 524648190 521812141 519036353 516432703 513900161 511279404 508593202 505962849 503404915
3108.4 503404915 500840664 498312891 495919049 493554115 491077065 488444030 485697478 483017623
3124.7 483017623 480520517 478132427 475749463 473346114 470974892 468697876 466429383 464037120
3141 464037120 461604804 459278077 457066506 454957545 452902973 450763017 448502302 446224451 444012612
3159.4 444012612 441914499 439913332 437949151 435971349 433975279 432028770 430154622 428312391
3175.7 428312391 426497847 424709886 422895253 421064526 419309497 417643636 415988594 414318144
3192 414318144 412667423 411039501 409441918 407912195 406441689 404964268 403452009 401948154 400532752
3210.3 400532752 399208456 397891283 396564573 395259321 393984973 392735124 391493857 390274644
3226.7 390274644 389132589 388107330 387117058 385975301 384687901 383464903 382380694 381396621 380495697
3245 380495697 379586309 378564119 377517760 376591086 375739753 374847919 373938620 373096496 372333646 371624529
3265.4 371624529 371000051 370444328 369765878 368917763 368073225 367295474 366544545 365787208 365027785 364319682
3285.8 364319682 363699496 363171309 362659931 362049341 361330509 360551745 359801650 359201908 358742744 358219028
3306.2 358219028 357438356 356462479 355502009 354657829 353865176 353048265 352250576 351559818 350912392 350119323
3326.6 350119323 349184692 348279893 347461641 346759379 346165121 345460802 344549477 343600065 342668086 341810346
3347 341810346 341124445 340357035 339312196 338229179 337327868 336555272 335738927 334913462 334295094 333759606
3367.4 333759606 332946330 331811160 330698371 329859406 329154998 328434557 327691138 326976389 326415181
3385.7 326415181 326111078 325995386 325728893 325102121 324456722 324200630 324141324 323742241 322991371 322397113
3406.1 322397113 322100967 321889848 321651369 321313173 320935339 320682794 320522636 320374370 320334256 320472747
3426.5 320472747 320677280 320811749 321009398 321335912 321474403 321328461 321223110 321336448 321616203 321954191
3446.9 321954191 322233111 322548717 323001087 323505998 324075639 324758828 325361758 325907022 326718688 327688724
3467.3 327688724 328334540 328541934 328746647 329282641 330136448 331028998 331653208 332204998 332955301 333698034
3487.7 333698034 334345341 335105240 335956484 336814672 337683141 338599801 339522243 340205282 340729088 341450870
3508.1 341450870 342434168 343542427 344531029 345305741 346116275 347187787 348458380 349558443 350386560
3526.5 350386560 351260155 352321535 353511363 354792655 355997652 357079953 358367145 359915376
3542.8 359915376 361361831 362469941 363543540 364866465 366302907 367739797 369279712 371012986
3559.1 371012986 372845888 374608248 376373559 378437340 380633354 382710665 384849548 387181282
3575.4 387181282 389659375 392292500 395071775 397902071 400706977 403471738 406281680 409151226
3591.7 409151226 412158042 415357351 418695867 422076583 425416201 428698629 431993067 435493439
3608.1 435493439 439153284 442848116 446515203 450015336 453643262 457528532 461126119 464397281
3624.4 464397281 467713922 471606046 475807130 479576826 483276844 487006754 490648419 494293213
3640.7 494293213 497916102 501423657 505085349 509387851 513643146 517045856 520354569 524188101
3657 524188101 527977586 531318128 534417570 537457049 540497065 543735921 547018766 549966335 552953362
3675.4 552953362 555957496 558708727 561374903 564002872 566699028 569629371 572325349 574367702
3691.7 574367702 576288819 578346610 580382049 582379162 584447086 586387634 588119805 589877725
3708 589877725 591814637 593832076 595630765 597166538 598612249 600010872 601340652 602606595 603843689
3726.4 603843689 605172634 606654465 608266413 609904230 611486971 612800360 613753557 614660800 615940750
3744.7 615940750 617314160 618455946 619616568 620768845 621800840 622800410 623905838 625036597
3761 625036597 626050949 627045751 628061116 629055917 629976571 630816698 631680250 632687092 633756280
3779.4 633756280 634618461 635303915 636043429 636887610 637786448 638638139 639403462 640183508 640916884 641581655
3799.8 641581655 642387688 643222928 643969357 644707799 645389020 646062136 646797299 647594810 648310840 648967087
3820.2 648967087 649653018 650245130 650837600 651461840 652076781 652743399 653480947 654159665 654629350 655015767
3840.6 655015767 655474961 655966401 656439841 656878710 657247603 657762468 658550262 659151196 659553587 659933329
3861 659933329 660369098 660878778 661355615 661815166 662279308 662719011 663202465 663609505 664005637 664517701
3881.4 664517701 665028989 665496528 665813625 666092694 666521192 666891158 667084217 667299926 667694807 668193877
3901.8 668193877 668599606 668890655 669136822 669342518 669552088 669834256 670184076 670548081 670836508 670995355
3922.1 670995355 671127081 671322405 671524763 671747088 672096729 672469020 672669232 672709763 672749400 672949374
3942.5 672949374 673291385 673625588 673883438 674071193 674202800 674338639 674534798 674779654 675040781 675262153
3962.9 675262153 675419867 675552785 675720513 675935566 676141918 676309347 676457584 676635385 676881373 677150905
3983.3 677150905 677360952 677476764 677546382 677647233 677782714 677926421 678114593
3997.6 678114593
##END=$$ End of the data block
