##TITLE=$$ Begin of the data block
##JCAMP-DX=5.00 $$ ACD/SpecManager v 10.08
##SPECTROMETER/DATA SYSTEM=Alpha
##DATE=22 Dec 2014 10:36:42
##DATA TYPE=INFRARED SPECTRUM
##DATA CLASS=XYDATA
##ORIGIN=
##OWNER=
##NPOINTS=1765
##FIRSTX=399.76428223
##LASTX=3997.64306641
##MAXX=3997.64306641
##MINX=399.76428223
##MAXY=0.81543553
##MINY=0.24656853
##XFACTOR=1.0000000000
##YFACTOR=1.000000000000000e-9
##FIRSTY=0.53452283
##DELTAX=2.03961372
##XUNITS=1/CM
##YUNITS=ARBITRARY UNITS
##XYDATA=(X++(Y..Y))
399.8E34522831m672110l924369k646208l73423J673221K125621J645625J349389J089216
$$ 534522831 529850721 525926352 523280144 522906721 524579942 526705563 528351188 529700577 530789793
418.1E30789793m02928k046764k541721k643406k468169k283811k654434l283679k669573
$$ 530789793 530386865 528340101 525798380 523154974 520686805 518402994 515748560 512464881 509795308
436.5E09795308P7903L078044M463196M406333L842055L240884K742886K039254Q38459
$$ 509795308 509873211 512951255 517414451 521820784 525662839 528903723 531646609 533685863 534524322
454.8E34524322n67258j626909j787185j969099k586365l155708l262878l005564k933562
$$ 534524322 533957064 532330155 530542970 528573871 525987506 522831798 519568920 516563356 513629794
473.2E13629794k860427k544403j938462r29475K7359J27256l98458n74052m05013
$$ 513629794 510769367 508224964 506286502 505357027 505384386 505511642 505113184 504539132 504134119
491.5E04134119m47035j065851j961529k300352k094060j959681k290935l129899l783643
$$ 504134119 503687084 502621233 500659704 498359352 496265292 494305611 492014676 488884777 485101134
509.9D85101134l784120l647686l936231m503876m522740l551543k163917r95666j87874
$$ 485101134 481317014 477669328 473733097 469229221 464706481 461154938 458991021 457995355 457807481
528.3D57807481L10123R12965K238243M192532N708128N803436M738927L412157K112508
$$ 457807481 458117604 459030569 461268812 465461344 471169472 476972908 481711835 485123992 487236500
546.6D87236500P49171o73831j947761k676576k912968l424555m544348n645841o326944
$$ 487236500 487985671 487311840 485364079 482687503 479774535 476349980 471805632 466159791 459832847
565D59832847o746560o628186n532354l465742q21978J784087M129290O100774P129699
$$ 459832847 453086287 446458101 440925747 437460005 436638027 438422114 442551404 448652178 455781877
583.3D55781877P059962O333083N180507L787339K224773P60764q7112k72632j43587
$$ 455781877 462841839 469174922 474355429 478142768 480367541 481128305 481041193 480768561 480624974
601.7D80624974k6375J4513J88172O95527J438409K020478K231479K513587L240139
$$ 480624974 480598599 480613112 480801284 481496811 482935220 484955698 487187177 489700764 492940903
620D92940903M151612M740089M476011L489554K608657K368331K449214K259672J597583
$$ 492940903 497092515 501832604 506308615 509798169 512406826 514775157 517224371 519484043 521081626
638.4E21081626Q35598O58989J110792J390338J107216O59585O36875J167000J566231
$$ 521081626 521917224 522576213 523687005 525077343 526184559 526844144 527481019 528648019 530214250
656.8E30214250J315594P45296M75824K28107r775J484871K442598J544714J368523
$$ 530214250 531529844 532275140 532750964 532979071 532969296 534454167 536896765 538441479 539810002
675.1E39810002K013206K199710J553893Q47399Q09968J265645J282811L17216j029015
$$ 539810002 541823208 544022918 545576811 546424210 547234178 548499823 549782634 550099850 549070835
693.5E49070835j866639k103090k302646k858341l333867k834320j213074O34730J893819
$$ 549070835 547204196 545101106 542798460 539940119 536606252 533771932 532558858 533193588 535087407
711.8E35087407K573371L241837M319250N761087O678879O336272N558252N343974
$$ 535087407 537660778 540902615 545221865 550982952 557661831 563998103 569556355 574900329
728.1E74900329N545080N262911M023433K464712J528680J333415J027346l23117k532482
$$ 574900329 580445409 585708320 589731753 592196465 593725145 595058560 596085906 595762789 593230307
746.5E93230307m195988m555762m360676m605889n287051n507767m458309k365172
$$ 593230307 589034319 584478557 580117881 575511992 570224941 564717174 560258865 557893693
762.8E57893693k48253J369655K875149M904509P345140R236932R674132Q684396P394851
$$ 557893693 557645440 559015095 561890244 566794753 574139893 583376825 593050957 601735353 609130204
781.2F09130204O787300O557345N713403M168869L054440L305733M428148N113423
$$ 609130204 615917504 622474849 628188252 632357121 635411561 638717294 643145442 648258865
797.5F48258865M672766L700077L332615L651202L553927K491533J183630N08010P18772
$$ 648258865 652931631 656631708 659964323 663615525 667169452 669660985 670844615 671352625 672071397
815.8F72071397J008332L12746j163006k346099k790808l150225m170835n545378o406843
$$ 672071397 673079729 673392475 672229469 669883370 667092562 663942337 659771502 654226124 647819281
834.2F47819281o346763n590677m908264m769623m810452m404068l556490l064692
$$ 647819281 641472518 635881841 630973577 626203954 621393502 616989434 613432944 610368252
850.5F10368252l440976m317463m889309m147887j411617K682328O579220R349883
$$ 610368252 606927276 602609813 597720504 593572617 592161000 594843328 601422548 610772431
866.8F10772431J1259377J2381494J1787295R105444N405903K028287n82278k844811
$$ 610772431 622031808 634413302 646200597 655306041 660711944 662740231 662157953 659313142
883.2F59313142n145192p081210p859350p345855o372690n822838n747139n734265
$$ 659313142 654167950 647086740 639227390 631881535 625508845 619686007 613938868 608204603
899.5F08204603n632043n690038o326437p629692r059370r972572j0232866j0073066
$$ 608204603 602572560 596882522 590556085 582926393 573867023 563894451 553661585 543588519
915.8E43588519r576440q460939o479561l998995j838624n13614J85371R25124K037167
$$ 543588519 534012079 525551140 519071579 515072584 513233960 512720346 512905717 513830841 515868008
934.1E15868008L273428M186809M490554M081190K541601m55558m428804q514702j1965394
$$ 515868008 519141436 523328245 527818799 531899989 534441590 533986032 529557228 521042526 509077132
952.5E09077132j4310360j5566349j6280502j7026604j7875045j8540770j8865973
$$ 509077132 494766772 479200423 462919921 445893317 428018272 409477502 390611529
966.8C90611529j8930047j8866390j8681705j8165321j6990870j5020340j2459875
$$ 390611529 371681482 352815092 334133387 315968066 298977196 283956856 271496981
981.1B71496981r709894p080466m673451k578199q86440L35157J062691J443282J693353
$$ 271496981 261787087 254706621 250033170 247454971 246568531 246903688 247966379 249409661 251103014
999.4B51103014J791209J580894J053482L89963j15066k52247k1637L96252Q85010
$$ 251103014 252894223 254475117 255528599 255918562 255803496 255551249 255529612 255925864 256810874
1017.8B56810874J430690K050102K682060L151059L364712L375560L267795K983481
$$ 256810874 258241564 260291666 262973726 266124785 269489497 272865057 276132852 279116333
1034.1B79116333K438098J673549R46283N97895P07149J081526J590372K315342L319144
$$ 279116333 281554431 283227980 284174263 284772158 285479307 286560833 288151205 290466547 293785691
1052.4B93785691M482955N683333O893098Q077532R178877R650737Q128345L402203
$$ 293785691 298268646 303951979 310845077 318922609 328101486 337752223 345880568 349282771
1068.8C49282771l466904q886874j0062724p615685m082173j106441J038163K531916
$$ 349282771 345815867 336928993 326866269 319250584 315168411 314061970 315100133 317632049
1085.1C17632049L603936M487246N195021N516828N269974M416525L187269J954765
$$ 317632049 321235985 325723231 330918252 336435080 341705054 346121579 349308848 351263613
1101.4C51263613J100748R46969J586557K671420L616721M061728L942162L408641
$$ 351263613 352364361 353311330 354897887 357569307 361186028 365247756 369189918 372598559
1117.7C72598559K688437K052009J782388K055913K855212L825277M257977L557473
$$ 372598559 375286996 377339005 379121393 381177306 384032518 387857795 392115772 395673245
1134C95673245J630604j174390m108906o344109p502109p697970p196247o212742m913210
$$ 395673245 397303849 396129459 392020553 385676444 378174335 370476365 363280118 357067376 352154166
1152.4C52154166l474147k040535o77526O31511K020121L605425N387038P267565R076983
$$ 352154166 348680019 346639484 345961958 346593469 348613590 352219015 357606053 364873618 373950601
1170.7C73950601J0644763J1863709J2658149J3109624J3321072J3173282J2550801
$$ 373950601 384595364 396459073 409117222 422226846 435547918 448721200 461272001
1185D61272001J1499316J0083824Q350313O478727M725873L322363K444863K103985
$$ 461272001 472771317 482855141 491205454 497684181 502410054 505732417 508177280 510281265
1201.3E10281265K144813K452374K978384L661156M429042N083859N356074N045056
$$ 510281265 512426078 514878452 517856836 521517992 525947034 531030893 536386967 541432023
1217.7E41432023M149675K945483J725972O10649l55303j092434j483023j503050j328051
$$ 541432023 545581698 548527181 550253153 550863802 550508499 549416065 547933042 546429992 545101941
1236E45101941j156807r89199o70850n3168Q00550J554370J944006J983225J858115
$$ 545101941 543945134 542955935 542285085 542231917 543032467 544586837 546530843 548514068 550372183
1254.4E50372183J722932J547635J265049J030564J148999J640200K150774K244771
$$ 550372183 552095115 553642750 554907799 555938363 557087362 558727562 560878336 563123107
1270.7E63123107J758993R67323K72513j53363l94344o12855q55565j049280j120568
$$ 563123107 564882100 565849423 566121936 565968573 565574229 564961374 564105809 563056529 561935961
1289E61935961j111030j253546j603961j889050j881778j661837j535475j642347j785099
$$ 561935961 560824931 559571385 557967424 556078374 554196596 552534759 550999284 549356937 547571838
1307.4E47571838j650334j209497q53360q95500j194298j483858j784384k401888l489256
$$ 547571838 545921504 544712007 543858647 542963147 541768849 540284991 538500607 536098719 532609463
1325.8E32609463m679740n344987n160808m368305l414572k507448j604259o77526
$$ 532609463 527929723 522584736 517423928 513055623 509641051 507133603 505529344 504851818
1342.1E04851818P1228M48465L47257p3851m39882o21795p58470r90212j275658j491308
$$ 504851818 504923046 505371511 505718768 505644917 505205035 504583240 503824770 502834558 501558900 500067592
1362.5E00067592j349479r19372o08713l49849M1574M43429O23524O40124O36816R63658
$$ 500067592 498718113 497798741 497190028 496840179 496881753 497325182 497948706 498588830 499225646 500189304
1382.9E00189304K032638L608346M161835L179133K050519J034140J43171m39346q55446
$$ 500189304 502221942 505830288 509992123 513171256 515221775 516255915 516399086 515959740 515104294
1401.2E15104294j224995j605570j704693j538217j459658j422227j220882r25719
$$ 515104294 513879299 512273729 510569036 509030819 507571161 506148934 504928052 504002333
1417.5E04002333n84305j29103K93314N24819P58410J168668J476824J600862J901924
$$ 504002333 503418028 503288925 503582239 504107058 504865468 506034136 507510960 509111822 511013746
1435.9E11013746J956463J606763J657128J612842J122534L25203m69208q93235j024484
$$ 511013746 512970209 514576972 516234100 517846942 518969476 519294679 518825471 517932236 516907752
1454.3E16907752j480818j982928j014649L86893K019585L435492M214466N830347
$$ 516907752 515426934 513444006 512429357 512816250 514835835 518271327 522485793 528316140
1470.6E28316140Q929849R958148Q682489P802248P436753P209897O664097O524503
$$ 528316140 537245989 547204137 555886626 563688874 571125627 578335524 584999621 591524124
1486.9E91524124O735087O090939M553258M227161M887343M494011L472686K890587
$$ 591524124 598259211 604350150 608903408 613130569 618017912 622511923 625984609 628875196
1503.2F28875196L344476M296839K983392J952409J977385K132237K269089K241194
$$ 628875196 632219672 636516511 639499903 641452312 643429697 645561934 647831023 650072217
1519.5F50072217K361000J851916J215458J141131J098752J234352J173020O60419
$$ 650072217 652433217 654285133 655500591 656641722 657740474 658974826 660147846 660808265
1535.8F60808265O02424J005888N40257j37806l71516m00185l02554k08258j07765
$$ 660808265 661410689 662416577 662956834 662819028 662447512 662047327 661744773 661536515 661428750
1554.2F61428750r3759n65767j610219j273930q53420p66873q80182j177907j004398
$$ 661428750 661334991 660769224 659159005 657885075 657031655 656264782 655384600 654206693 653202295
1572.6F53202295n81622o85334j075923j086653j024902r35495r46283j134097j426042
$$ 653202295 652620673 651935339 650859416 649772763 648747861 647812366 646866083 645731986 644305944
1590.9F44305944j627683j737535j840830k032220k375782k706051k844155k878844
$$ 644305944 642678261 640940726 639099896 637067676 634691894 631985843 629141688 626262844
1607.2F26262844l129840l388226l337503l500342l960312l296673k837956l339827
$$ 626262844 623133004 619744778 616407275 612906933 608946621 605649948 602811992 599472165
1623.5E99472165l366947l034294k840757k321065j898646k076387j813591j071691
$$ 599472165 596105218 593070924 590230167 587909102 586010456 583934069 582120478 581048787
1639.9E81048787n61297j10686M19676P92325Q82029J821161K999007K122045K048254
$$ 581048787 580487490 580376804 580796480 581588805 582470834 584291995 587291002 589413047 591461301
1658.2E91461301K970338M023552M182338L595710M179239N121112M634857M850567
$$ 591461301 594431639 598455191 602637529 606233239 610412478 615533590 620168447 625019014
1674.5F25019014N210876M491806M274309N235195O759346N295455M051745M343093
$$ 625019014 630229890 634721696 638996005 644231200 650990546 656286001 660337746 664680839
1690.9F64680839M203617M738271N089999M505455M543662L533662L115415L219485
$$ 664680839 668884456 673622727 678712726 683218181 687761843 691295505 694410920 697630405
1707.2F97630405K587140K215862K180934K101422J288771m73499j131535m27663Q57711
$$ 697630405 700217545 702433407 704614341 706715763 708004534 707531035 706399500 705971837 706829548
1725.5G06829548J750350K020717J967430K239644K053976J522362J751185J878202
$$ 706829548 708579898 710600615 712568045 714807689 716861665 718384027 720135212 722013414
1741.9G22013414J829386K116084K609074L147423L247142K866209K913653K975345
$$ 722013414 723842800 725958884 728567958 731715381 734962523 737828732 740742385 743717730
1758.2G43717730K669334K528012K048493J690089J760960J802564J743376J369417
$$ 743717730 746387064 748915076 750963569 752653658 754414618 756217182 757960558 759329975
1774.5G59329975J039385J099229J216293J136958J028657R73284R73940J134575J222133
$$ 759329975 760369360 761468589 762684882 763821840 764850497 765823781 766797721 767932296 769154429
1792.8G69154429R04084P36236Q42214R09865Q32438P74861Q28206Q62539Q16882O87182
$$ 769154429 770058513 770794749 771636963 772546828 773379266 774154127 774982333 775844872 776661754 777348936
1813.2G77348936O52551P14541P25388O87123P04765P27653O77944O47485M89712L56972
$$ 777348936 778001487 778716028 779441416 780128539 780833304 781560957 782238901 782886386 783376098 783733070
1833.6G83733070M21107M82142M36842M28856M71115L31282J86563K40505K79665K15053
$$ 783733070 784154177 784636319 785073161 785502017 785973132 786304414 786490977 786731482 787011147 787226200
1854G87226200J75953K28107L25620L45707K65122K04324K73884L37958K97248K64824
$$ 787226200 787402153 787630260 787955880 788301587 788566709 788771033 789044917 789382875 789680123 789944947
1874.4G89944947K36690K54988L43800M41969M33743L18110K69830L27348L87013L80159
$$ 789944947 790181637 790436625 790780425 791222394 791656137 791974247 792244077 792571425 792958438 793338597
1894.8G93338597K43127R7871J35899K47359K66433J68204N7459N8114J56224K56717
$$ 793338597 793581724 793679595 793815494 794062853 794329286 794497490 794554949 794613063 794769287 795026004
1915.2G95026004K70605J26541J0014J23739K68102K57313J18613j788M1127J96695
$$ 795026004 795296609 795423150 795433164 795556903 795825005 796082318 796200931 796199143 796240270 796436965
1935.6G96436965K86460J94312O0737M4524J85371L04699K39491J15156Q3328J86622
$$ 796436965 796723425 796917737 796978474 797022998 797208369 797513068 797752559 797867715 797951043 798137665
1956G98137665L37720L42369J57714L7789J50740L13401K73467Q8155k8670L2604K21431
$$ 798137665 798475385 798817754 798975468 799013257 799163997 799477398 799750865 799839020 799810350 799842954 800064385
1978.5H00064385L15070J82152k6941p6414P6890K50102J91628l3736j37985o3061
$$ 800064385 800379455 800561607 800534666 800458252 800535142 800785244 800976872 800943136 800805151 800742090
1998.8H00742090O8664R0242o0559k43842k69890j56105q7082k05040m55856o22750
$$ 800742090 800810754 800900996 800840437 800596595 800326705 800170600 800083518 799878478 799422622 798799872
2019.2G98799872n73098m92156m74810l22521j97530k23398k25246k75970m28676n11229
$$ 798799872 798226774 797734618 797259808 796937287 796739757 796516359 796291113 796015143 795586467 795075238
2039.6G95075238m04299k17258j48476k40028l18646k44379n3465J11699R5725p3314
$$ 795075238 794670939 794453681 794305205 794065177 793746531 793502152 793448687 793560386 793656111 793582797
2060G93582797j50561R596K05755K05338L7253j02520p2717P8439J67191R7454k3723
$$ 793582797 793432236 793441832 793647587 793852925 793890178 793787658 793714941 793793380 793960571 794058025 794034302
2082.5G94034302m2379Q7321K35140K16604N7995j3232R9838K65598K86341J31666
$$ 794034302 793991923 794079244 794314384 794530988 794588983 794575751 794675589 794941187 795227528 795359194
2102.9G95359194p15N9247K21074K51233J20342k5094m0113Q8751J78814Q0406j01804
$$ 795359194 795358479 795417726 795638800 795890033 796010375 795985281 795945168 796033919 796212733 796293139 796191335
2125.3G96191335j46389K503J72377J45137m6372j60993p5161J13964K05279P8558
$$ 796191335 796044946 796047449 796219826 796364963 796318591 796157598 796082437 796196401 796401680 796480238
2145.7G96480238j12414j00672J07407K60055K02775N7459N1439K41995M41015M39286
$$ 796480238 796367824 796267152 796374559 796634614 796837389 796894848 796946287 797188282 797629297 798068583
2166.1G98068583K78473K27272M04180O01172O16670M50313L06904L67105N27144N98132
$$ 798068583 798347056 798574328 798978508 799579680 800196350 800646663 800953567 801320672 801847816 802445948
2186.5H02445948N11766L29375K44558L72946N40853N12123L22342K27034L34739N12421
$$ 802445948 802957714 803287089 803531647 803904593 804445446 804957569 805279911 805506945 805841684 806354105
2206.9H06354105N63443M19021K69174K88964M12762M79340L90232K50995K31981L12686
$$ 806354105 806917548 807336569 807605743 807894707 808307469 808786809 809177041 809428036 809660017 809972703
2227.3H09972703L74973L26038J86681J20283J90615K74360K62857J84476J00732P8440
$$ 809972703 810347676 810673714 810860395 810980678 811171293 811445653 811708510 811892986 811993718 812072158
2247.7H12072158J65284K41756J80662P9929P4685J63674K58923K28226Q3924L5822
$$ 812072158 812237442 812479198 812659860 812739789 812814474 812978148 813237071 813465297 813549221 813585043
2268.1H13585043J78277L01362K49564J68622J85787K43903K66134K11060M5777j59502
$$ 813585043 813763320 814064682 814314246 814482868 814668655 814912558 815178692 815389752 815435529 815276027
2288.5H15276027k55645j93059q4400j00136k74241m61996m92632m67241n73158p19130
$$ 815276027 815020382 814827323 814742923 814642787 814368546 813906550 813413918 812946677 812373519 811654389
2308.9H11654389p92861p45654o35147p27952j040458j215160j032770p76053p52568
$$ 811654389 810861528 810115874 809480727 808752775 807712317 806497157 805464387 804688334 803935766
2327.2H03935766p43806n07653l40581m74393n76914m99367l12031L82007J615226
$$ 803935766 803191960 802684307 802343726 801869333 801292419 800793052 800481021 800863028 802478254
2345.6H02478254J538396l10540k211094k934099k498269j665830p29382Q7916P45535
$$ 802478254 804016650 803706110 801495016 798560917 796062648 794396818 793667436 793755352 794500887
2363.9G94500887J408279J884163K080142K137482K015353J786887J665175J602352
$$ 794500887 795909166 797793329 799873471 802010953 804026306 805813193 807478368 809080720
2380.2H09080720J376986R72271M99607Q7499j27077j60754j82271k51233k92003k76268
$$ 809080720 810457706 811429977 811929584 812017083 811890006 811729252 811546981 811295748 811003745 810727477
2400.6H10727477k09093j59383k70307m63068m73559l51250l13998l96251n38409o11007
$$ 810727477 810518384 810359001 810088694 809625626 809152067 808800817 808486819 808090568 807552159 806941152
2421H06941152n41449m33087m19617n14269o46591o81281n60820m87864n64874o42836
$$ 806941152 806399703 805966616 805546999 805032730 804386139 803704858 803144038 802656174 802091300 801448464
2441.4H01448464o72578o39558n40078n12600n76854o21318o05405n61774n41269n61536
$$ 801448464 800775886 800136328 799596250 799083650 798506796 797885478 797280073 796718299 796177030 795615494
2461.8G95615494n77152n57482n31852m89235m43220m70936n40197n53251n16235m66109
$$ 795615494 795038342 794480860 793949008 793459773 793016553 792545617 792005420 791452169 790935934 790469825
2482.2G90469825m43518m74334m75347m22299l78191l48091l33488l32773l04758k95699
$$ 790469825 790026307 789551973 789076626 788654327 788276136 787928045 787594557 787261784 786957026 786661327
2502.6G86661327l33130l26336k71559k50339k88367l61264m21584m35471m12703l95775
$$ 786661327 786328197 786001861 785730302 785479963 785191596 784830332 784408748 783973277 783560574 783164799
2523G83164799m49717n51402n73814n10156n00083n91994o72936o65069n99503n66662
$$ 783164799 782715082 782163680 781589866 781079710 780579627 779987633 779314697 778649628 778050125 777483463
2543.4G77483463o10292o79910p08997o53207n97358o33300o57677o03318n61059n84841
$$ 777483463 776873171 776193261 775484264 774831057 774233699 773600399 772942722 772339404 771778345 771193504
2563.8G71193504o28590o33121o06477n96166n97536n88537n75423n60760n28157n13017
$$ 771193504 770564914 769931793 769325316 768729150 768131614 767543077 766967654 766406894 765878737 765365720
2584.2G65365720n25832n20289n03540m60029m03106m02630m46856m73320m43101m20094
$$ 765365720 764839888 764319599 763816059 763356030 762952924 762550294 762103438 761630118 761187017 760766923
2604.6G60766923m77850n84722o91115p27117o83725o96719q21471r48012r76026r57012
$$ 760766923 760289073 759704351 759013236 758286119 757602394 756905675 756084204 755136192 754160166 753203154
2625G53203154r98319j067996j111567j150429j147807j116931j148283j204968j227140
$$ 753203154 752204835 751136839 750025272 748874843 747727036 746610105 745461822 744256854 743029714
2643.4G43029714j186848j109242j102984j165927j200616j164556j065612r97245
$$ 743029714 741842866 740733624 739630640 738464713 737264097 736099541 735033929 734036684
2659.7G34036684j070023j175165j147985j029372r45211r44853r97424j008212r17614
$$ 734036684 732966661 731791496 730643511 729614139 728668928 727724075 726726651 725718439 724800825
2678G24800825q47101q67903r13084r30190q96573q40485q34942r26137j025617j018882
$$ 724800825 723953724 723085821 722172737 721242547 720345974 719505489 718670547 717744410 716718793 715699911
2698.4G15699911r60112r79483j074373j170040j198947j102805r91285j015425j095831
$$ 715699911 714739799 713760316 712685943 711515903 710316956 709214151 708222866 707207441 706111610
2716.8G06111610j093328j002133q74996q20160r07600r91642r06110p40826o90997
$$ 706111610 705018282 704016149 703141153 702320993 701413393 700421751 699515641 698774815 698083818
2735.1F98083818p59482q25704q16762p47800p03394p14720p40408p41363o71804n59926
$$ 698083818 697324336 696498632 695681870 694934070 694230676 693515956 692775548 692034185 691362381 690802455
2755.5F90802455n43296o22750o62565o21557n36680n14269o19293p35700p66098p18653
$$ 690802455 690259159 689636409 688973844 688352287 687815607 687301338 686682045 685946345 685180247 684461594
2775.9F84461594o94812q10086r84431j048505j013339j008629j106382j286089j391053
$$ 684461594 683766782 682956696 681972265 680923760 679910421 678901792 677795410 676509321 675118268
2794.3F75118268j351119j310408j398325j586914j737892j773537j726686j714170
$$ 675118268 673767149 672456741 671058416 669471502 667733610 665960073 664233387 662519217
2810.6F62519217j852096k051591k120495k072752k076328k208769k389550k472520
$$ 662519217 660667121 658615530 656495035 654422283 652345955 650137186 647747636 645275116
2826.9F45275116k453625k474845k608418k802611k962887l041386l139019l378928
$$ 645275116 642821491 640346646 637738228 634935617 631972730 628931344 625792325 622413397
2843.2F22413397l706277l908932l828108l525555l148377k838910k725899k806544
$$ 622413397 618707120 614798188 610970080 607444525 604296148 601457238 598731339 595924795
2859.5E95924795l028632l409445l949761m530907m954398n140662n195498n189061
$$ 595924795 592896163 589486718 585536957 581006050 576051652 570910990 565715492 560526431
2875.9E60526431n068601m735946m143894l403485k683997k093077j633465j199663
$$ 560526431 555457830 550721884 546577990 543174505 540490508 538397431 536763966 535564303
2892.2E35564303p75933n56648o36220q33094r99152j157701j380802j720786k180874
$$ 535564303 534788370 534231722 533595502 532762408 531763256 530605555 529224753 527503967 525323093
2910.5E25323093k721787l251791l559887l562570l425479l190994k748072k048373
$$ 525323093 522601306 519349515 515789628 512227058 508801579 505610585 502862513 500814140
2926.8E00814140j163066j96725P89851J804054K852321L782808M482389M924178N140662
$$ 500814140 499651074 499454349 500244200 502048254 504900575 508683383 513165772 518089950 523230612
2945.2E23230612N305171N482078N558312N493641N404174N382717N370915N246281
$$ 523230612 528535783 534017861 539576173 545069814 550473988 555856705 561227620 566473901
2961.5E66473901M964412M579961M245639M076123M006267L888905L681182L560901
$$ 566473901 571438313 576018274 580263913 584340036 588346303 592235208 595916390 599477291
2977.8E99477291L553450L390491L037215K680718K408207K232134K016723J668990
$$ 599477291 603030741 606421232 609458447 612139165 614547372 616779506 618796229 620465219
2994.2F20465219J333833J019418O75619M08172J82450r5487l58879n81324q30829
$$ 620465219 621799052 622818470 623494089 623902261 624084711 623989224 623630345 623049021 622218192
3012.5F22218192j101196j344621j546204j720787j834452j892566j992405k115190
$$ 622218192 621116996 619772375 618226171 616505384 614670932 612778366 610785961 608670771
3028.8F08670771k197325k258837k364755k469122k461851k457440k578199k702653
$$ 608670771 606473446 604214609 601849854 599380732 596918881 594461441 591883242 589180589
3045.1E89180589k679587k593934k668143k823054k851487k825677k803147k738654
$$ 589180589 586501002 583907068 581238925 578415871 575564384 572738707 569935560 567196906
3061.5E67196906k669335k651334k741873k869665k882541k786100k635061k561510
$$ 567196906 564527571 561876237 559134364 556264699 553382158 550596058 547960997 545399487
3077.8E45399487k674282k795219k833962k861619k806306k717078k766430k841354
$$ 545399487 542725205 539929986 537096024 534234405 531428099 528711021 525944591 523103237
3094.1E23103237k756357k599001k576947k687693k704263k599358k552033k580046
$$ 523103237 520346880 517747879 515170932 512483239 509778976 507179618 504627585 502047539
3110.4E02047539k502471k358973k364964k478152k658546k819926k740174k519191
$$ 502047539 499545068 497186095 494821131 492342979 489684433 486864507 484124333 481605142
3126.7D81605142k392292k404689k456069k394230k251058k256215k415538k449483
$$ 481605142 479212850 476808161 474352092 471957862 469706804 467450589 465035051 462585568
3143D62585568k333015k243697k142311k030253k086014k263993k318382k236545k135396
$$ 462585568 460252553 458008856 455866545 453836292 451750278 449486285 447167903 444931358 442795962
3161.4D42795962k069652k043903k024174k006948j949220j851440j810282j835585
$$ 442795962 440726310 438682407 436658233 434651285 432702065 430850625 429040343 427204758
3177.7D27204758j845360j818389j788526j763046j722366j662791j626342j636714
$$ 427204758 425359398 423541009 421752483 419989437 418267071 416604280 414977938 413341224
3194D13341224j641840j605808j548112j485705j471281j497269j493424j422763j344770
$$ 413341224 411699384 410093576 408545464 407059759 405588478 404091209 402597785 401175022 399830252
3212.4C99830252j310557j276642j288891j333237j321226j277685j215726j117945
$$ 399830252 398519695 397243053 395954162 394620925 393299699 392022014 390806288 389688343
3228.7C89688343j021892j012534j148224j283049j237542j095295r70989q87990r18240
$$ 389688343 388666451 387653917 386505693 385222644 383985102 382889807 381918818 381030828 380112588
3247.1C80112588j046955j053572q92490q28356r10997r24706q47727p99448p68602
$$ 380112588 379065633 378012061 377119571 376291215 375380218 374455512 373607785 372808337 372039735
3265.4C72039735o55442n45532o59227q55207r01908q79526q34227p56323o85215o36131
$$ 372039735 371384293 370838761 370179534 369324327 368422419 367542893 366708666 365952343 365267128 364630997
3285.8C64630997o10173n61267n23984o16700p55131p89881p26044n84721m60655n38468
$$ 364630997 364020824 363459557 362935573 362318873 361563742 360773861 360047817 359463096 359002441 358463973
3306.2C58463973q05497j014620r92626q65490p93993p59333p19250o46054o53804
$$ 358463973 357658476 356643856 355651230 354785740 353991747 353232414 352513164 351867110 351213306
3324.6C51213306q55893r87142q90940q03143p20680o03139p06256r29952r82493r20206
$$ 351213306 350357413 349370271 348479331 347676188 346955508 346352369 345646113 344716161 343733668 342813462
3345C42813462p92205o64920p99745j069159j059293q55238p69496q31425q66413o97523
$$ 342813462 342021257 341356337 340556592 339487433 338428140 337572902 336803406 335971981 335105568 334408045
3365.4C34408045n56708p74562j100898j093775q59618p20024o65754o96719p44104
$$ 334408045 333851337 333076775 331975877 330882102 330022484 329302460 328636706 327939987 327195883
3383.7C27195883o16729l32773j16885k80559o43820o18696k41786r7156l99380o82951
$$ 327195883 326579154 326246381 326129496 325848937 325205117 324586421 324344635 324247479 323848099 323165148
3404.1C23165148n54382l47823k86043k40862k79546l24428k47240j91689j63853l6836
$$ 323165148 322610766 322262943 321976900 321736038 321456492 321132064 320884824 320693135 320529282 320492446
3424.5C20492446J18256J73241J43170K13772L07232J32531j41918j41591J00970L52472
$$ 320492446 320610702 320783943 320927113 321140885 321448117 321580648 321438730 321297139 321398109 321750581
3444.9C21750581M31001L28690K90215L50535M35174N96881P33256O39319N70417Q01205
$$ 321750581 322181582 322510272 322800487 323151022 323586196 324183077 324916333 325555652 326126069 326927274
3465.3C26927274R35823O21677K04563K31057N91934Q77589Q28236N22852M92543P55787
$$ 326927274 327863097 328484774 328689337 328920394 329512328 330389917 331218153 331741005 332233548 332989335
3485.7C32989335P81238O54668P46786R20624R70334Q84086Q39710Q50081P10190O04778
$$ 332989335 333770573 334425241 335172027 336092651 337062985 337947071 338786781 339636862 340347052 340951830
3506.1C40951830P36177R35644J080543J011699P83026P81745J065552J317859J163215
$$ 340951830 341688007 342623651 343704194 344715893 345498919 346280664 347346216 348664075 349827290
3524.4C49827290Q24421Q10594J045197J225710J296788J208008J096159J297205J552195
$$ 349827290 350651711 351462305 352507502 353733212 355030000 356238008 357334167 358631372 360183567
3542.8C60183567J441955J096875J098305J367420J432121J440197J598060J762807
$$ 360183567 361625522 362722397 363820702 365188122 366620243 368060440 369658500 371421307
3559.1C71421307J781047J696646J794428K180278K283722K103180K136737K314269
$$ 371421307 373202354 374899000 376693428 378873706 381157428 383260608 385397345 387711614
3575.4C87711614K439261K596229K799481K876282K811551K778888K847910K880007
$$ 387711614 390150875 392747104 395546585 398422867 401234418 404013306 406861216 409741223
3591.7D09741223L002256L230810L396064L384501L295630L260851L321856L566414
$$ 409741223 412743479 415974289 419370353 422754854 426050484 429311335 432633191 436199605
3608.1D36199605L702879L674955L669142L572733L662139L840714L557414L229946
$$ 436199605 439902484 443577439 447246581 450819314 454481453 458322167 461879581 465109527
3624.4D65109527L244907L874630M321247L886759L728151L737689L687441L693700
$$ 465109527 468354434 472229064 476550311 480437070 484165221 487902910 491590351 495284051
3640.7D95284051L632664L480763L632426M303515M272759L414810L316700L813267
$$ 495284051 498916715 502397478 506029904 510333419 514606178 518020988 521337688 525150955
3657E25150955L755033L334284L115177L078162L050745L187656L290713L019571L028334
$$ 525150955 528905988 532240272 535355449 538433611 541484356 544672012 547962725 550982296 554010630
3675.4E54010630K982139K688408K660811K700865K723694K840102K591491K085089
$$ 554010630 556992769 559681177 562341988 565042853 567766547 570606649 573198140 575283229
3691.7E75283229K020657K082646K039910K014994K040446J935601J805365J795829
$$ 575283229 577303886 579386532 581426442 583441436 585481882 587417483 589222848 591018677
3708E91018677J889407J978636J801074J518011J405656J403213J387179J328289J250386
$$ 591018677 592908084 594886720 596687794 598205805 599611461 601014674 602401853 603730142 604980528
3726.4F04980528J262904J406967J580954J623332J604379J376628R79841Q66234J237214
$$ 604980528 606243432 607650399 609231353 610854685 612459064 613835692 614815533 615681767 616918981
3744.7F16918981J380801J126886J171231J250446J122594J048326J117051J141548
$$ 616918981 618299782 619426668 620597899 621848345 622970939 624019265 625136316 626277864
3761F26277864J015305R37045R28998R77516J028896R71377R13083R89854J048506
$$ 626277864 627293169 628230214 629159212 630136728 631165624 632137001 633050084 634039938 635088444
3779.4F35088444Q77201P14958P32303P87675Q45075Q57413Q13543Q16942P83503O86109
$$ 635088444 635965645 636680603 637412906 638200581 639045656 639903069 640716612 641533554 642317057 643003166
3799.8F43003166O69181P08401Q05199Q46446P05361O36459O65307P25806O83546O85453
$$ 643003166 643672347 644380748 645185947 646032393 646737754 647374213 648039520 648765326 649448872 650134325
3820.2F50134325P81953O54579N78641N68927N61654O67513P57456O81281M85718L93033
$$ 650134325 650916278 651570857 652149498 652718425 653280079 653947592 654705048 655386329 655872047 656265080
3840.6F56265080M81188N79357N23806L79562K95818M51327P68482P28548N23567L88980
$$ 656265080 656746268 657325625 657849431 658228993 658524811 658976138 659744620 660473168 660996735 661385715
3861F61385715L92616M55379M09007M50135N28574M72188M84228M49836M20094M57942
$$ 661385715 661778331 662233710 662642717 663092852 663621426 664093614 664577842 665027678 665447772 665905714
3881.4F65905714M67062M38452K71082K96116N02407L76046J98781K95282L96490L88503
$$ 665905714 666372776 666811228 667082310 667378426 667880833 668256879 668455660 668750942 669147432 669535935
3901.8F69535935L52561L06487K75791K72870K80380K94567L04579K83778K47896J86145
$$ 669535935 669888496 670194983 670470774 670743644 671024024 671318591 671623170 671906948 672154844 672340989
3922.1F72340989J27733J24276J80065L08633M47631L69072J30951N5254J86503K93731
$$ 672340989 672468722 672592998 672773063 673081696 673529327 673898399 674029350 674084604 674271107 674564838
3942.5F74564838K71738K53201K67207K29001J20104R4294K04027K47121K21967K42055
$$ 674564838 674836576 675089777 675356984 675585985 675706089 675800383 676004410 676251531 676473498 676715553
3962.9F76715553K41458J85311J18911R7454J63078K32160J93715J36078K03967K77162
$$ 676715553 676957011 677142322 677261233 677358687 677521765 677753925 677947640 678083718 678287685 678564847
3983.3F78564847K11656J09136Q7917J19686J18553J47522K64108
$$ 678564847 678776503 678885639 678973556 679093242 679211795 679359317 679623425
3997.6F79623425
$$ 679623425
##END=$$ End of the data block
