##TITLE=$$ Begin of the data block
##JCAMP-DX=5.00 $$ ACD/SpecManager v 10.08
##SPECTROMETER/DATA SYSTEM=Alpha
##DATE=22 Dec 2014 10:36:42
##DATA TYPE=INFRARED SPECTRUM
##DATA CLASS=XYDATA
##ORIGIN=
##OWNER=
##NPOINTS=1765
##FIRSTX=399.76428223
##LASTX=3997.64306641
##MAXX=3997.64306641
##MINX=399.76428223
##MAXY=0.81720048
##MINY=0.24708572
##XFACTOR=1.0000000000
##YFACTOR=1.000000000000000e-9
##FIRSTY=0.53838605
##DELTAX=2.03961372
##XUNITS=1/CM
##YUNITS=ARBITRARY UNITS
##XYDATA=(X++(Y..Y))
399.8E38386047n636871m616797k474904J20163J951098K279699J692057J338005J282752
418.1E34321249j7405k079487l183842l385305k904177k398193k326428k731443k456427
436.5E12838542j57833K883852M404724M200696L455043K892196K757609K239108P35462
454.8E36249399q38280j502513j387477j711607k553702l291845l383398l012180k912641
473.2E15655756k981484k721012j936793q99374n7578J05857m48405p23362l84391
491.5E05609214m00603j159966j917481k187431k169907k145201k424627l152430l738642
509.9D86312926l789246l610671l760815m379957m561842l651023k146810q40873j07586
528.3D59464103L22849J017987K395988M206031N486042N601495M752934L460765K125382
$$ y = [538386047, 532749176, 528132379, 525657475, 525777638, 527728736, 530008435, 531700492, 533038497, 534321249, 534303844, 532224357, 529040515, 525655210, 522751033, 520352840, 518026412, 515294969, 512838542, 512680709, 515564561, 519969285, 524169981, 527625024, 530517220, 533274829, 535513937, 536249399, 535411119, 533908606, 532521129, 530809522, 528255820, 524963975, 521580577, 518568397, 515655756, 512674272, 509953260, 508016467, 507117093, 507059515, 507165372, 506716967, 505993605, 505609214, 505208611, 504048645, 502131164, 499943733, 497773826, 495628625, 493203998, 490051568, 486312926, 482523680, 478913009, 475152194, 470772237, 466210395, 462559372, 460412562, 459571689, 459464103, 459786952, 460804939, 463200927, 467406958, 472893000, 478494495, 483247429, 486708194, 488833576]
546.6D88833576P23869p86871k000063k616465k881051l460794m571378n658389o343543
565D61238891o692439o525070n519986l551841q76814J820415M089982N915969P111579
583.3D57010686P276267O462574N190969L750562K113074P32691j8895k62618j89781
601.7D82065529p3195j0192J47581O03795J410186K188772K478689K594799L135264
620D94541228M005194M585802M339099L481805K731502K501786K466738K145410J533687
638.4E22332251R12428O90460J082301J450837J150370O22093N91338J170158J691759
656.8E31693995J441479P56681N07652L79265J25348J344324K229452J410365J251578
675.1E41140139J939714K181709J613200R30309Q00311J194835J294732L95715j019120
$$ y = [488833576, 489557445, 488770574, 486770511, 484154046, 481272995, 477812201, 473240823, 467582434, 461238891, 454546452, 448021382, 442501396, 438949555, 438072741, 439893156, 443983138, 449899107, 457010686, 464286953, 470749527, 475940496, 479691058, 481804132, 482536823, 482517928, 482255310, 482065529, 481992334, 481982142, 482129723, 482733518, 484143704, 486332476, 488811165, 491405964, 494541228, 498546422, 503132224, 507471323, 510953128, 513684630, 516186416, 518653154, 520798564, 522332251, 523244679, 523935139, 525017440, 526468277, 527618647, 528240740, 528832078, 530002236, 531693995, 533135474, 533892155, 534399807, 534779072, 534904420, 536248744, 538478196, 539888561, 541140139, 543079853, 545261562, 546874762, 547805071, 548605382, 549800217, 551094949, 551490664, 550471544]
693.5E50471544j889169k076864k276182k824188l270685k828300j284719N53012J847923
711.8E36422372K593338L315151M388094N826712O738007O319999N473972N293667
728.1E76371312N577624N287528L952980K374232J551568J451552J047254m20511k535641
746.5E94657898m176676m684389m476249m587352n267501n569399m543066k387583
762.8E58965683j63555J468718K917051M964113P452548R283841R588480Q578419P362247
781.2F10417545O830275O604731N660117M068255L060460L446102M560769N180120
797.5F49828374M720867L721893L287017L517747L424704K454460J217723N89192P84695
815.8F73546672R87470K53797j220465k417922k885401l247738m216433n594432o481528
$$ y = [550471544, 548582375, 546505511, 544229329, 541405141, 538134456, 535306156, 534021437, 534574449, 536422372, 539015710, 542330861, 546718955, 552545667, 559283674, 565603673, 571077645, 576371312, 581948936, 587236464, 591189444, 593563676, 595115244, 596566796, 597614050, 597193539, 594657898, 590481222, 585796833, 581320584, 576733232, 571465731, 565896332, 561353266, 558965683, 558802128, 560270846, 563187897, 568152010, 575604558, 584888399, 594476879, 603055298, 610417545, 617247820, 623852551, 629512668, 633580923, 636641383, 640087485, 644648254, 649828374, 654549241, 658271134, 661558151, 665075898, 668500602, 670955062, 672172785, 672761977, 673546672, 674534142, 674787939, 673567474, 671149552, 668264151, 665016413, 660799980, 655205548, 648724020]
834.2F48724020o374062n583405m885256m773856m858732m408836l489614l002822
850.5F11347437l464758m392446m893064m075110j363993K693653O576300R341598
866.8F11769617J1244893J2313068J1704623R041786N331398K006769n75900k927244
883.2F59909010n248785p093489p812441p330715o415248n845845n739868n756497
899.5F08666122n659342n683660o301523p624268r068430r970367j0241031j0120034
915.8E43997467r632647q450211o426096l964185j798213m57644K41458R25660J968444
934.1E16404033L209293M153788M498422M114270K542555m89175m458725q534789j1987925
952.5E09451747j4329583j5578508j6285926j7035574j7899215j8571258j8876224
$$ y = [648724020, 642349958, 636766553, 631881297, 627107441, 622248709, 617839873, 614350259, 611347437, 607882679, 603490233, 598597169, 594522059, 593158066, 595851719, 602428019, 611769617, 623014510, 635327578, 647032201, 656073987, 661405385, 663412154, 662836254, 659909010, 654660225, 647566736, 639754295, 632423580, 626008332, 620162487, 614422619, 608666122, 603006780, 597323120, 591021597, 583397329, 574328899, 564358532, 554117501, 543997467, 534364820, 525914609, 519488513, 515524328, 513726115, 513268471, 513509929, 514435589, 516404033, 519613326, 523767114, 528265536, 532379806, 534922361, 534433186, 529974461, 521439672, 509451747, 495122164, 479543656, 463257730, 446222156, 428322941, 409751683, 390875459]
966.8C90875459j8929452j8905789j8742919j8173277j6929805j4949769j2430638
981.1B71813810r699553p058829m635662k508790q25256L40864J057759J455337J694530
999.4B51634210J763851J531333J013726L85105r5904k26885k980M25249R30995J443088
1019.8B58801788K016068K644479L147095L391385L378660L197104K883941K374142
1036.1B81834662J665860J030177P14869P46131J050591J567960K309263L318637M537851
1054.5B98776001N753875O879955Q007884R129733R598702Q037210L341227l431350
1070.8C46093237q796483r976983p546514m037827j114548R82970K498657L611207
1087.1C21713716M485309N179375N523682N296826M417420L148854J932889J132279
$$ y = [390875459, 371946007, 353040218, 334297299, 316124022, 299194217, 284244448, 271813810, 262114257, 255055428, 250419766, 247910976, 247085720, 247426584, 248484343, 249939680, 251634210, 253398061, 254929394, 255943120, 256328225, 256232321, 256005436, 256002456, 256427705, 257358700, 258801788, 260817856, 263462335, 266609430, 270000815, 273379475, 276576579, 279460520, 281834662, 283500522, 284530699, 285245568, 285991699, 287042290, 288610250, 290919513, 294238150, 298776001, 304529876, 311409831, 319417715, 328547448, 338146150, 346183360, 349524587, 346093237, 337296754, 327319771, 319773257, 315735430, 314620882, 315603852, 318102509, 321713716, 326199025, 331378400, 336902082, 342198908, 346616328, 349765182, 351698071, 352830350]
1103.4C52830350R88901J576126K621203L584177M052192L945767L399134K656311
1119.8C75654161K014726J745344K070784K920181L853172M240781L554582J621217
1136.1C97674948j199663m092306o304770p492274p722229p195741o163389m886001
1152.4C52618575l478199k038837o98089N78165J991451L635674N437583P292748R072750
1170.7C74411821J0616035J1830985J2649924J3101995J3278961J3135075J2564451
1185D61589247J1516243J0059595Q325249O460965M706293L321588K432525K074540
1201.3E10486245K142191K463281K990842L698886M485547N129576N370736N041242
1217.7E41808546M133284K894103J670242N91397l44277j056075j441538j486778j320184
$$ y = [352830350, 353819251, 355395377, 358016580, 361600757, 365652949, 369598716, 372997850, 375654161, 377668887, 379414231, 381485015, 384405196, 388258368, 392499149, 396053731, 397674948, 396475285, 392382979, 386078209, 378585935, 370863706, 363667965, 357504576, 352618575, 349140376, 347101539, 346403450, 346981615, 348973066, 352608740, 358046323, 365339071, 374411821, 385027856, 396858841, 409508765, 422610760, 435889721, 449024796, 461589247, 473105490, 483165085, 491490334, 497951299, 502657592, 505979180, 508411705, 510486245, 512628436, 515091717, 518082559, 521781445, 526266992, 531396568, 536767304, 541808546, 545941830, 548835933, 550506175, 551097572, 550753295, 549697220, 548255682, 546768904, 545448720]
1236E45448720j127004r74834o87957m7624Q32915J554072J904369J976132J897573
1254.4E50776362J760006J573623J283347J031757J148223J649380K141178K224982
1270.7E63588858J765430R72628K70903j22487l56376n92769q51929j063704j110971
1289E62499583j088441j264691j628578j897573j884937j686097j561582j644432j787663
1307.4E48055589j640856j171470q37028r00984j195907j493991j793861k409518l483057
1325.8E33128917m643619n323529n195677m414857l400445k442300j555383o74188
1342.1E05478919M7981M07577L07858p5460m12881o05702p61629r91761j273453j493633
1362.5E00627816j367867r52512o20842l45856L3945M33236O18249O36071O31929R74059
$$ y = [545448720, 544321716, 543346882, 542658925, 542611301, 543444216, 544998288, 546902657, 548878789, 550776362, 552536368, 554109991, 555393338, 556425095, 557573318, 559222698, 561363876, 563588858, 565354288, 566326916, 566597819, 566475332, 566118956, 565526187, 564674258, 563610554, 562499583, 561411142, 560146451, 558517873, 556620300, 554735363, 553049266, 551487684, 549843252, 548055589, 546414733, 545243263, 544406235, 543505251, 542309344, 540815353, 539021492, 536611974, 533128917, 528485298, 523161769, 517966092, 513551235, 510150790, 507708490, 506153107, 505478919, 505526900, 505934477, 506242335, 506166875, 505753994, 505148292, 504386663, 503394902, 502121449, 500627816, 499259949, 498307437, 497686595, 497340739, 497374684, 497807920, 498426169, 499062240, 499694169, 500668228]
1382.9E00668228K058684L596783M098416L133654K056360J056374J23322n02825q93176
1401.2E15395820j206577j566171j690030j556337j466692j402139j197756r04798
1417.5E04405320n64635j10209K90155M98295P60913J198053J483798J600564J923382
1435.9E11485636J970828J607179J648188J588643J112759L18885m92454q95858r85384
1454.3E17358422j441955j998484j018823L89636J983464L394603M207194N857706
1470.6E28731763Q951009R921491Q668065P848442P477343P204055O650031O540120
1486.9E91992319O746411O066680M524946M204452M885256M516602L463566K852440
1503.2F29252672L351093M373073L006458J952827J998186K139152K274155K272070
$$ y = [500668228, 502726912, 506323695, 510422111, 513555765, 515612125, 516668499, 516791821, 516288996, 515395820, 514189243, 512623072, 510933042, 509376705, 507910013, 506507874, 505310118, 504405320, 503840685, 503730476, 504020631, 504518926, 505279839, 506477892, 507961690, 509562254, 511485636, 513456464, 515063643, 516711831, 518300474, 519413233, 519732118, 519239664, 518343806, 517358422, 515916467, 513917983, 512899160, 513288796, 515272260, 518666863, 522874057, 528731763, 537682772, 547604263, 556272328, 564120770, 571598113, 578802168, 585452199, 591992319, 598738730, 604805410, 609330356, 613534808, 618420064, 622936666, 626400232, 629252672, 632603765, 636976838, 639983296, 641936123, 643934309, 646073461, 648347616, 650619686]
1519.5F50619686K373635J837910J230061J174271J118421J247526J183271O67036
1535.8F61451817O14583J014948N23329j39416l32057l75271l08096j86444o7293q3685
1556.2F62112415n73695j621187j274049q37982p51435q67010j173138j030147o42419
1574.6F53341353p26283j052796j048446r85921r25183r83894j181602j428128j556754
1593F43452346j674413j843214k022446k332806k658308k806544k892911l162444l378213
1611.3F20681047l303110l459513l914535l259778k813757l337324l386914l051877
1627.6E94154239k844215k318859j874924k047002j840711j088500n22196n0008M86255
1646E82054079Q60571R34959J852810K943218K043486K022385K969086M023016M187703
$$ y = [650619686, 652993321, 654831231, 656061292, 657235563, 658353984, 659601510, 660784781, 661451817, 662066400, 663081348, 663604677, 663465261, 663133204, 662757933, 662449837, 662263393, 662196100, 662112415, 661538720, 659917533, 658643484, 657805502, 657054067, 656187057, 655013919, 653983772, 653341353, 652615070, 651562274, 650513828, 649527907, 648602724, 647618830, 646437228, 645009100, 643452346, 641777933, 639934719, 637912273, 635579467, 632921159, 630114615, 627221704, 624059260, 620681047, 617377937, 613918424, 610003889, 606744111, 603930354, 600593030, 597206116, 594154239, 591310024, 588991165, 587116241, 585069239, 583228528, 582140028, 581617832, 581567824, 582054079, 582914650, 583849609, 585702419, 588645637, 590689123, 592711508, 595680594, 599703610, 603891313]
1664.3F03891313L599227M161715N127430M682958M857421N182028M503310M315018
1680.7F40320420N259097O725788N246878M024744M303574M150510M693627N059600
1697F79784238M483044M532815L540098L128946L223538K577901K215982K198577K115428
1715.3G07800567J304329m43757j097858l94940Q64446J728415J991153J936853K204239
1733.7G15893447J997590J446546J681804J864136J872062K155006K620399L166437
1750G32697427L266394K860368K917945K996564K647877K478420K051354J741409J818061
1768.4G55475819J835406J742482J329780R86457J089096J247585J171886J080335
1784.7G65958846J010418R41455J062274J180231R17972P58469Q44359R16243Q53717
$$ y = [603891313, 607490540, 611652255, 616779685, 621462643, 626320064, 631502092, 636005402, 640320420, 645579517, 652305305, 657552183, 661576927, 665880501, 670031011, 674724638, 679784238, 684267282, 688800097, 692340195, 695469141, 698692679, 701270580, 703486562, 705685139, 707800567, 709104896, 708661139, 707563281, 707168341, 708032787, 709761202, 711752355, 713689208, 715893447, 717891037, 719337583, 721019387, 722883523, 724755585, 726910591, 729530990, 732697427, 735963821, 738824189, 741742134, 744738698, 747386575, 749864995, 751916349, 753657758, 755475819, 757311225, 759053707, 760383487, 761369944, 762459040, 763706625, 764878511, 765958846, 766969264, 767910719, 768972993, 770153224, 771071196, 771829665, 772674024, 773590267, 774443984]
1803G74443984P73191Q09193Q69990Q39114O92308O51300P27415P50899O92427O77347
1823.4G81927168P12753O91414O68883N08666L52502M08113M77671M15326L96192M71532
1843.8G87030220L63290K05756K42531K76863K18690J91629K36451L04103L02434K52486
1864.2G89624453K56002L24249L18229K55644K46048K23816K51770L69191M64737M38691
1884.6G92772830L22282K80142L50535M13358L95000K43723P3075J00792K52068L05474
1905G95509279J84655L2484L4571J63198K54929K45571J29640N0068J55032K58445
1925.4G97017872K13504Q4043M649O3836J91689K70903K02298P2539O0797K09212L15249
1947.9G98706591K43485J14381Q3745K07365L54409L29137J50501O3718J74760L06607
$$ y = [774443984, 775217175, 776026368, 776896358, 777735472, 778427780, 779079080, 779806495, 780557394, 781249821, 781927168, 782639921, 783331335, 784000218, 784508884, 784861386, 785269499, 785747170, 786162496, 786558688, 787030220, 787393510, 787599266, 787841797, 788118660, 788337350, 788528979, 788765430, 789069533, 789371967, 789624453, 789880455, 790204704, 790522933, 790778577, 791024625, 791248441, 791500211, 791869402, 792334139, 792772830, 793095112, 793375254, 793725789, 794139147, 794534147, 794777870, 794850945, 794951737, 795203805, 795509279, 795693934, 795726418, 795760989, 795924187, 796179116, 796424687, 796554327, 796604395, 796759427, 797017872, 797231376, 797315419, 797320068, 797383904, 797575593, 797846496, 798048794, 798121333, 798182130, 798391342, 798706591, 798950076, 799064457, 799148202, 799355567, 799709976, 800039113, 800189614, 800253332, 800428092, 800734699]
1968.3H00734699K73764J06275l4034K4140K30908L12626J76430j4722n5373Q8573
1988.7H01843286K60353J99318o7652j83463o5684R8050J12652p7724k82526k83122
2009H01553488j36435p8321k29418m58539n79118n29290m63545m68910l51190k25604
2029.4G98033118k21550j97649k51532m31299n19872m00543k05278j39416k40504l27826
2049.8G95097649k48730m4286J02818O1631q4043j30713J2637J95443K15471N4955
2070.2G95232832q5711m7863J16110K08736J04785m3035m0829R3937K17020J86861
2090.6G95942843M8459J5258J23263K47240K52843J23501L6656R6739K25663K60889
2111G97373354J25289l8981l7372R8049J81556R1553r5546j56820k980J90556J76012
$$ y = [800734699, 801008463, 801114738, 801080704, 801104844, 801335752, 801648378, 801824808, 801810086, 801754713, 801843286, 802103639, 802302957, 802235305, 802051842, 801986158, 802084208, 802196860, 802119136, 801836610, 801553488, 801417053, 801338732, 801109314, 800650775, 800071657, 799542367, 799078822, 798609912, 798258722, 798033118, 797811568, 797613919, 797362387, 796931088, 796411216, 796010673, 795805395, 795665979, 795425475, 795097649, 794848919, 794804633, 794907451, 794969082, 794885039, 794754326, 794766963, 794962406, 795177877, 795232832, 795147121, 795099258, 795215368, 795424104, 795528889, 795485854, 795445025, 795538962, 795755982, 795942843, 795991302, 796006560, 796129823, 796377063, 796629906, 796753407, 796790063, 796886802, 797112465, 797373354, 797498643, 797459662, 797422290, 797520339, 797701895, 797793448, 797697902, 797541082, 797538102, 797728658, 797904670]
2133.5G97904670k3544j50501p3731J16825K17974P1764j52111j31726J07646K81632
2153.9G98168898K32100Q8275P1406K33829M18901M29869K78056K16186L89695O10232
2174.3H01137447O36638M51862K98202L79622N67258O23524M88460K99335K65717M17173
2194.6H05565238N54621N02706L17395K27749L44396N23567N30541L53753K26617K95460
2215H09442043M58002N11647L93271K46465K24114L02732L70681L34263K09570J44183
2235.4H12636971J91391K56956K41935J73688J35779J40786J72377J97411J67846R4056
2255.8H14409196P2122J58012K45869K26736J30534Q0169J81555K99096K66076J68085
2276.2H16237450J45673K19286K94149K49386N4538j63555k28226j30952n5492j22905
$$ y = [797904670, 797881126, 797730625, 797656894, 797773719, 797991693, 798063457, 797911346, 797779620, 797887266, 798168898, 798400998, 798489273, 798560679, 798794508, 799213409, 799643278, 799921334, 800137520, 800527215, 801137447, 801774085, 802225947, 802524149, 802903771, 803471029, 804094553, 804583013, 804882348, 805148065, 805565238, 806119859, 806622565, 806939960, 807167709, 807512105, 808035672, 808566213, 808919966, 809146583, 809442043, 809900045, 810411692, 810804963, 811051428, 811275542, 811578274, 811948955, 812283218, 812492788, 812636971, 812828362, 813085318, 813327253, 813500941, 813636720, 813777506, 813949883, 814147294, 814315140, 814409196, 814481318, 814639330, 814885199, 815111935, 815242469, 815322638, 815504193, 815803289, 816069365, 816237450, 816383123, 816602409, 816896558, 817145944, 817200482, 817036927, 816808701, 816677749, 816622257, 816499352]
2296.6H16499352l04758m81546m86314m27664n35607p28667q10385p17878o12259p72416
2317H10621858j102090j193166r79185p93100p99655p79510n59390m00960m93765n95927
2337.4H02925110n48899k88308M49538J638413J573443k73228k236604l019870k549231
2355.8G97670364j621902o62624J53124Q14259J362979J773298K060354K177596K054572
2374.1H05782020J825690J688183J612484J389921R57787M57346O6400j26243j55806
2392.5H13497782j80841k79009l13878k50816j83702j74880k94924m73261n00858l62575
2412.9H10483038k68757l64125n56111o27875n16355l92199m04715n28992o55889o49750
2433.3H05518270n36859m95136n65112o48022o63340o09636n44369n31912n84245o41882
$$ y = [816499352, 816194594, 815713048, 815226734, 814799070, 814263463, 813534796, 812724411, 812006533, 811394274, 810621858, 809519768, 808326602, 807347417, 806554317, 805754662, 804975152, 804415762, 804014802, 803521037, 802925110, 802376211, 802087903, 802537441, 804175854, 805749297, 805476069, 803239465, 800219595, 797670364, 796048462, 795385838, 795538962, 796353221, 797716200, 799489498, 801549852, 803727448, 805782020, 807607710, 809295893, 810908377, 812298298, 813256085, 813713431, 813779831, 813653588, 813497782, 813316941, 813037932, 812724054, 812473238, 812289536, 812114656, 811819732, 811346471, 810845613, 810483038, 810214281, 809850156, 809294045, 808666170, 808149815, 807757616, 807352901, 806823909, 806168020, 805518270, 804981411, 804486275, 803921163, 803273141, 802609801, 802000165, 801455796, 800923884, 800339639, 799697757]
2453.7G99697757o19471n37873n12778n58675n75781n48660n27442m86910m49717m81427
2474.1G94399023n33223n29230m89294m65036m66823m67480m47571m17888l82423l48866
2494.5G89851189l21150k96295k91645l37840l84509l53456k80678k35259k58029l39448
2514.9G86752880m08411m35472m19557l84688m16637n20229n76556n42760n18560n73933
2535.3G81956077o48916o66976o39677o25968o39618o55174o53088o25312o07252o47784
2555.6G75546312o73771o11543n56052n74946o12378o06001n65708n70118o29663o54817
2576G69491315n96881n29587n15580n37873n61237n54681m88520l95834l81649m32789
2596.4G64496684m56989m47929m07755l79264m60863n93365o59525o76453o95944p51436
$$ y = [799697757, 799078286, 798540413, 798027635, 797468960, 796893179, 796344519, 795817077, 795330167, 794880450, 794399023, 793865800, 793336570, 792847276, 792382240, 791915417, 791447937, 791000366, 790582478, 790200055, 789851189, 789530039, 789233744, 788942099, 788604259, 788219750, 787866294, 787585616, 787350357, 787092328, 786752880, 786344469, 785908997, 785489440, 785104752, 784688115, 784167886, 783591330, 783048570, 782530010, 781956077, 781307161, 780640185, 780000508, 779374540, 778734922, 778079748, 777426660, 776801348, 776194096, 775546312, 774872541, 774260998, 773704946, 773130000, 772517622, 771911621, 771345913, 770775795, 770146132, 769491315, 768894434, 768364847, 767849267, 767311394, 766750157, 766195476, 765706956, 765311122, 764929473, 764496684, 764039695, 763591766, 763184011, 762804747, 762343884, 761750519, 761090994, 760414541, 759718597, 758967161]
2616.8G58967161q45015r42945r96888r96113r92417j016438j074851j157045j183033
2635.2G49762416j132786j122296j184345j210033j159370j124263j142919j164556
2651.5G40521848j172006j125932j045346j031578j102864j176596j152098j009643
2667.8G31705785q99196r34780j010179j018822r46462q57950q50975q98302r07540
2686.2G23381579q61704q40188q79108r34422j009286j039445r62377r38833j064241
2704.5G14851975j177370j166225j092791j040518j042605j062214j049996r93311
2720.9G06226945r14633q82209r24706r55284q67426p19071o83188p90596q68201q02756
2741.2F97818875o96003o63042p23660q07047p66635o04510n08488n40494o39379p16091
$$ y = [758967161, 758122146, 757179201, 756182313, 755186200, 754193783, 753177345, 752102494, 750945449, 749762416, 748629630, 747507334, 746322989, 745112956, 743953586, 742829323, 741686404, 740521848, 739349842, 738223910, 737178564, 736146986, 735044122, 733867526, 732715428, 731705785, 730806589, 729871809, 728861630, 727842808, 726896346, 726038396, 725187421, 724289119, 723381579, 722519875, 721679687, 720800579, 719866157, 718856871, 717817426, 716855049, 715916216, 714851975, 713674605, 712508380, 711415589, 710375071, 709332466, 708270252, 707220256, 706226945, 705312312, 704430103, 703505397, 702550113, 701682687, 700963616, 700280428, 699489832, 698621631, 697818875, 697122872, 696459830, 695736170, 694929123, 694162488, 693557978, 693049490, 692508996, 691869617, 691153526]
2761.6F91153526o49452n12063m94898o04689p32481p88331p33197o95050q01384r57132
2782F84184849j030087r99570r68635j080752j304388j415968j341164j299500j435459
2800.4F73309326j627147j723409j721441j715303j775086j905560k037824k076804
2816.7F58726752k026200k032877k204358k403855k473712k467811k509475k634585
2833F39973879k785027k920568l037095l163457l383815l712774l961265l898501l553331
2851.4F09558046l130734k814472k736568k877832l118217l453254l956914m532040
2867.7E82938015m972159n187750n230785n209744n089998m755795m192173l447533
2884E44852078k674162k061189j624167j230657q39114o02364o15597p80881r93192
$$ y = [691153526, 690504074, 689992011, 689497113, 688892424, 688159943, 687371612, 686638415, 685943365, 685141981, 684184849, 683154762, 682155192, 681186557, 680105805, 678801417, 677385449, 676044285, 674744785, 673309326, 671682179, 669958770, 668237329, 666522026, 664746940, 662841380, 660803556, 658726752, 656700552, 654667675, 652463317, 650059462, 647585750, 645117939, 642608464, 639973879, 637188852, 634268284, 631231189, 628067732, 624683917, 620971143, 617009878, 613111377, 609558046, 606427312, 603612840, 600876272, 597998440, 594880223, 591426969, 587470055, 582938015, 577965856, 572778106, 567547321, 562337577, 557247579, 552491784, 548299611, 544852078, 542177916, 540116727, 538492560, 537261903, 536422789, 535820425, 535204828, 534423947, 533430755]
2902.4E33430755j202822j411736j703858k180815k782762l306985l587126l587366
2918.7E13667285l438472l201127k755404k012431j086951j72496P48277J762152K816677
2937E06327510L769517M483044M917800N155981N329609N509496N599856N523205N430996
2955.4E52047014N433738N433858N291939M979551M614770M309475M113138M021823
2971.7E90245306L905535L731191L632963L580034L414273L115118K763092K433479
2988F16820991K228439K074897J782596J397431R97663O65962M95196K71559j09196
3006.4F26625538l92437n32210p44820j059115j345455j602829j812458j856565j855374
3024.7F15424275j969993k101600k198458k264976k319217k392888k407193k430916
$$ y = [533430755, 532227933, 530816197, 529112339, 526931524, 524148762, 520841777, 517254651, 513667285, 510228813, 507027686, 504272282, 502259851, 501172900, 501000404, 501748681, 503510833, 506327510, 510097027, 514580071, 519497871, 524653852, 529983461, 535492957, 541092813, 546616018, 552047014, 557480752, 562914610, 568206549, 573186100, 577800870, 582110345, 586223483, 590245306, 594150841, 597882032, 601514995, 605095029, 608509302, 611624420, 614387512, 616820991, 619049430, 621124327, 622906923, 624304354, 625302017, 625967979, 626463175, 626734734, 626625538, 626233101, 625700891, 624956071, 623896956, 622551501, 620948672, 619136214, 617279649, 615424275, 613454282, 611352682, 609154224, 606889248, 604570031, 602177143, 599769950, 597339034]
3041.1E97339034k580941k743423k744138k631664k658725k806365k847374k827346
3057.4E75499058k808929k729118k664625k679289k772450k895117k898395k748489
3073.7E53302646k574742k562583k721488k845109k867937k864480k813279k755583
3090E31297445k787828k817810k745032k617002k589285k698839k724051k614260k578318
3108.4E07125020k627730k528131k371222k425790k570301k693892k795934k731860
3124.7D86380160k546221k429485k406985k410233k370417k298355k325416k447396
3141D67145652k452195k343565k251149k119243k030611k161115k335668k326488k222240
3159.4D46903378k141357k108812k064407j985907j959891j942455j906306j909882
$$ y = [597339034, 594758093, 592014670, 589270532, 586638868, 583980143, 581173778, 578326404, 575499058, 572690129, 569961011, 567296386, 564617097, 561844647, 558949530, 556051135, 553302646, 550727904, 548165321, 545443833, 542598724, 539730787, 536866307, 534053028, 531297445, 528509617, 525691807, 522946775, 520329773, 517740488, 515041649, 512317598, 509703338, 507125020, 504497290, 501969159, 499597937, 497172147, 494601846, 491907954, 489112020, 486380160, 483833939, 481404454, 478997469, 476587236, 474216819, 471918464, 469593048, 467145652, 464693457, 462349892, 460098743, 457979500, 455948889, 453787774, 451452106, 449125618, 446903378, 444762021, 442653209, 440588802, 438602895, 436643004, 434700549, 432794243, 430884361]
3175.7D30884361j894831j830995j826942j877606j839072j696914j630068j694352
3192D16593581j719385j646966j575410j547962j523257j518219j505018j460463j436770
3210.3D02660131j410543j371831j322925j302868j328111j306117j257121j236767
3226.7C92123848j189709j062124r80169j148135j315385j209974j088113j028954
3243C83101285r18627r16928j059890j088411r56565q88914r17285r03309q51810q00758
3263.4C73798788p32184o33180n71340o90252q77231r17346q29905p26640o90073p28756
3283.8C66401881p43836o49899n01126m62085o19859q17955q93861p81208n40465m11868
3304.2C59979719n24074p91788r99391r92537q84622q32766p95156p33852p02918p34478
$$ y = [430884361, 428989530, 427158535, 425331593, 423453987, 421614915, 419918001, 418287933, 416593581, 414874196, 413227230, 411651820, 410103858, 408580601, 407062382, 405557364, 404096901, 402660131, 401249588, 399877757, 398554832, 397251964, 395923853, 394617736, 393360615, 392123848, 390934139, 389872015, 388891846, 387743711, 386428326, 385218352, 384130239, 383101285, 382182658, 381265730, 380205840, 379117429, 378160864, 377271950, 376354665, 375451356, 374599546, 373798788, 373066604, 372433424, 371862084, 371171832, 370294601, 369377255, 368547350, 367820710, 367130637, 366401881, 365658045, 365008146, 364507020, 364044935, 363425076, 362607121, 361713260, 360932052, 360391587, 359979719, 359455645, 358663857, 357664466, 356671929, 355787307, 354954541, 354159385, 353425533, 352722615, 351988137]
3324.6C51988137q54731r34183q66384p85887o96778o00368p31826r61006r81777r24528
3345C43650669q27551o74129p67022j026809j042396q58366p67202q35538q74549p05510
3365.4C35271597n87285q03798j098245j078517q35061p05212p20650p65383p12216
3383.7C27965230n57930l53336j38789k38627o07193o26087k46316r8110m50521p67589
3404.1C23880732n91755k94059j93566k05696l33995m19140k79545j52439j53631m6820
3424.5C21210086J55449K24114J41859J91003L27945J62035j48177j55717R3013L17722
3444.9C22519332L86238L31581L29077L91305M67628N82605O45221N33521N29557Q42929
3465.3C27558994R87977O07431J87725K90155O50436Q67009P95633N26875N32418P94262
$$ y = [351988137, 351133406, 350199223, 349332839, 348546952, 347850174, 347249806, 346517980, 345556974, 344575197, 343650669, 342823118, 342148989, 341381967, 340355158, 339312762, 338454396, 337687194, 336851656, 335977107, 335271597, 334684312, 333880514, 332782269, 331703752, 330868691, 330163479, 329442829, 328677446, 327965230, 327407300, 327053964, 326915175, 326676548, 326069355, 325443268, 325196952, 325098842, 324648321, 323880732, 323288977, 322994918, 322801352, 322595656, 322261661, 321842521, 321562976, 321410537, 321256906, 321210086, 321365535, 321589649, 321731508, 321922511, 322250456, 322412491, 322264314, 322108597, 322201610, 322519332, 322905570, 323237151, 323566228, 323957533, 324425161, 325007766, 325652987, 326186508, 326716065, 327558994, 328546971, 329154402, 329342127, 329632282, 330282718, 331149727, 331945360, 332472235, 333004653, 333798915]
3485.7C33798915P93934O32346O80327Q28028R27687R26047R28789R23813O91086N43445
3506.1C41674417P49767R90182J089305J010805Q27194Q31723J061529J245767J074820
3524.4C50555509Q15362Q81463J083315J220017J320720J231611J112670J383155J640588
3542.8C61244410J433373J047283J027316J305670J467973J506656J618594J782566
3559.1C72433841J812190J721412J829356K215117K293945K107143K141803K321661
3575.4C88876468K464801K653033K872288K911299K800197K775848K865165K885073
3591.7D11104172L009677L263623L424913L427058L359318L270775L305107L599316
3608.1D37763959L754348L687441L626019L524721L705590L949464L636211L302395
$$ y = [333798915, 334592849, 335225195, 335905522, 336733550, 337661237, 338587284, 339516073, 340439886, 341130972, 341674417, 342424184, 343414366, 344503671, 345514476, 346341670, 347173393, 348234922, 349480689, 350555509, 351370871, 352252334, 353335649, 354555666, 355876386, 357107997, 358220667, 359603822, 361244410, 362677783, 363725066, 364752382, 366058052, 367526025, 369032681, 370651275, 372433841, 374246031, 375967443, 377796799, 380011916, 382305861, 384413004, 386554807, 388876468, 391341269, 393994302, 396866590, 399777889, 402578086, 405353934, 408219099, 411104172, 414113849, 417377472, 420802385, 424229443, 427588761, 430859536, 434164643, 437763959, 441518307, 445205748, 448831767, 452356488, 456062078, 460011542, 463647753, 466950148]
3624.4D66950148L320784L849745M199147L810733L710211L788471L765613L715157
3640.7D97110009L626168L489852L606141M250884M306137L472567L337621L816486
3657E27015865L753126L340721L104031L040075L080666L313720L366173K990186K965450
3675.4E55970013K967596K720595K663016K651572K656877K822340K694905K196371
3691.7E77343285K015889K011657J971066J980364K053797J992881J848638J782120
3708E92999697J823246J944661J873255J608253J410126J301051J290380J320065J293182
3726.4F06863916J337290J477301J578450J569808J580894J373291R92775R04262J271844
3744.7F18949831J450777J236081J082420J015544J075029J117349J145899J123011
$$ y = [466950148, 470270932, 474120677, 478319824, 482130557, 485840768, 489629239, 493394852, 497110009, 500736177, 504226029, 507832170, 512083054, 516389191, 519861758, 523199379, 527015865, 530768991, 534109712, 537213743, 540253818, 543334484, 546648204, 550014377, 553004563, 555970013, 558937609, 561658204, 564321220, 566972792, 569629669, 572452009, 575146914, 577343285, 579359174, 581370831, 583341897, 585322261, 587376058, 589368939, 591217577, 592999697, 594822943, 596767604, 598640859, 600249112, 601659238, 602960289, 604250669, 605570734, 606863916, 608201206, 609678507, 611256957, 612826765, 614407659, 615780950, 616773725, 617677987, 618949831, 620400608, 621636689, 622719109, 623734653, 624809682, 625927031, 627072930, 628195941]
3761F28195941J030267R68039R21607R82642J021743R02354Q96395J035452J042068
3779.4F36996508Q63135P58469Q33809Q91685Q55744Q13067P88927Q02160P41481O76096
3799.8F45021081P81298P74145O95228P29800O93857O80447P18713P42495O90877O77049
3820.2F52204990P09951N93841N79417N93066N67913O86229Q18729P24197M63008L55184
3840.6F58296525M79341O06656N66661M27723K99931L98397O89984O44982N07652M18008
3861F63335860L96788N00619M79281M23134M95135N13316M78923M04000M20749M76361
3881.4F67924166M66168M98116L74376L06845M60625L93867K16782K61486L68655M16338
3901.8F71687424L67105K59400K64525L29137L09586K33472K07186K58147L16441K70069
$$ y = [628195941, 629226208, 630194247, 631115854, 632098496, 633120239, 634022593, 634918988, 635954440, 636996508, 637859643, 638618112, 639451921, 640343606, 641199350, 642012417, 642801344, 643603504, 644344985, 645021081, 645802379, 646576524, 647271752, 648001552, 648695409, 649375856, 650094569, 650837064, 651527941, 652204990, 652914941, 653508782, 654088199, 654681265, 655249178, 655935407, 656754136, 657478333, 657941341, 658296525, 658775866, 659382522, 659949183, 660376906, 660676837, 661075234, 661765218, 662410200, 662917852, 663335860, 663732648, 664233267, 664712548, 665135682, 665630817, 666144133, 666623056, 667027056, 667447805, 667924166, 668390334, 668888450, 669262826, 669569671, 670030296, 670424163, 670640945, 670902431, 671271086, 671687424, 672054529, 672313929, 672578454, 672907591, 673217177, 673450649, 673657835, 673915982, 674232423, 674502492]
3922.1F74502492J86920J75238K11656K65181L19302K49207J14679J24038K25544K75790
3942.5F76650047K54512K46227K69294K27391J55747J88709K53021K22445J86622J82271
3962.9F78836286J32501P3672J18672K41578K76566J83880J31607K18034L00288K65360
3983.3F80778444J90139J41203J18792Q7619P6651J62066K45273
3997.6F81800187
$$ y = [674502492, 674689412, 674864650, 675076306, 675341487, 675660789, 675909996, 676024675, 676148713, 676374257, 676650047, 676904559, 677150786, 677420080, 677647471, 677803218, 677991927, 678244948, 678467393, 678654015, 678836286, 678968787, 679042459, 679161131, 679402709, 679679275, 679863155, 679994762, 680212796, 680513084, 680778444, 680968583, 681109786, 681228578, 681316197, 681392848, 681554914, 681800187]
##END=$$ End of the data block
