##TITLE=21308-2 frente $$ Begin of the data block
##JCAMP-DX=5.00 $$ ACD/SpecManager v 10.08
##SPECTROMETER/DATA SYSTEM=Alpha
##DATE=28 Jul 2014 10:07:08
##DATA TYPE=INFRARED SPECTRUM
##DATA CLASS=XYDATA
##ORIGIN=
##OWNER=
##NPOINTS=1667
##FIRSTX=599.57470703
##LASTX=3997.16503906
##MAXX=3997.16503906
##MINX=599.57470703
##MAXY=0.96908170
##MINY=0.69685906
##XFACTOR=1.0000000000
##YFACTOR=1.000000000000000e-9
##FIRSTY=0.79277456
##DELTAX=2.03937006
##XUNITS=1/CM
##YUNITS=ARBITRARY UNITS
##XYDATA=(X++(Y..Y))
599.6 792774558 790427685 788538277 787669122 787829638 788709462 790026248 791406095 792616248 794270813
617.9 794270813 796544611 798334599 799437344 800426841 800948918 800681591 800576270 801905453 804791331
636.3 804791331 808252633 811557829 814387798 816150188 816781163 817187846 818454027 821173370 824557602
654.6 824557602 827031791 828150094 828317583 827766240 826969445 825946927 823811233 821564138 819964588
673 819964588 818678498 817647815 816911101 816337764 815651357 814705670 813626170 812873363 812898993 813595951
693.4 813595951 814371407 814908922 815001607 814673662 814986706 816901803 819824457 823150754 828246355
711.7 828246355 835374594 841280639 843637705 843383968 842148781 840545774 837918103 833093524 827342749
730.1 827342749 824161530 822658837 818777442 812584460 806806862 802820146 800357044 799593568 802276611
748.4 802276611 809269726 818962038 829177916 838715613 846629858 852649689 857520461 861564040
764.8 861564040 864613891 866791725 868438184 869890153 871098578 871513128 871098757 870985508 871889412
783.1 871889412 872871578 873121977 872928560 872673094 872630775 872854352 873180568 873553574 874002934 874298573
803.5 874298573 874149680 873866677 874146998 875550508 877990782 880235612 880877554 879624665 876940787
821.9 876940787 873877287 871784270 871199846 871406198 870920718 868763983 865288675 862009764 860526919
840.2 860526919 861332536 863751709 866983294 870573938 873556674 875020504 875223875 874713004 873683214
858.6 873683214 872247696 870649874 868975103 866849005 864221454 861810982 860861897 862491846 866535485
876.9 866535485 871525526 875905275 879127145 881172478 881623149 880432844 878226280 875417948 872306764
895.3 872306764 869203687 866156638 863183022 860141397 856807649 853473783 850622714 848412275
911.6 848412275 846839428 845746100 844752133 843528390 841894686 839710951 836964846 833745003 830127418
930 830127418 826284945 822352946 818351030 814341187 810407281 806666255 803154349 799900115 797154605
948.3 797154605 795109928 793672800 792647779 791843355 791064382 790446103 790491581 791541517 793762267
966.7 793762267 797084033 800795197 803887248 805734277 806305051 805959046 805389822 805424273 806377053
985 806377053 808090687 810501993 813817203 818191051 823422849 829243481 835256934 840751529 845123470
1003.4 845123470 847990036 849289894 849271119 848208964 846662581 845382333 844762921 844683468 844865382
1021.7 844865382 845246971 845821619 846606910 847412527 847692311 847271085 846638441 846797287 848792672
1040.1 848792672 852475464 856381238 859304249 860962868 861243308 859902561 856995523 853005111
1056.4 853005111 848439574 843811989 839556575 835635364 832065403 829320729 828130960 829306185
1072.7 829306185 833197832 839465618 847119927 854681075 860813379 864666998 865994871 865869939
1089 865869939 866046250 866374612 865364790 862891674 859627962 855901539 851956308 847618580 842191815
1107.4 842191815 835008085 825638056 814207673 801714122 789793611 780191004 773883879 770610273
1123.7 770610273 769220352 768023431 765407264 760723948 754295468 746875405 739266038 731961608
1140 731961608 725364506 720497429 719349205 724156857 735628128 751895428 769306898 784322977
1156.3 784322977 795229614 802294970 806799769 810199082 813280165 816038072 818349779 820061862
1172.6 820061862 821179271 821943402 822130799 820820987 817117631 811132252 804298282 798960030 797489464
1191 797489464 801060677 808975995 819413900 830746174 842041910 852662027 861880720 869060874
1207.3 869060874 873751462 875803173 875449598 873003721 868702471 862802267 855440140 846575916
1223.6 846575916 836514175 826114714 816147268 807022631 799304128 793841302 791339159 791971684
1239.9 791971684 795357168 800904989 807707369 814388037 819830000 823657215 825903535 826741338
1256.3 826741338 826242805 824436247 821579874 817963362 813878119 809973836 807337344 807123363 809863687
1274.6 809863687 815038860 821403205 827663958 833014071 837403595 841763973 847435355 854961753
1290.9 854961753 863944292 873543382 882876575 891337216 898716390 905114591 910675764 915308177
1307.2 915308177 918876171 921449065 923126996 923979759 924098790 923647761 923071086 923062205 923807800
1325.6 923807800 924652159 925069511 925244689 925469279 925941110 926858187 928014100 928881943 929214299
1344 929214299 928971171 928140521 926894963 925448895 923805296 921901286 919707954 917028248 913915217
1362.3 913915217 911406517 910256147 909940362 909387112 907754540 905000865 901851952 899024189 897158921
1380.7 897158921 896765232 897744417 900202930 904130995 908314943 912069142 915372729 917852819 919700444
1399 919700444 921358168 922764063 923695087 923806429 923035860 921466112 919267178 916721106 913512290
1417.4 913512290 908928692 903663754 897398949 889277220 879833043 869526982 861151397 857718647
1433.7 857718647 859666944 865253925 869262516 869963646 868115306 865445018 864205182 865704417
1450 865704417 869139731 873031378 877202153 881640196 884870350 887467146 890629709 894368589 897728086
1468.4 897728086 900609374 903253734 905136406 906033933 906244934 905933142 905602276 906155646 908550322
1486.7 908550322 913940609 921870410 928824246 933942437 938052893 940404534 940855086 940229714 938958585
1505.1 938958585 937620699 937887728 939675331 942309380 945135951 947635651 949465692 950846493
1521.4 950846493 951875448 952425063 952690423 952742219 952470005 951762557 951038599 950455844 949815750 949739754
1541.8 949739754 950343192 950995743 951281667 951185107 950823426 950300455 950016737 950484633 951618969 952189505
1562.2 952189505 952170432 951835752 951263547 950451732 949572086 948158324 945682406 943689346 943207562
1580.5 943207562 943743646 944647729 945390522 945778310 945760071 945406854 944738388 943838835 943228662 943427324
1600.9 943427324 944453478 945690215 946542740 947076976 947513282 947849452 948078036 948190212 948070765
1619.3 948070765 947714984 947246969 946991861 947048306 947295427 947547078 947524726 947084725 946629226 946432233
1639.7 946432233 946303308 946112692 945641577 944974840 944551647 943750978 941869080 940533459 940041900
1658 940041900 940195322 941063762 941914022 942069292 941590130 940699756 939767063 938513458 936767757 934951186
1678.4 934951186 933132529 930870414 927788794 925333560 923514426 921334088 918831587 915032923
1694.7 915032923 909249246 901603937 890628755 880613029 870862186 857307255 839949608 818349063
1711.1 818349063 792552710 763311803 732201755 709072292 698973596 696859062 700319469 708355486
1727.4 708355486 719790459 733654916 753050864 776101768 795514822 817530215 843068600
1741.6 843068600 867465377 890161335 910406709 928138375 942025006 950815618 956399560 960405946
1758 960405946 963025689 964826524 966052115 966738522 967100024 967349887 967624009 967863500 967996597
1776.3 967996597 967978179 967900217 967789292 967728674 967732549 967666149 967389047 967080176 967015147 967065215 967059493
1798.7 967059493 966984689 967011809 967045605 966984689 966927230 966933966 966968775 967011333 967013359 966992497 967001617 966934502
1823.2 966934502 966772377 966544867 966339350 966359138 966510832 966526508 966427863 966361105 966330826 966309667 966317236
1845.7 966317236 966349721 966362655 966331065 966264129 966224432 966226578 966283143 966362536 966359079 966253221 966142416
1868.1 966142416 966185629 966323018 966376781 966342807 966321170 966322303 966291606 966180921 966075361 966012061 965910554
1890.5 965910554 965838909 965822279 965835214 965842307 965780854 965675175 965578556 965460002 965335786 965303600 965310395
1913 965310395 965216458 965078890 965063572 965053678 964971185 964965463 964992344 964920104 964760423 964606345 964549661 964588702
1937.4 964588702 964620113 964541256 964382708 964256465 964161277 964097857 964076161 964033425 963954687 963898301 963895857
1959.9 963895857 963896811 963876367 963863194 963836670 963790655 963758349 963758647 963811994 963876843 963870823 963852882 963895619
1984.3 963895619 963910222 963868320 963831246 963835657 963891506 963975787 964065373 964117706 964150727 964199424 964242637 964267552
2008.8 964267552 964234591 964143932 964073181 964033127 964021564 964050949 964029610 963939190 963881254 963856280 963834524
2031.2 963834524 963805974 963731468 963679016 963671029 963612556 963567972 963619351 963679075 963668704 963607669 963528097 963463426
2055.7 963463426 963453352 963528097 963661492 963740885 963737667 963724911 963716269 963704646 963698268 963721335 963779926 963793576
2080.2 963793576 963748991 963708282 963682353 963632226 963568091 963572443 963645399 963731647 963771820 963757634 963730574 963697076
2104.7 963697076 963674426 963681996 963729560 963805795 963867307 963875532 963826776 963762701 963719249 963689923 963707447 963797808
2129.1 963797808 963870287 963859558 963780046 963657737 963611305 963684022 963722467 963696957 963648379 963569582 963557303
2151.6 963557303 963681877 963818073 963821411 963759899 963741302 963733315 963690102 963687360 963762760 963851511 963887691 963797092
2176 963797092 963663340 963616610 963656008 963746786 963838696 963852644 963758171 963638902 963548243 963484466 963460326
2198.5 963460326 963501096 963578224 963585436 963577271 963632286 963598907 963428795 963347197 963430762 963530481 963591516 963602960
2222.9 963602960 963529408 963390410 963296354 963375270 963561356 963663876 963623047 963555813 963573992 963660181 963734746
2245.4 963734746 963741839 963670611 963575244 963555157 963581443 963577628 963571310 963556707 963525414 963526726 963559031 963595331
2269.8 963595331 963650584 963690758 963649333 963575363 963526905 963479996 963453054 963466644 963471293 963462472 963479280 963486910
2294.3 963486910 963442445 963394523 963383138 963383853 963372946 963306487 963238537 963209331 963111103 962976635 962884009 962858200
2318.8 962858200 962896287 962851226 962738872 962705910 962781727 962999821 963272691 963421643 963439524 963358581 963221312
2341.2 963221312 963084698 962950706 962901354 962876260 962768853 962789774 963079333 963242769 963116944 963009477
2361.6 963009477 963090837 963160813 963032961 962821424 962743700 962799728 962777376 962701559 962745547 962905347 963050544
2384 963050544 963046134 962951303 962923050 962981880 963024855 962955594 962884605 962957203 963091910 963129520 963059962 962966323
2408.5 962966323 962908745 962945640 963054955 963093221 962976873 962847650 962858796 962951839 963033736 963045418 962987125
2430.9 962987125 962947190 962947369 963005841 963122964 963153005 963097751 963117480 963236272 963394105 963479877 963420272
2453.4 963420272 963301361 963197231 963087320 963023424 963116884 963261187 963259935 963222563 963224888 963127315 963038027
2475.8 963038027 963035762 963011563 963062286 963197470 963263094 963260233 963223457 963168502 963139653 963091493 963004589 962979972
2500.3 962979972 963003755 962987304 962944031 962902725 962886274 962896168 962841690 962749064 962733448 962729871 962695718 962713182
2524.8 962713182 962781072 962834060 962869287 962889493 962864339 962794185 962715149 962674797 962667882 962658703 962616980 962579429
2549.2 962579429 962606251 962610602 962518394 962433457 962431431 962449670 962441027 962400615 962328196 962243795 962169170 962167144
2573.7 962167144 962227643 962202489 962111652 962107360 962144315 962149203 962175131 962184370 962094188 962004662 962031841 962105334
2598.2 962105334 962137938 962119102 962051988 961937487 961829305 961818993 961877346 961940706 962013543 962081909 962133586
2620.6 962133586 962108970 961995423 961949289 962024808 962026954 961911380 961882293 961970687 962036908 961987793 961861312
2643 961861312 961764276 961700141 961678445 961716413 961765409 961816132 961829603 961785674 961767912 961722255 961608946 961585283
2667.5 961585283 961620092 961597979 961608231 961669207 961663187 961572766 961541057 961632550 961695135 961647213 961591184 961596012
2692 961596012 961573184 961480021 961418748 961406231 961410046 961436749 961399734 961265564 961179256 961131513 960987747 960868299
2716.4 960868299 960851550 960785806 960661709 960572362 960605621 960742354 960766613 960686624 960650086 960609674 960536718
2738.9 960536718 960490286 960528195 960613728 960640967 960594416 960512340 960426331 960353971 960285664 960208595 960123062
2761.3 960123062 960064352 960063398 960054278 959984004 959915459 959868371 959775448 959656954 959530830 959339321 959168136
2783.7 959168136 959070981 958923161 958733797 958639383 958615959 958478868 958159626 957813323 957599580 957442224
2804.1 957442224 957127333 956630766 956151307 955777049 955372155 954892218 954433501 953945935 953350127 952667475
2824.5 952667475 951815426 950685561 949306190 947749913 946022570 943979084 941541076 938937724
2840.8 938937724 936242163 933194101 930034697 927582204 926260889 925866127 926114261 926867008 927870750
2859.2 927870750 928644478 928846955 928472698 927683175 926854849 926518142 926965952 928071916 929412305
2877.6 929412305 930490136 930952072 930770934 930117130 929035485 927536130 925739348 923742115 921676755
2895.9 921676755 919637680 917521894 915284097 913003504 910688519 908232450 905490637 902442753
2912.2 902442753 899307251 896447957 894147515 892530382 891617477 891391456 891868770 893117011 895117700
2930.6 895117700 897603214 900132895 902304411 903746367 903969646 902562857 899723053 896422923
2946.9 896422923 893740654 892300665 892397285 894040346 897014797 901021898 905736268 910951674 916449249
2965.2 916449249 921850443 926901579 931443155 935182512 938047826 940283537 941906810 942757368
2981.6 942757368 943047881 943125308 943177640 943366826 943629622 943931282 944566607 945654809 946885467 947978377
3002 947978377 949124813 950518906 951882422 953045964 954131126 955078840 955793977 956405401 957029462
3020.3 957029462 957666755 958313286 958942771 959516048 960075080 960666120 961216807 961659074 962068915 962470889
3040.7 962470889 962760150 962931395 963072360 963221967 963358760 963464558 963521123 963490307 963446975 963502467
3061.1 963502467 963589072 963613212 963592887 963587344 963605225 963603556 963606358 963635743 963734865 963887334 963890553 963803411
3085.6 963803411 963801265 963814735 963889897 964022517 964006066 963903010 963899791 963975906 964022756 963984966 963936031
3108 963936031 963956475 964006364 964024186 964014411 963999748 963988841 964005232 964021027 963975132 963940263 964064002 964261830
3132.5 964261830 964308679 964213610 964130700 964098334 964090168 964150488 964269221 964289546 964116156 963901997 963856220
3154.9 963856220 963908672 963896811 963874638 963917196 963971138 963939846 963811994 963701487 963686824 963730395 963745832
3177.3 963745832 963695526 963658810 963723123 963765204 963639498 963483870 963442326 963457048 963462293 963462651 963482499 963535845
3201.8 963535845 963567317 963560760 963571489 963574827 963558018 963523984 963468194 963460267 963512480 963548362 963547289 963558853
3226.3 963558853 963596582 963660419 963760972 963831127 963802755 963725567 963678539 963703215 963715732 963654280 963711917
3248.7 963711917 963833272 963767231 963699162 963800788 963874161 963825524 963747382 963690102 963649094 963602424 963576436
3271.1 963576436 963573635 963553071 963537514 963533223 963517725 963491619 963452160 963351011 963147819 962904096 962722182
3293.6 962722182 962619364 962588549 962650955 962770045 962898552 962948978 962975323 963234305 963610053 963736296
3314 963736296 963674784 963669717 963732600 963773489 963721037 963701844 963824570 963949323 963998854 963925064 963771045
3336.4 963771045 963732660 963829935 963974655 964074135 964079857 964111507 964213192 964316905 964372218 964305997 964153290
3358.8 964153290 964045882 964056253 964159131 964238405 964236557 964237034 964236856 964162052 964135170 964253128 964395583 964394927
3383.3 964394927 964224398 964066625 964045644 964099765 964097321 964051664 964074492 964077950 964074731 964190662 964342833
3405.7 964342833 964385152 964269578 964160860 964167178 964124143 963991880 963918030 963945627 963983238 963930845 963759065
3428.2 963759065 963553905 963447154 963419437 963425279 963445127 963454545 963571310 963753462 963881373 964056849 964336038
3450.6 964336038 964561224 964581966 964500785 964465916 964517772 964614809 964648843 964645267 964715064 964839697 965017676
3473 965017676 965189219 965165079 965047002 965006351 965007663 964987457 964935660 964953005 965063274 965152979 965127528
3495.5 965127528 965060294 965090215 965188503 965305984 965416968 965416431 965274811 965215623 965398967 965511501 965332329
3517.9 965332329 965212822 965264261 965202928 965089500 965073824 965105534 965162992 965232670 965330958 965419590 965439558
3540.3 965439558 965384424 965211689 965086758 965230823 965470076 965595484 965639293 965587914 965416431 965311408
3560.7 965311408 965324044 965232968 965175986 965524137 965949953 966142237 966181278 966182947 966244400 966356814 966363549
3583.2 966363549 966069460 965687513 965707362 965938389 966141403 966319859 966368318 966236472 966059804 965993047
3603.5 965993047 966057420 966281056 966416359 966149628 965938151 966076195 966056049 965847135 965902805 966128290
3623.9 966128290 966217518 966028512 965952277 966238856 966602206 966845453 966899037 966831863 966760874 966767728 966695130
3646.4 966695130 966453552 966504753 966876149 967233002 967433333 967465043 967448711 967386961 967319250 967264175 967239141
3668.8 967239141 967386723 967505157 967353225 967227340 967483163 967873752 968025625 967890918 967669666 967605710
3689.2 967605710 967803597 967998385 968008995 967919350 967904627 968032420 968140781 968149483 968204439 968316019 968249559
3711.6 968249559 968074620 968085468 968219042 968320668 968228519 967883527 967689335 967880547 968019545 967793584
3732 967793584 967383385 967229903 967494786 967836618 967930138 967813730 967805624 967731774 967537403 967657387 967889071
3754.5 967889071 967947245 968041241 968251407 968337655 968331635 968364298 968409300 968489707 968526781 968454301 968369544
3776.9 968369544 968303859 968350649 968518674 968505859 968274295 968152285 968251109 968423247 968527317 968556464
3797.3 968556464 968588471 968547225 968466580 968619406 968880594 968805373 968443573 968162775 968137205 968245745
3817.7 968245745 968211532 968022764 968042910 968286276 968471825 968459845 968390167 968444586 968560576 968519509 968396485
3840.1 968396485 968377471 968417704 968519509 968697488 968772352 968404710 967916429 968016505 968280911 968349814
3860.5 968349814 968281150 968295574 968452513 968604088 968512118 968342721 968429983 968498409 968279839 968117595
3880.9 968117595 968208373 968346417 968539298 968615770 968390346 968244433 968347251 968336284 968220770 968092620
3901.3 968092620 967925012 968100727 968460023 968535841 968417943 968335986 968315840 968387663 968591392 968755424
3921.7 968755424 968725622 968619585 968589902 968555093 968426526 968434215 968696594 968870997 968788981 968684137 968648434
3944.1 968648434 968613565 968666315 968827546 968920171 968885005 968768954 968592405 968527436 968707681 968941867
3964.5 968941867 969007969 968962491 968959808 969012916 969065607 969081700 969072580 969002068 968852222 968817592 968955457
3986.9 968955457 968990684 968862116 968773723 968752146 968744755
3997.1 968744755
##END=$$ End of the data block
