##TITLE=21305-1 frente $$ Begin of the data block
##JCAMP-DX=5.00 $$ ACD/SpecManager v 10.08
##SPECTROMETER/DATA SYSTEM=Alpha
##DATE=28 Jul 2014 10:07:08
##DATA TYPE=INFRARED SPECTRUM
##DATA CLASS=XYDATA
##ORIGIN=
##OWNER=
##NPOINTS=1667
##FIRSTX=599.57470703
##LASTX=3997.16503906
##MAXX=3997.16503906
##MINX=599.57470703
##MAXY=0.97356957
##MINY=0.69500852
##XFACTOR=1.0000000000
##YFACTOR=1.000000000000000e-9
##FIRSTY=0.76992279
##DELTAX=2.03937006
##XUNITS=1/CM
##YUNITS=ARBITRARY UNITS
##XYDATA=(X++(Y..Y))
599.6G69922793k819777j624882n42402q6606N53072J466691K059698K308429K736985
617.9G73974001K898872J865924Q65042Q19385O99818J15454M8876J133084K656639
636.3G85077095L688276M069447L562332K418816J426220R33587J487196K968371L732144
654.6H09363484K822638J339137K50102m91202p28786j113713k384365k079129j038492
673H05939674p23660m98950j53303k1279n8055l01600p45296q40247k85983M10080
693.4H02721381P63774Q25584N20825j6212q9228P59065J522899K161324N980134J1364221
713.8H26513767J1021853N380451Q64387n99504r25123j595438k402723k874314l658832
732.1H31724524n267858o740451o854474n484701l717303k343833k96593L491104P829904
$$ y = [769922793, 767103016, 765478134, 764935732, 764849126, 765402198, 766868889, 768928587, 771237016, 773974001, 776872873, 778738797, 779603839, 780423224, 781123042, 781238496, 781287372, 782420456, 785077095, 788765371, 792834818, 796397150, 798815966, 800242186, 801175773, 802662969, 805631340, 809363484, 812186122, 813525259, 813775361, 813284159, 812555373, 811441660, 809057295, 806978166, 805939674, 805216014, 804717064, 804563761, 804542482, 804484427, 804182827, 803437531, 802597284, 802311301, 802721381, 803485155, 804310739, 804831564, 804815352, 804726124, 805485189, 807008088, 809169412, 815149546, 826513767, 837535620, 842916071, 843780458, 843180954, 842255831, 840660393, 838257670, 835383356, 831724524, 826456666, 819716215, 812861741, 807377040, 803659737, 801315904, 801019311, 804510415, 812340319]
750.5H12340319J0456324J0526657Q997559P023395N183219L811360L019035K698362
766.8H64056230K439141K001941J631558J544058J507938J174212Q13365P37428P59602
785.2H76665473P89821R49621J010001P49707M77851M81665P29918R60470P55965J52469
805.6H83722961j37925J71959Q23856J598298J802683Q31842q44061k308667k848982
823.9H82811964k241791q91506J15037l23117k011776l547907l526211j875520N2870
842.3H68562043J011252J698852K888322K784252R60946o38724j562714k173066k687693
860.6H70843470l260910l734112m390836n209446m751265j524448L835499Q652866
876.9H60460818J0431766R363652Q095324P365882N169451J645148p88510j561284
$$ y = [812340319, 822796643, 833323300, 842320859, 849344254, 854527473, 858338833, 861357868, 864056230, 866495371, 868497312, 870128870, 871672928, 873180866, 874355078, 875168443, 875905871, 876665473, 877455294, 878404915, 879414916, 880164623, 880642474, 881124139, 881854057, 882814527, 883570492, 883722961, 883585036, 883756995, 884580851, 886179149, 887981832, 888813674, 887969613, 885660946, 882811964, 880570173, 879678667, 879793704, 879470587, 877458811, 873910904, 870384693, 868509173, 868562043, 869573295, 871272147, 874160469, 876944721, 877905667, 877266943, 875704229, 873531163, 870843470, 867582560, 863848448, 859457612, 854248166, 849496901, 847972453, 851807952, 860460818, 870892584, 880256236, 888351560, 895717442, 900886893, 902532041, 901743531, 900182247]
893.2I00182247j718044j849949k049625k351284k825380l238082l172457k606392
909.6H80371034j812458j035809m25756j02222j76728o63638j309335j886726k376020
927.9H70582342k674877k848208l182829l717363m190087m543006m818440m849076
944.2H39758456m683316m494011m212559l741622l192424k746463k481699k171517
960.5H12034845j498699l08633J443684L202796M102886L795922K551496J003861k73048
978.9H26055110q47757o31869R835P68542J608014K683818L931821N057633N966127
997.3H44601274O444931O351351N538941L872812K165854J060724K29835m45008q23557
1015.6H68997157r89616j043439j070559j156390j270413j376152j575113k097845
$$ y = [900182247, 898464203, 896614254, 894564629, 892213345, 889387965, 886149883, 882977426, 880371034, 878558576, 877522767, 877097011, 876994789, 876818061, 876154423, 874845088, 872958362, 870582342, 867907465, 865059257, 861876428, 858159065, 853968978, 849425972, 844607532, 839758456, 835075140, 830581129, 826368570, 822626948, 819434524, 816688061, 814206362, 812034845, 810536146, 810227513, 811671197, 814873993, 818976879, 822772801, 825324297, 826328158, 826055110, 825207353, 824575484, 824585319, 825353861, 826961875, 829645693, 833577514, 838635147, 844601274, 851046205, 857397556, 862936497, 866809309, 868975163, 870035887, 870265722, 869820714, 868997157, 868007541, 866964102, 865893543, 864737153, 863466740, 862090588, 860515475, 858417630]
1031.9H58417630k880454l239453k197981K81513K616823L263295K314865P68364r21607
1050.3H58422995k788008m540801n674898o039143n811095n215705m676282m438758
1066.6H19238305l923058k261937O81698M162193P223069Q996904Q961201P458448
1082.9H50536823N299628L113866J358271J84178o75619j513302k373278l116727l705084
1101.3H49108756m301787n094409o286025p918417r873152j1696458j2436628j1358261
1117.6G80143619q643747n427301k918362j576782j384794k252400l835559n455852
1133.9G48648822o518423o882549o782889o296515m871905j531065M089058J0736823
1150.2G30591357J5991926J7788827J5873075J1919558P952630N117000L613293K879441
$$ y = [858417630, 855537176, 852297723, 850099742, 850381255, 852998078, 856261373, 858576238, 859344602, 858422995, 855634987, 851094186, 845419288, 839380145, 833569050, 828353345, 823677063, 819238305, 815315247, 813053310, 813735008, 817897201, 825120270, 834117174, 843078375, 850536823, 855836451, 858950317, 860308588, 860492766, 859817147, 858303845, 855930567, 852813840, 849108756, 844806969, 839712560, 833426535, 825508118, 815634966, 803938508, 791501880, 780143619, 771499872, 766072571, 763154209, 761577427, 760192633, 757940233, 754104674, 748648822, 742130399, 735247850, 728464961, 722168446, 717296541, 715765476, 719854534, 730591357, 746583283, 764372110, 780245185, 792164743, 800117373, 805234373, 808847666, 811727107]
1166.5H11727107K312958J783907J238644P87199N89609K53141r49323l320158o001293
1184.9H08421791p256091n813479j878739L098309P491708J0307491J1485874J1613608
1201.2H37470472J1141658J0071993Q351206O071985L497839R85921j327456l424584
1217.5H72839034n295098p118106q922041j0349452j0995150j0929286j0458708r390295
1233.8G99380898p409214m673601j602292J378358L885507N444288N639792M619539
1250.1H06663275L133535J907349R23037k88963j651466k874851l943324m665137m587590
1268.5G94615865l111840j53124L334105O103158P363081P136047O121516N134881
1284.8H26543689N016863O075561P717252R124815R731889R503842Q723616P737279
$$ y = [811727107, 814040065, 815823972, 817062616, 817849815, 818439424, 818692565, 817743242, 814423084, 808421791, 801165700, 795352221, 793473482, 796571791, 804063499, 814370990, 825856864, 837470472, 848612130, 858684123, 867035329, 873107314, 876605153, 877591074, 876263618, 872839034, 867543936, 860425830, 851503789, 841154337, 830159187, 819229901, 808771193, 799380898, 791971684, 787298083, 785695791, 787074149, 790959656, 796403944, 802043736, 806663275, 809796810, 811704159, 812627196, 812338233, 810686767, 807811916, 803868592, 799203455, 794615865, 791504025, 791350901, 794685006, 800788164, 808151245, 815287292, 821408808, 826543689, 831560552, 837636113, 845353365, 854478180, 864210069, 873713911, 882437527, 890174806]
1301.1H90174806O799102N862832M829526L723741K640247J767993J105249N03063
1317.4I17406559P3671p7963j18374j78814j73629m1604J17719J49549K27809N72204
1337.8I17957127Q89242P42256J78814m73261j082837j465201j497746j449108j586795
1356.2I12212491j931310k496659k915025k309919j162648n82039r14037k140463l588259
1374.5H94172132m122972l655553k505184q62777O18756K017200L289938L497958L075361
1392.9H95524859K573431J866639J406550J069963L57866m98235j241922j914621k490461
1411.3H96654069k649128k587199l021062m019141m616201n575597o806374p492542
1427.6H59886825q122623o631732k481878K633810O317854M495800J117647j330436
$$ y = [890174806, 896973908, 902836740, 907666266, 911390007, 914030254, 915798247, 916903496, 917406559, 917480230, 917402267, 917283893, 917105079, 916931450, 916889846, 917007565, 917157114, 917384923, 917957127, 918846369, 919588625, 919767439, 919294178, 918211341, 916746140, 915248394, 913799286, 912212491, 910281181, 907784522, 904869497, 902559578, 901396930, 900814891, 899900854, 897760391, 894172132, 890049160, 886393607, 883888423, 883025646, 883644402, 885661602, 888951540, 892449498, 895524859, 898098290, 899964929, 901371479, 902441442, 902799308, 902301073, 901059151, 899144530, 896654069, 894004941, 891417742, 888396680, 884377539, 879761338, 874185741, 867379367, 859886825, 851764202, 845132470, 842650592, 845284402, 851602256, 856098056, 857215703, 855885267]
1443.9H55885267k034604l77715K214015L618836L736019M173637M987657L713667
1460.2H75916779K799213L437102M231214L794253L183723L124475K588332J594663
1476.5I00669754R38355L24131q1182L26395K032220N581856R110511Q444309O517112
1494.9I33863461N757213M356861K594888J366198N12540K44618P51674J015604R76383
1513.2I51439440P41303O40094O37770O42896O62446M68194M35293L71933J09613J19
1533.6I56149101J38402k503l46303o6221N03361O14286L07202J13368J50681L0935
1554I57592309j95802l56257R1613L94463J3769l38376n44488o88076p72655j401425
1574.4I53795075k425253j799464k06471Q45135J223445R46044L08931l73423r34124
$$ y = [855885267, 853850663, 853472948, 855686963, 859305799, 863041818, 867215455, 872203112, 875916779, 878715992, 882153094, 886384308, 890178561, 893362284, 896486759, 899075091, 900669754, 901608109, 901932240, 901851058, 902177453, 904209673, 909791529, 918902040, 927346349, 933863461, 939620674, 943977535, 946572423, 947938621, 948451161, 948695779, 949447453, 950463057, 951439440, 952180743, 952820837, 953458607, 954101503, 954763949, 955232143, 955667436, 956039369, 956148982, 956149101, 956287503, 956285000, 955938697, 955872476, 956375837, 956990123, 957297325, 957410693, 957561374, 957592309, 957396507, 957040250, 957131863, 957526326, 957540095, 957201719, 956657231, 955969155, 955196500, 953795075, 951369822, 949570358, 949363887, 950209022, 951432467, 952378511, 952687442, 952314019, 951379895]
1592.8I51379895j290858j241207o61611L03030J298487J573145J078904N80251L77119
1611.1I53397155K55287L7491m6492J8776j18494k36273o8128J21712J67907O4730
1631.5I53593671k05278l77894p8916P2539n1081k22445n31673m92096j22071l77118
1651.9I51207638p78437k85804j02341k69950m10855m68134n76497q74042j079440
1670.3I46362138j069904j462340j836717j779258j842261k232313k676964j948952
1686.6I31513429j413405j536489j690209k609431l745676m887700p629692q511782
1702.9H99489045j0855853j5994192j9630074k3197770k6914776l0313849l2889485
1717.2G39693046k5960148j3341069n383313P10905O222248J0420799J3435245J9906044
$$ y = [951379895, 950089037, 948847830, 948186219, 948489249, 949787736, 951360881, 952439785, 953020036, 953397155, 953652442, 953689933, 953643441, 953662217, 953543723, 953307450, 953239322, 953361034, 953528941, 953593671, 953388393, 953010499, 952931583, 953004122, 952953041, 952730596, 952198923, 951706827, 951584756, 951207638, 950429201, 950143397, 950041056, 949771106, 949360251, 948892117, 948315620, 947441578, 946362138, 945292234, 943829894, 941993177, 940213919, 938371658, 936139345, 933462381, 931513429, 930100024, 928563535, 926873326, 924263895, 920518219, 915630519, 908000827, 899489045, 888633192, 872639000, 853008926, 829811156, 802896380, 772582531, 739693046, 713732898, 700391829, 695008516, 695719421, 701941669, 712362468, 725797713, 745703757]
1733.5G45703757K4458051K0573675K3469150K7548611K6300013K4196327K1199823
1747.8I13449407J8162489J3902187Q566260N305350L799915K432585J628637J180768
1764.1I68427598O72400L01481J82330K18809L12924L01838Q4102l2126n9784q225
1784.5I70401347N7041p8141m35830m77135n7697J40727M7683k0444K65539L96072
1804.9I70239162J65463l8922l3080N8054J23799J07408N6326m589j70291k55227k09153
1827.3I70038950j02996R6440J55210P272q0406o3777q2553q4936N9604K00510J50562
1849.7I70293880J0907k7478M4525N3406M5121M3153k8968j59144j98066Q4579K83778
1872.2I70445693J13010o1870l6180J8537l516p3612q5890p2420p9215n2452n901Q4103
$$ y = [745703757, 770161808, 790735483, 814204633, 841753244, 868053257, 892249584, 913449407, 931611896, 945514083, 954080343, 959385693, 963185608, 965618193, 967246830, 968427598, 969099998, 969401479, 969583809, 969802618, 970115542, 970417380, 970501482, 970469356, 970409572, 970401347, 970458388, 970380247, 969944417, 969467282, 969409585, 969550312, 969597995, 969577551, 969843090, 970239162, 970404625, 970365703, 970332623, 970390677, 970514476, 970621884, 970678210, 970673621, 970503330, 970248103, 970038950, 969935954, 970032394, 970187604, 970194876, 970114470, 970050693, 969968140, 969883204, 969942808, 970143318, 970293880, 970304787, 970277309, 970321834, 970375240, 970420361, 970463514, 970434546, 970275402, 970077336, 970161915, 970445693, 970558703, 970496833, 970460653, 970479190, 970475674, 970402062, 970316172, 970243752, 970164537, 970112085, 970106184, 970190287]
1896.6I70190287Q4579k0028q0823p0930j21236j88649j22368o6221q2254r3877o4671
1919.1I69363809o0141m1962N6028O7890m0591j37865j27018n8889m6194p7546j34646
1941.5I68762875j44840n8710K98q226n9724o7710k8193j9253J6868J8776l9578n7697
1966I68314886n4717J1623J10388P4863m8637n0485L0100K1756p630N96r596o4194
1990.5I68328953m0055J18495J55389N2094N424L1531P1585J00911P8917M947k0445
2012.9I68887746j0132m9949k3365O6221K980j00434o9857l1471l7432l5345j2040
2035.3I68586922j1921p7546q7559J19M6194P391m2141m9412n1618o5386k4378M9174
2059.8I68279839O9677O8009P4148M0472j0669K0981P9929M2856k920m1962q8513n4061
$$ y = [970190287, 970274866, 970254838, 970174015, 970103085, 969981849, 969793200, 969670832, 969604611, 969522357, 969428480, 969363809, 969303668, 969261706, 969317734, 969385624, 969345033, 969207168, 969080150, 969021261, 968975067, 968897521, 968762875, 968618035, 968559325, 968559623, 968551397, 968491673, 968423963, 968395770, 968376517, 968393385, 968412161, 968372583, 968314886, 968260169, 968271792, 968382180, 968457043, 968408406, 968357921, 968388021, 968409777, 968402147, 968402743, 968393147, 968328953, 968288898, 968407393, 968562782, 968614876, 968620300, 968651831, 968723416, 968824327, 968903244, 968908191, 968887746, 968877614, 968827665, 968804300, 968870521, 968873501, 968773067, 968703210, 968671739, 968634307, 968598962, 968586922, 968575001, 968497455, 968409896, 968410015, 968456209, 968463600, 968421459, 968372047, 968320429, 968255043, 968230665, 968279839, 968349516, 968417525, 968491673, 968532145, 968521476, 968542457, 968622386, 968665242, 968662322, 968620360, 968531847, 968477786]
2084.3I68477786P450J2994n245J669J4662L6240M3392j6749m5001q524M4823J00732
2108.7I68664229L4392o7651k1339M3035K5689j1682j5319K39J2636J8477L398J0371
2133.2I68696475r418q0287l5107N9664O3718M3928k7478q9824k8610O8724N9486k7240
2157.7I68694031J5497J18435L1471j12414p0095L0636N6148O2108j4484j36912j60634
2180.1I68513787q2731P8976J48773J5914j16408j55031j28269l8147l279l9041j3768
2202.5I68180776J4245J6272K5451m0114r3340j7584Q8930R9361L1829j3709p2300
2225I68219817j62423j10507Q7380J80304J00434K3365K3783O8664R6560M3273k9683
2247.4I68540967o0142k7120P3970J08123M2676J7524K6226J4842k0504j7584N8294
$$ y = [968477786, 968485236, 968498230, 968492985, 968494654, 968509316, 968545556, 968588948, 968572199, 968527198, 968518674, 968563497, 968664229, 968698621, 968630970, 968609631, 968652666, 968678355, 968666673, 968651354, 968651593, 968664229, 968682706, 968686104, 968696475, 968687057, 968606770, 968571663, 968631327, 968695045, 968738973, 968711495, 968621671, 968593061, 968661785, 968721271, 968694031, 968709528, 968827963, 968859434, 968747020, 968676925, 968707561, 968763709, 968825817, 968811333, 968674421, 968513787, 968431056, 968510032, 968658805, 968674719, 968558311, 968403280, 968275011, 968236864, 968233585, 968194544, 968180776, 968195021, 968211293, 968236744, 968196630, 968103290, 968085706, 968174636, 968273997, 968305826, 968292117, 968219817, 968057394, 967946887, 968034267, 968214571, 968315005, 968338370, 968362153, 968430817, 968527377, 968570650, 968540967, 968480825, 968453705, 968527675, 968635798, 968678474, 968695998, 968722224, 968737066, 968716562, 968698978, 968757272]
2269.8I68757272Q1181M5538m053p3135j11162p7367k682J4483n006J3649L5048M589
2294.3I68678355o5386r6321p8976n7638j4246m5836j40368j61589j56939r8407L696
2316.7I67766345P2479J5557j20640j8060J76251J57952R2208J31309J08958J5378
2337.1I68397737j4604r1850k66910k73049q3685j2398J6213J80364K69353R7573p7725
2359.6I68141019K4617J08957j27494k10941r9540r3698j10269r9063k1874J01983
2380I67613697K19107K44736Q5652m9054J1742J10686J20341K5988p4387l2305M6253
2402.4I68322456l159n8532l2902M173N4955P6473J8060q1003j35958m5299P5042P9751
2426.9I68274057L9399K8014M5240N960m5359J2875N6088J0073j0848L1709Q2672O0856
$$ y = [968757272, 968838453, 968883991, 968879938, 968806803, 968695641, 968618274, 968615592, 968630075, 968625069, 968638718, 968673766, 968678355, 968612969, 968516648, 968437672, 968380034, 968365788, 968319952, 968179584, 968017995, 967861056, 967762649, 967766345, 967838824, 967854381, 967733741, 967715681, 967891932, 968049884, 968142092, 968273401, 968382359, 968397737, 968383133, 968291283, 968024373, 967751324, 967667639, 967655241, 967671454, 967851818, 968121171, 968218744, 968141019, 968165636, 968274593, 968147099, 967936158, 967836618, 967742920, 967632651, 967533588, 967511714, 967613697, 967832804, 968077540, 968163192, 968114138, 968125880, 968236566, 968356907, 968382895, 968308508, 968276203, 968322456, 968319297, 968260765, 968227863, 968232036, 968286991, 968363464, 968381524, 968300521, 968164563, 968119264, 968194306, 968274057, 968313456, 968341470, 968386710, 968392670, 968347311, 968360186, 968416274, 968426347, 968415499, 968447208, 968529880, 968590736]
2451.3I68590736j6331m3750r954J4067K0921L7968J4484k9087J3173L5166p7665j01804
2475.8I68447924j2219j0610n066J0371j848J490j9073k4796l0637m8458o0320p3910
2500.3I68172848o6101p0870o6161L4034J40607J08361n4240j56462j7703J28508L7253
2522.7I68190074q2195l6657M6075K5928o438l635k4498n8234o9856k9862M2557L9161
2547.2I68032420j2458J8895K5868m5597o0856l4452m8280m4763j4067p0989j27852
2569.6I67617869o4313J1802N9366P4923K0444k0563l6419q3387j03175q4818k7179
2592.1I67364550O3777Q3506L0756k4736m3154m8518o7055q822L4213k2650K98P3016
2616.5I67435181Q1062Q1122M8817j4186J1801O5029j5676j00076n5730J9013N8592
$$ y = [968590736, 968574405, 968530655, 968520701, 968534768, 968555689, 968593657, 968608141, 968579054, 968592227, 968627393, 968549728, 968447924, 968435705, 968425095, 968420029, 968430400, 968428552, 968430042, 968410969, 968386173, 968355536, 968307078, 968246758, 968172848, 968106747, 968035877, 967969716, 968003750, 968144357, 968252718, 968198478, 968042016, 968024313, 968152821, 968190074, 968107879, 968071222, 968117297, 968143225, 968136787, 968133152, 968108654, 968050420, 967980564, 967950702, 967993259, 968032420, 968019962, 968038857, 968064725, 968019128, 967958272, 967923820, 967875540, 967830777, 967816710, 967745721, 967617869, 967553556, 967565358, 967624724, 967699647, 967720091, 967699528, 967663109, 967579722, 967476547, 967391729, 967364550, 967428327, 967511833, 967542589, 967517853, 967474699, 967426181, 967359126, 967350304, 967384517, 967361867, 967362165, 967435181, 967516243, 967597365, 967646182, 967631996, 967643797, 967708826, 967693150, 967593074, 967537344, 967556357, 967614949]
2639I67614949K5093n7339o0678m3094m5240K3603O2228L4213k9326p4446P749L3021
2663.4I67490733m5956m9591o7532j45793j11281o438K8193N1201O1631N603j6153
2685.9I67194617J0550k1279n484K5273q2493p5460O3539L6418n9962r5367j11044
2708.3I66879308q5771n5432p1764o7830k3783k8491m0233m9352o8128j371k0564j26243
2732.8I66240346l6001P3731j5318o4016M4704M8756o4909l9399o735r1016r0122j2517
2757.2I65987504J6391K38n0425q9288n0306j8418m0889l6955q2254j69397j77324
2779.7I65288877j54316j21057o7472r6858j69516j33454r1494j86800l16024l21508
2800.1I63630378k05815j45435k66731m25875m34756m10915m85599n14924m34637m40777
$$ y = [967614949, 967640042, 967582703, 967522025, 967478931, 967433691, 967457294, 967519522, 967553735, 967524409, 967449963, 967457712, 967490733, 967444777, 967395186, 967327654, 967181861, 967070580, 967064142, 967092335, 967143536, 967205167, 967210770, 967194617, 967205167, 967183888, 967178404, 967203677, 967121184, 967045724, 967109263, 967145681, 967085719, 966990352, 966879308, 966793537, 966738105, 966666341, 966598511, 966574728, 966546237, 966506004, 966456652, 966388524, 966387153, 966366589, 966240346, 966204345, 966278076, 966262758, 966198742, 966243446, 966292202, 966227293, 966187894, 966181159, 966090143, 966000021, 965987504, 966003895, 966004133, 965953708, 965864420, 965814114, 965795696, 965754807, 965717852, 965635598, 965466201, 965288877, 965134561, 965013504, 964946032, 964849174, 964679658, 964546204, 964454710, 964267910, 963951886, 963630378, 963424563, 963279128, 963012397, 962586522, 962151766, 961740851, 961255252, 960740328, 960305691, 959864914]
2820.5I59864914n80966p37548r15706j135588j387179j627445j899004k295315k626658
2838.8I46659505k706468k754688l056765l270566k773881j726866p26640O6876O58989
2857.2I30369496R40085Q19921L44634k66373p99000r50992m50969M23670J118421
2875.5I31548893J375139J162648N44489j81973p75635j285196j662791j883924k104163
2893.9I26737487k273082k297640k314508k469659k630115k574265k511918k769053
2910.2I06897247l162742l291905l082454k740443k245784j452267n28574L37243J190424
2928.5H91920745K014101K562165K635896K256692J464307J87874j537502l137469
2944.9H98366809l760219l148257j703918Q3863J797736L202558M295289N070090N600214
$$ y = [959864914, 959283948, 958546400, 957630694, 956495106, 955107927, 953480482, 951581478, 949286163, 946659505, 943953037, 941198349, 938141584, 934871018, 932097137, 930370271, 929643631, 929710507, 930369496, 931309581, 932129502, 932474136, 932207763, 931408763, 930457771, 930006802, 930430472, 931548893, 932924032, 934086680, 934631169, 934449196, 933673561, 932388365, 930725574, 928841650, 926737487, 924464405, 922166765, 919852257, 917382598, 914752483, 912178218, 909666300, 906897247, 903734505, 900442600, 897360146, 894619703, 892373919, 890921652, 890393078, 890730321, 891920745, 893934846, 896497011, 899132907, 901389599, 902853906, 903041780, 901504278, 898366809, 894606590, 891458333, 889754415, 889838278, 891636014, 894838572, 899133861, 904203951, 909804165]
2963.2I09804165N896569N856752N601823N092383M176736L185510K379239J597464
2979.5I43590641P99656K07007o3777o1929J17361K37942K93851N43833R18865J147747
2999.9I47731197J270354J454413J586735J548409J439810J389742J301229J051366
3016.2I58773255Q62062Q44121Q26717P74026P11619O25492O55055P50422O70672N34892
3036.6I66028333N14865N16832M51028L19362J92046K00450K48432J82927J23084J08957
3057I68886316J17302R7573k8611q3506k3901K2471P0035P3254K5690M2200J25647
3079.4I69324470Q5830r3341o7651J44541J58131K3902K5034K9743o8427l2782R8824
3101.9I69628274J36912R4831r53o8307n2035n8830j03712q6308O438R6917R8169J8954
$$ y = [909804165, 915700734, 921557486, 927159309, 932251692, 936428428, 939613938, 941993177, 943590641, 944390297, 944597304, 944533527, 944471598, 944588959, 944826901, 945120752, 945664585, 946583450, 947731197, 949001551, 950455964, 952042699, 953591108, 955030918, 956420660, 957721889, 958773255, 959635317, 960479438, 961306155, 962080181, 962791800, 963417292, 964072347, 964822769, 965493441, 966028333, 966543198, 967060030, 967511058, 967830420, 968022466, 968222916, 968471348, 968654275, 968777359, 968886316, 969003618, 969101191, 969072580, 968989074, 968965173, 968987644, 969057679, 969130933, 969156623, 969198823, 969324470, 969410300, 969316959, 969249308, 969393849, 969551980, 969575882, 969600916, 969630659, 969562232, 969529450, 969628274, 969765186, 969860017, 969859064, 969790757, 969738722, 969679892, 969576180, 969489872, 969496310, 969593227, 969691396, 969710350]
3126.3I69710350n7280k1219R1970J08003j2517j09911o9499p391K9803M2915l8028
3148.8I69667196j18971q1837K8074N0724q464m0233q1301m0651N3227n4717k17676
3171.2I69155371j73747l0935J02162J88172R1791n7876o5744p3492r3222O676R6380
3193.6I69145536L7194q5235r3400K7179P2003P271k9206o1095r6559p8440j9669L7491
3218.1I68863070N4598M2260L2723O9916J21712K7836q7559l2425m18k1696K8253P7844
3242.6I69176114K9385q0586l1709O4075N960J9670N6326l0458p9393j11342j08957
3265I68909085m17L6120l7551n2512m708Q642M6611J12712P8202j4663p6890j04845
3289.5I68899786l9756M0293o5088j45734N6386J62423p570j88947k36332l636K33293
$$ y = [969710350, 969653070, 969631851, 969723821, 969831824, 969819307, 969709396, 969639897, 969632506, 969662309, 969705224, 969667196, 969548225, 969466388, 969494462, 969545186, 969536722, 969496489, 969415188, 969374537, 969427764, 969373047, 969155371, 968981624, 968950689, 969052851, 969241023, 969332814, 969274938, 969209194, 969135702, 969042480, 969049156, 969145536, 969182730, 969097495, 969004095, 969031274, 969103277, 969110548, 969081342, 969020247, 968923688, 968845248, 968825579, 968863070, 968917668, 968959928, 968992651, 969062567, 969184279, 969212115, 969124556, 969092131, 969091713, 969070017, 969098270, 969176114, 969205499, 969124913, 969093204, 969157279, 969163239, 969182909, 969239235, 969208777, 969129384, 969018042, 968909085, 968908668, 968944788, 968907237, 968854725, 968850017, 968858659, 968905270, 969017982, 969096184, 969081521, 969004631, 968899786, 968860030, 968900323, 968835235, 968689501, 968745887, 968908310, 968900740, 968711793, 968475461, 968471825, 968705118]
3311.9I68705118J32322J0252K9922K5510J8657M5180K6464p6234r6381K3604M77n6506
3336.4I68788385Q3149R0122n0127L397J71900J76549L2067j907M8995n3764k04503
3358.8I69084263j59383K4319J85609J71959o2406k57671j50919J33932J84893M6730
3379.2I69201326N2631J073j53422q0586p867j10269m3035J10984L9637j60694j91927
3401.7I68657851n3525P6711K01166J72436j7404j05918m9829k1935n2988L6776P0631
3424.1I68913972j39594k71380j52230J550J6391l3379j6689J2219N3525J28687J38700
3446.5I68651772J51991J90735J86503J61767Q2195j9312Q226Q2373N3585K9802O1631
3469I69641268J07050J10150M2319Q404q643j6212P1108J01149Q762M4585J76310M9174
$$ y = [968705118, 968837440, 968847692, 968877614, 968903124, 968921781, 968966961, 968993425, 968917191, 968820810, 968844414, 968844891, 968788385, 968871534, 968961656, 968911529, 968914926, 969086826, 969263375, 969295442, 969293535, 969342530, 969288766, 969084263, 968924880, 968949199, 969134808, 969306767, 969244361, 968986690, 968835771, 968969703, 969154596, 969201326, 969253957, 969255030, 969101608, 969021022, 969013155, 968902886, 968859851, 968970835, 969010472, 968849778, 968657851, 968604326, 968681037, 968882203, 969054639, 969037235, 968931317, 968881488, 968859553, 968806565, 968843341, 968913972, 968774378, 968502998, 968350768, 968352318, 968368709, 968335330, 968318641, 968330860, 968384385, 968513072, 968651772, 968803763, 968994498, 969181001, 969342768, 969424963, 969405651, 969413877, 969496250, 969549835, 969579637, 969641268, 969748318, 969858468, 969900787, 969909191, 969900548, 969884336, 969955444, 970056593, 970065355, 970109940, 970286250, 970335424]
3493.4I70335424k72036k92718L9935K71976K54691P4505k11894k49028J04785K21967
3513.8I70277607j9252l9995Q3805k9207j86264j23918K1338L5465J9073O1691J18196
3536.3I70218539J45734K5093k33471l74139l4630L78132J97768j04427l9935N4776
3556.6I70233440l8921o6102m4405k60294k21431M61340O19054Q9466j78218k8670
3577I70565259Q0705R2268O56k64585k72155J76072K68340R0122J49012J21713j12176
3599.5I70895231j29521r5964k30908j35303Q1361q9765j81675k1994q1837p7546J39535
3621.9I70071614J84417J8358j96576P8499M18603L63589K29537N7996n8651o6817
3642.3I71100569p0095k54453m73499J06335O93560M05967k1160l9816J64926K72334
$$ y = [970335424, 970063388, 969770670, 969810605, 970082581, 970337272, 970411777, 970199883, 969950855, 970055640, 970277607, 970258355, 970218360, 970302165, 970272958, 970086694, 969962776, 969984114, 970019579, 970038652, 970100343, 970218539, 970364273, 970389366, 970155895, 969781756, 969747126, 970125258, 970323026, 970218599, 970178664, 970233440, 970194519, 970128417, 970084012, 969823718, 969602287, 970063627, 970682681, 970772147, 970593929, 970565259, 970645964, 970738232, 970738888, 970474303, 970202148, 970378220, 970646560, 970736682, 970885694, 971007407, 970895231, 970765710, 970669746, 970438838, 970303535, 970384896, 970295131, 970113456, 970091462, 970009625, 969932079, 970071614, 970256031, 970274389, 970077813, 970156312, 970574915, 970938504, 971168041, 971226037, 971167386, 971100569, 971030474, 970776021, 970302522, 970408857, 971102417, 971508384, 971487224, 971447408, 971612334, 971884668]
3662.7I71884668J61946j33336k52724J03057R4473l59118l3259N04136L21448K0027
3683.1I72311318l9339j12832j65462J43170K56419N8770L577R9480J62721J07407
3703.5I72825229k0623q7142j81019k25187Q4997L02016J38343j47164l26693l53754
3723.9I72009003r2506L34203L41475k43604p62999j75059O26862M25220j56105l50237
3744.3I71956253m1544j21713k90752J88768M87447K95520J71065K19167J09553q1241
3764.7I72892523o0320Q5294J13070p510m8757k8193m5418P3671K7001k26379j35481
3787.1I72639501J22011J83821Q2075j45554j94848n4300J2756K05338L23176K52604
3807.5I73426580O6936k11834l38674j67251o4432l25382k31683L01361L88980J44362
$$ y = [971884668, 972046614, 971913278, 971660554, 971763611, 971858084, 971498966, 971465707, 971969843, 972291291, 972311318, 972271979, 972159147, 971993685, 972136855, 972393274, 972452044, 972455621, 972555101, 972717822, 972825229, 972804606, 972717464, 972536445, 972311258, 972396255, 972698271, 972836614, 972689450, 972362757, 972009003, 971916497, 972250700, 972592175, 972348571, 971585572, 971410513, 972037375, 972462595, 972306490, 971956253, 971914709, 971792996, 971502244, 971691012, 972178459, 972473979, 972645044, 972864211, 972973764, 972892523, 972832203, 972917497, 973030567, 973023057, 972974300, 972946107, 972900689, 972974360, 973001361, 972774982, 972639501, 972761512, 972945333, 973027408, 972881854, 972687006, 972632706, 972645462, 972850800, 973173976, 973426580, 973493516, 973281682, 972943008, 972775757, 972711325, 972385943, 972154260, 972455621, 972844601, 972988963]
3827.9I72988963R060Q9228R1016l3676k42472m09245j77145K23577M25338L71099
3848.3I73335743L2067n40495l84867L63886L20316p2479l02196j84715O6102P3671
3868.7I72707033n1021L9577K56956J94668j97529k62738p927k1756K981j8061p0333
3891.1I72571850J70469J98901j33038l01420j88113r3817J70946M35412K76506o0499
3911.5I73047197k11239j70469J2278K17259J91570M7564J6809o8903k16127q166K89381
3933.9I73147154K62916J21355j25885k68459r8169P391m709J16885J80781O3002m9353
3956.3I73352909j22249p4804J53363K28107L2246q4043j09553j13428L6598J13845
3976.7I73412991l1352j22250K742Q8930L5107J5498P1883L3557j11460r5368
$$ y = [972988963, 972998023, 973087251, 973178267, 973144591, 972902119, 972492874, 972315729, 972539306, 972964644, 973335743, 973367810, 972827315, 972442448, 972806334, 973126650, 973054171, 972751975, 972567260, 972633362, 972707033, 972656012, 972695589, 972952545, 973147213, 972949684, 972686946, 972679019, 972657263, 972660244, 972642183, 972571850, 972742319, 972941220, 972808182, 972506762, 972318649, 972224832, 972395778, 972831190, 973107696, 973047197, 972835958, 972665489, 972677767, 972895026, 973086596, 973134160, 973150969, 973082066, 972865939, 972857773, 973147154, 973410070, 973531425, 973405540, 973137081, 973038912, 973046303, 973041594, 973158479, 973339260, 973402262, 973352909, 973230660, 973155856, 973309219, 973537326, 973569572, 973485529, 973375976, 973262548, 973299146, 973412991, 973381639, 973259389, 973262131, 973351061, 973386168, 973401666, 973473549, 973507106, 973395646, 973300278]
3997.1I73300278
$$ y = [973300278]
##END=$$ End of the data block
