##TITLE=$$ Begin of the data block
##JCAMP-DX=5.00 $$ ACD/SpecManager v 10.08
##SPECTROMETER/DATA SYSTEM=Alpha
##DATE=22 Dec 2014 10:36:42
##DATA TYPE=INFRARED SPECTRUM
##DATA CLASS=XYDATA
##ORIGIN=
##OWNER=
##NPOINTS=1765
##FIRSTX=399.76428223
##LASTX=3997.64306641
##MAXX=3997.64306641
##MINX=399.76428223
##MAXY=0.84440982
##MINY=0.33651859
##XFACTOR=1.0000000000
##YFACTOR=1.000000000000000e-9
##FIRSTY=0.62419474
##DELTAX=2.03961372
##XUNITS=1/CM
##YUNITS=ARBITRARY UNITS
##XYDATA=(X++(Y..Y))
399.8F24194741l438830k793372k007901o87719K93553P72715J550674J677513L89159
418.1F19950533j117110j375854j340926j662612k385199k786577k505839k246678
434.4F04529738j672923k27988J549244L309906M106521L508628K591788J961649J631379
452.8F21287942J223624J11401j352966j538873j195431j719772k667904k951384k656162
471.2F08540475k541899k320111k028525j734555r33230k31206j76489o3718J97232
489.5E98707974L4571o99520j492084j646101j327515j425624k211868k849162k753317
507.9E84337354k492011k934813l749133m215717m037618l419996l049850k577305
524.2E57860911j396358j59383K35677K38418J047433K982855M910171N493939M507005
$$ y = [624194741, 620755911, 617962539, 615954638, 615266919, 615560472, 616333187, 617883861, 619561374, 619950533, 618833423, 617457569, 616116643, 614454031, 612068832, 609282255, 606776416, 604529738, 602856815, 602628827, 604178071, 607487977, 611594498, 615103126, 617694914, 619656563, 621287942, 622511566, 622622967, 621270001, 619731128, 618535697, 616815925, 614148021, 611196637, 608540475, 605998576, 603678465, 601649940, 599915385, 598982155, 598750949, 598574460, 598510742, 598707974, 598742545, 598043025, 596550941, 594904840, 593577325, 592151701, 589939833, 587090671, 584337354, 581845343, 578910530, 575161397, 570945680, 566908062, 563488066, 560438216, 557860911, 556464553, 556305170, 556540847, 556779265, 557826698, 560809553, 565719724, 571213663, 575720668]
542.5E75720668K968609J886428Q23617p19965j917183k133549k192258l173650m461348
560.9E66801369n015611n171895n961240o960988o205141l490985n45442J472056K870440
579.3E37792563M664362O640553P333398O240189M410625L023922K223969J294493
595.6E73624074M77o27279j03354M79400K25782k28405L36230J618504K195061J897573
616E79418063K023041L085673M043937L942370L141284K811671L061771K951741K106905
634.3F06586456J307965J304209J687229J470506O78122M49478J172960J756013J312077
652.7F17725015N87642O61492J287699J376748P20382K36392Q92103K325952J706302
671F27519727P33614R69708J740753J910746J294971Q07464R86517J234531P98702
$$ y = [575720668, 578689277, 580575705, 581399322, 580679357, 578762174, 576628625, 574436367, 571262717, 566801369, 561785758, 556613863, 550652623, 543691635, 537486494, 533995509, 533450067, 534922123, 537792563, 542456925, 549097478, 556430876, 562671065, 567081690, 570105612, 572329581, 573624074, 573624551, 572997272, 572893918, 573373318, 573599100, 573370695, 573706925, 575325429, 577520490, 579418063, 581441104, 584526777, 588570714, 592513084, 595654368, 598466039, 601527810, 604479551, 606586456, 607894421, 609198630, 610885859, 612356365, 613034487, 613483965, 614656925, 616412938, 617725015, 618312657, 618974149, 620261848, 621638596, 622358978, 622595370, 623487473, 625813425, 627519727, 628253341, 629223049, 630963802, 632874548, 634169519, 634976983, 635963500, 637198031, 637996733]
689.4F37996733k07841r79662j116157j376867k254009l079295k972901j882613p49469
707.7F23377919o8188P66039K188564L607571M262030M437923M781723N317629N498290
726.1F54169500M920840M042626L585755L453732K943814J923203R53436L18647k93077
744.5F76018476j345813k646565l530503l795385l898024m151941m252136l688752
760.8F48709357k404869r20594N46456K297163M317760O171942P365823P680893P401943
779.1F81165874O854653O102264N106032M026830L333509L170729L245175L218532
795.4G16223598L132045L370642L752709L540099K713143K007902J759887J667917
811.8G38167942J276731O24538J45912P391j86265r27687k035200k838075l236473
$$ y = [637996733, 637788892, 636809230, 635693073, 634316206, 632062197, 628982902, 626010001, 624127388, 623377919, 623309731, 624075770, 626264334, 629871905, 634133935, 638571858, 643353581, 648671210, 654169500, 659090340, 663132966, 666718721, 670172453, 673116267, 675039470, 675992906, 676311553, 676018476, 674672663, 672026098, 668495595, 664700210, 660802186, 656650245, 652398109, 648709357, 646304488, 645383894, 645930350, 648227513, 652545273, 658717215, 666083038, 673763931, 681165874, 688020527, 694122791, 699228823, 703255653, 706589162, 709759891, 713005066, 716223598, 719355643, 722726285, 726478994, 730019093, 732732236, 734740138, 736500025, 738167942, 739444673, 740069211, 740215123, 740222514, 740036249, 739108562, 737073362, 734235287, 730998814]
830.1G30998814l768623m526853m963696m667759l983021l610134l638685l506005
846.4F98334038l018260k739668l188073m045606m467666l829300j789332J483500
862.8F76739633N056083P980883R837211J0268449R148002P209718N209387K977967
879.1G34427333K49267k373219l983736m574239m934311n356014n372822m720986l960669
897.4F99400604l854156m346907m822433n107343n672932o854832q155227q794009
913.7F51792765q725524q369625p645845o063998l762245j685679n19276Q1897R56058
932.1F16058528K282381L433466L952563M136443M304707L699482J245081k610623
948.4F36502028o305993q945286j0764540j2393236j3919115j4969647j5603542j6395271
$$ y = [730998814, 727230191, 722703338, 717739642, 713071883, 709088862, 705478728, 701840043, 698334038, 695315778, 692576110, 689388037, 685342431, 680874765, 677045465, 675256133, 676739633, 681795716, 689776599, 699613810, 709882259, 719030261, 726239979, 731449366, 734427333, 734676600, 732303381, 728319645, 723745406, 718811095, 713455081, 708082259, 703361273, 699400604, 695546448, 691199541, 686377108, 681269765, 675596833, 668742001, 660586774, 651792765, 643067241, 634697616, 627051771, 620987773, 617225528, 615539849, 615020573, 615102470, 616058528, 618340909, 621774375, 625726938, 629863381, 634168088, 637867570, 639112651, 636502028, 630196035, 621250749, 610486209, 598092973, 584173858, 569204211, 553600669, 537205398]
964.7E37205398j7554939j8641114j9282460j9590646j9808531j9742101j8875957
979D03709650j7008811j4487148j1831969r247750o708771m335522k401978j033843
995.3C36653858j35272N19156R74625J006395N01692k35617p20441q05259o20425j92672
1015.7C36946040N73159J550644K509952L288597L795057M144728M420221M438967
1032C61667365L919363K890885J841455J185894Q66145P72298J000732J746029L019243
1050.4C78909409M520446N991519P366150Q670241R922057J0916740J0856509Q481801
1066.7D45634872K890020m750937j0696053j1815608q729964m435510r87679J401753
1083D08510894L201931M653633N795568O503165O661922O332874N439073L882557K047628
$$ y = [537205398, 519650459, 501009345, 481726885, 462136239, 442327708, 422585607, 403709650, 386700839, 372213691, 360381722, 351133972, 344425201, 340089679, 337687701, 336653858, 336518586, 337037742, 338012367, 339018762, 339520454, 339284837, 338564396, 337759137, 337138712, 336946040, 337519199, 339069843, 341579795, 344868392, 348663449, 352808177, 357228398, 361667365, 365586728, 368477613, 370319068, 371504962, 372371107, 373143405, 374144137, 375890166, 378909409, 383429855, 389421374, 396787524, 405457765, 415379822, 426296562, 437153071, 445634872, 448524892, 443773955, 433077902, 421262294, 412532330, 408096820, 407109141, 408510894, 411712825, 416366458, 422162026, 428665191, 435327113, 441659987, 447099060, 450981617, 453029245]
1101.4D53029245Q06838Q23230J942694L273398M058093M282444M183412L683209K729267
1119.8D78811830J774401J470595K081186L189117M096657M255742L385663J398712
1136.1E00463903j584202m804313p143170q119315q120090p622182o681055n135983
1152.4D51253593l168464j341492J19269J568765L433674N664349P827401R660035
1168.7D75017130J1256040J2645959J3545812J3687372J3330757J2950480J2524903
1183E64958453J1656106J0141432Q304417O627679N144954L632784K256155J495242
1199.3F14217222J474619J762986J965642K259135K965629L889263M476785M404128
1215.6F37415409L867269L222227K417683J264274j0728r00567j232862j357675j584828
$$ y = [453029245, 453836083, 454659313, 456602007, 459875405, 463933498, 468215942, 472399354, 476082563, 478811830, 480586231, 482056826, 484138012, 487327129, 491423786, 495679528, 499065191, 500463903, 498879701, 494075388, 486932218, 478812903, 470692813, 463070631, 456389576, 451253593, 448085129, 446743637, 446862906, 448431671, 451865345, 457529694, 465357095, 475017130, 486273170, 498919129, 512464941, 526152313, 539483070, 552433550, 564958453, 576614559, 586755991, 595060408, 601688087, 606833041, 610465825, 612721980, 614217222, 615691841, 617454827, 619420469, 621679604, 624645233, 628534496, 633011281, 637415409, 641282678, 644504905, 646922588, 648186862, 648176134, 647275567, 646042705, 644685030, 643100202]
1234F43100202j756132j550436j019477m97997r7513M23312J159787J756966J883268
1252.3F43401980J624048J301944J091361R18150P31588P22229J093149J653016J873136
1270.7F54410601J465499P43628J85787j58012m87625p98464r36866q62777p68542
1289F52793229r41098j326263j590014j637756j653791j764893j850307j761020j571893
1307.4F38696194j419127j344443j273214j103044r48548j101435j690030k545952
1323.7F27270401l444016m233838m776656m847288m295171l271460k123058j123667
1340E99155247l49164K37227O17981N98073J94609j76370l39747m90963p50602j028060
1360.4E97668231j114667q31544n19157l82781j34289L84331R05931R17017O28591
$$ y = [643100202, 641344070, 639793634, 638774157, 638276160, 638178647, 638601959, 639761746, 641518712, 643401980, 645026028, 646327972, 647419333, 648337483, 649069071, 649791300, 650884449, 652537465, 654410601, 655876100, 656619728, 656805515, 656647503, 656159878, 655361414, 654424548, 653561771, 652793229, 651852131, 650525868, 648935854, 647298098, 645644307, 643879414, 642029107, 640268087, 638696194, 637277067, 635932624, 634659410, 633556366, 632607818, 631506383, 629816353, 627270401, 623826385, 619592547, 614815891, 609968603, 605673432, 602401972, 600278914, 599155247, 598806083, 599043310, 599661291, 600259364, 600453973, 600277603, 599937856, 599446893, 598696291, 597668231, 596553564, 595722020, 595202863, 594820082, 594685793, 595070124, 595976055, 596893072, 597521663]
1378.8E97521663N64336J087785K340675L812492M041135K959370K004564J136840
1395.1F15468860O9260p80999j068533j080811j305699j626253j763106j648366j340389
1413.5F04923964j067460r58085p26223j74999K97844N40257P27474J057804J367032
1431.8F05987608J464665J672864J815021J597941J563132J383722Q88646K86758k94745
1450.2F16365612p46310j073241j587153j626909m00006P41660K048016L337860M152715
1468.5F21212244N674779Q391738Q979023P583558O790698O482124O157279N423963
1484.9F76695406N111039N341232N051792L812849L308594L712297L544926K834261
1501.2G09412396K294660K478301L199160K370358J568556J504659J577735J735091
$$ y = [597521663, 598085999, 599173784, 601514459, 605326951, 609368086, 612327456, 614332020, 615468860, 615538120, 614757121, 613688588, 612607777, 611302078, 609675825, 607912719, 606264353, 604923964, 603856504, 602898419, 602172196, 601997197, 602295041, 602835298, 603562772, 604620576, 605987608, 607452273, 609125137, 610940158, 612538099, 614101231, 615484953, 616373599, 616660357, 616365612, 615619302, 614546061, 612958908, 611331999, 610931993, 611673653, 613721669, 617059529, 621212244, 626887023, 635278761, 644257784, 651841342, 658632040, 665114164, 671271443, 676695406, 681806445, 687147677, 692199469, 696012318, 699320912, 703033209, 706578135, 709412396, 711707056, 714185357, 717384517, 719754875, 721323431, 722828090, 724405825, 726140916]
1517.5G26140916J667977J584530J298666J028359J047015R20891Q09253O71029M63366
1535.8G35632002M99308O71924K06470k04801j66655j05619j45913k58386k56479j57594
1556.2G35714257k62678p96378q03172o27220m31359l80933o33597p13945n91039o49631
1576.6G29824305q19445q80838r29176r21429j037061j319051j606583j722515j758158
1595G18830049j898110k180159k461255k572655k641917k885043l290773l440320l270209
1613.4F94189608l543436m176140l478349k825319k994180k955198k924502k823591
1629.7F68468893k070725j324237j101553r13978m69148P0393O12974J254201J648426
1648F66175246J358092K160549L823161K761960K252162K960205L881812L989220L307879
$$ y = [726140916, 727808893, 729393423, 730692089, 731720448, 732767463, 733688354, 734497607, 735168636, 735632002, 736131310, 736803234, 737009704, 736804903, 736638248, 736532629, 736386716, 736128330, 735871851, 735714257, 735451579, 734655201, 733852029, 733224809, 732793450, 732412517, 731778920, 731064975, 730473936, 729824305, 729004860, 728124022, 727194846, 726273417, 725236356, 723917305, 722310722, 720588207, 718830049, 716931939, 714751780, 712290525, 709717870, 707075953, 704190910, 700900137, 697459817, 694189608, 690646172, 686470032, 682991683, 680166364, 677172184, 674216986, 671292484, 668468893, 666398168, 665073931, 663972378, 663058400, 662589252, 662659645, 663272619, 664526820, 666175246, 667533338, 669693887, 673517048, 676279008, 678531170, 681491375, 685373187, 689362407, 692670286]
1666.4F92670286L687083M525900M009724L963947M221142L695786L490328M006386
1682.7G24270582M976511M044056L235042L396929K969682K916038L035188K867579
1699G51711607L100693K266765J693725J847566J777887J668572J548767J492858J643837
1717.4G68752277J326442Q03947P83563J133442J484930J661480J514673J584709J620471
1735.7G80665934J348615J440346J431108J344561J559794J855731K022803J922905
1752G93591797J689792J791060J840234J538396J427471J321078J219928J196146J058817
1770.4H06674719R90808R56535Q52049P58946O47187O15179P25270P78079O67333O15180
1790.8H14281285P25508P08997N89192M92155M86374O10054O82175N73039M13835M43637
$$ y = [692670286, 696357369, 700883269, 704892993, 708856940, 713078082, 716773868, 720264196, 724270582, 729247093, 733291149, 736526191, 739923120, 742892802, 745808840, 748844028, 751711607, 754812300, 757079065, 758772790, 760620356, 762398243, 764066815, 765615582, 767108440, 768752277, 770078719, 770882666, 771666229, 772799671, 774284601, 775946081, 777460754, 779045463, 780665934, 782014549, 783454895, 784886003, 786230564, 787790358, 789646089, 791668892, 793591797, 795281589, 797072649, 798912883, 800451279, 801878750, 803199828, 804419756, 805615902, 806674719, 807665527, 808622062, 809474111, 810233057, 810880244, 811495423, 812220693, 812998772, 813666105, 814281285, 815006793, 815715790, 816304982, 816797137, 817283511, 817893565, 818575740, 819148779, 819562614, 820006251]
1811.2H20006251N71967N93483M61876L40939L78013N12659N36680L53217K65122L36885
1831.6H24357092L67046L18229K34246J73450K12192L12686K32041L3498O0916K21610
1852H26523006K37822J06693L7312J35422K30074J90496R6024J20639K36094K24769
1872.4H28138351J15037M7505J15872K35736K81096K12669J51873K34007L22819K28405
1892.8H30083370P1585N2691J58310K08378Q5890n1379K920J69695J83761J3530o2048
1915.2H30916703P8976J95384J05798j2398n960J06931J54972P2300k6345j9074Q7500
1937.7H31654787R7394J8954K8253J20938J82390J46568M6909K1636J31309K33293
1958.1H32682431J73807K7954L3141J66475J81079M2260j2100Q9407J49429O4969n8472
$$ y = [820006251, 820578218, 821171701, 821633577, 821974516, 822352529, 822865188, 823401868, 823755085, 824020207, 824357092, 824724138, 825042367, 825276613, 825450063, 825662255, 825974941, 826206982, 826240480, 826301396, 826523006, 826760828, 826867521, 826904833, 827040255, 827270329, 827460825, 827556849, 827677488, 827913582, 828138351, 828253388, 828300893, 828416765, 828652501, 828933597, 829146266, 829298139, 829532146, 829854965, 830083370, 830154955, 830207646, 830365956, 830574334, 830660224, 830608845, 830611765, 830781460, 830965221, 830978751, 830916703, 830995679, 831191063, 831296861, 831284463, 831278503, 831385434, 831540406, 831612706, 831586361, 831567287, 831654787, 831752181, 831771135, 831799388, 831920326, 832102716, 832249284, 832296193, 832317829, 832449138, 832682431, 832856238, 832884192, 832917333, 833083808, 833264887, 833307147, 833295047, 833384454, 833533883, 833598852, 833540380]
1980.5H33540380m9949O0141R2805J7106m3332j8239M2379N5253j5795j11222r9004
2002.9H33470523j9431p0572k20835k71857j85012j35422k56300m52757n35727n55932
2023.3H30766678n12719k06828L0577n8592j78337k53856l34144l26633k14457j34111
2043.7H28577578j65403k35915k21610j04249k0563l3736n3108j7524L0756M3809K9326
2066.2H27829361K9087M7028O2764M6372Q35Q464P1346R5189O5207M0591N3764J02520
2090.6H28452528J32858J00017P2837J21057J54793J30534J02163R0360J13964J29581
2111H29600692R6321M5061K1696N6028J01567O6340j8418m2021L993M7386K5630k8253
2135.5H29976022j2815O2943Q3744L8266O497L4988R1791J04189P8440O3300J10090
$$ y = [833540380, 833490431, 833550572, 833643377, 833660483, 833617151, 833598912, 833641291, 833696544, 833680749, 833569527, 833470523, 833451092, 833380520, 833159685, 832887828, 832702816, 832567394, 832311094, 831858337, 831322610, 830766678, 830253959, 830047131, 830077708, 830019116, 829840779, 829586923, 829252779, 828926146, 828711689, 828577578, 828412175, 828176260, 827954650, 827850401, 827829838, 827796102, 827742994, 827725470, 827756226, 827800035, 827829361, 827858448, 827905476, 827968240, 828014612, 828015447, 828023911, 828095257, 828190446, 828255653, 828296244, 828350008, 828452528, 828585386, 828685403, 828758240, 828879297, 829034090, 829164624, 829266787, 829357147, 829471111, 829600692, 829697013, 829742074, 829763770, 829819798, 829921365, 829987705, 829969287, 829927266, 829931259, 829978645, 830004275, 829976022, 829963207, 830026150, 830109894, 830148160, 830154657, 830189645, 830281436, 830385625, 830464065, 830527365, 830637455]
2157.9H30637455K09928K52187K04384J44303J72973L09705L92974L51608L13222L42548
2178.3H33331287L65138L05176K57373L03804L53635L32594K70962K65360L15786L10540
2198.7H36411655K50816K20120K41041K94984L06904K64347K40624K71558L24786K97785
2219.1H39124620K04861J83463K41757K62081J91868J09195J18375J97947K34425J66118
2239.5H41034710O0976P4089J78277J84596J13606J17064J96576K23875J19686Q941
2259.9H42312396M5061J65343K00391J15990Q0467J56164J99675J56641J03713Q7857
2280.3H43623698J16110J57058J34647P5996P7545J19210R0658j9312o6697o140L9280
2302.7H44342053J7822K920K3306K3722j6689n8770n4479P153M0948j1682q2732j36375
$$ y = [830637455, 830847383, 831099570, 831303954, 831448257, 831621230, 831930935, 832323909, 832675517, 832988739, 833331287, 833696425, 834001601, 834258974, 834562778, 834916413, 835249007, 835519969, 835785329, 836101115, 836411655, 836662471, 836882591, 837123632, 837418616, 837725520, 837989867, 838230491, 838502049, 838826835, 839124620, 839329481, 839512944, 839754701, 840016782, 840208650, 840317845, 840436220, 840634167, 840868592, 841034710, 841095686, 841169775, 841348052, 841532648, 841646254, 841763318, 841959894, 842183769, 842303455, 842312396, 842357457, 842522800, 842723191, 842839181, 842919648, 843075812, 843275487, 843432128, 843535841, 843623698, 843739808, 843896866, 844031513, 844107509, 844185054, 844304264, 844394922, 844375610, 844308913, 844302773, 844342053, 844359875, 844362795, 844386101, 844409823, 844393134, 844334364, 844279885, 844287038, 844327986, 844316304, 844233572, 844097197]
2327.2H44097197j13010k3842p0095k21908k58983j88887j40667q1658J5914l9815
2347.6H42974246k06948k56061j57357n2809n0247j55866k12968j31309j4126K5570
2368H41762125j2099o8307j20998j13010n0724m5836p7605o5207n3287q3923j33395
2390.4H40937734j62959j52350j48356j83344k18212k05756j73270k02060k64883k86341
2410.8H38940203k79248k92480l47495l60489l12864l07381l57867m02331l93629l66032
2431.2H35520387l79801m11093m13120m04537m02212m01437m25041m45485m16041l89158
2451.6H31432462m16875m40776m14968l81410l89576m04596l79503l35813l24368l85404
2472H27559173m39942m00841l25799l05295l46959l66270k92897k12789k57432l45648
$$ y = [844097197, 843984187, 843960345, 843890250, 843668342, 843409359, 843220472, 843079805, 842998147, 843014061, 842974246, 842767298, 842511237, 842353880, 842301071, 842250824, 842094958, 841881990, 841750681, 841736555, 841762125, 841750026, 841681719, 841560721, 841447711, 841396987, 841351151, 841273546, 841208339, 841155052, 841071129, 840937734, 840774775, 840622425, 840474069, 840290725, 840072513, 839866757, 839693487, 839491427, 839226544, 838940203, 838660955, 838368475, 838020980, 837660491, 837347627, 837040246, 836682379, 836280048, 835886419, 835520387, 835140586, 834729493, 834316373, 833911836, 833509624, 833108187, 832683146, 832237661, 831821620, 831432462, 831015587, 830574811, 830159843, 829778433, 829388857, 828984261, 828604758, 828268945, 827944577, 827559173, 827119231, 826718390, 826392591, 826087296, 825740337, 825374067, 825081170, 824868381, 824610949, 824265301]
2492.4H24265301l29852k25603j42098j78635k90752k81333j46866j20700k42591l13043
2512.8H21993828k45154j59204k11954l66628l83199k70784k66790m00722n00739m31537
2533.2H18757117l16143l72470n48780n76853m02332k93612m18306n97775n57482l63707
2553.6H14309657l33071m94599n65708m35412l19123l78728n06461n17666l75152k78115
2574H10105622l93689n51224n10275l38018k94208m55082n36144l31878j34886k20835
2594.4H06339383m01318l84211k21313j79886l28780m81545m37022l21984m01318o11842
2614.8H02570164o85394n59687m98653o74069q73744q44240o77169o45637q15153r63092
2635.2G95333326q84116p06613p21395r05633r60171q23140p25806q11815r29356q75831
$$ y = [824265301, 823935449, 823709846, 823567748, 823389113, 823098361, 822817028, 822670162, 822549462, 822306871, 821993828, 821748674, 821589470, 821377516, 821010888, 820627689, 820356905, 820090115, 819689393, 819188654, 818757117, 818440974, 818068504, 817519724, 816942871, 816540539, 816246927, 815828621, 815230846, 814673364, 814309657, 813976586, 813481987, 812916279, 812480867, 812161744, 811783016, 811276555, 810758889, 810383737, 810105622, 809711933, 809160709, 808650434, 808312416, 808018208, 807563126, 807026982, 806695104, 806560218, 806339383, 805938065, 805553854, 805332541, 805152655, 804823875, 804342330, 803905308, 803583324, 803182006, 802570164, 801884770, 801325083, 800826430, 800152361, 799278617, 798434377, 797757208, 797111571, 796296418, 795333326, 794449210, 793742597, 793021202, 792115569, 791155398, 790332258, 789606452, 788794637, 787865281, 786989450]
2655.6G86989450p37369p21037q47697r02295p42078n94735o80983q40962q14796o18279
2676G79489219n23925o45101p79032p07508n34534n52952p11680p74204p01309o12497
2696.4G72946477o81162q70943r17315p79868p37130q71718r52244q33392o67453o82771
2716.8G64952481q23260q38577p10726o48201o97910p41601o80149n31733m93228o15776
2737.2G58171320o64711n40316m12822m65572o40929o74784n36084m43756m61698m84526
2757.6G52846122m32432l41535l50534m80950n38409m56691m05967n05030o73056p19309
2778G47942209o34491o02961p11262q31306q38816q28087r06706j031638j106977j102448
2798.4G39347517j108229j209855j361608j411379j328468j340687j533807j666486
$$ y = [786989450, 786252081, 785531044, 784683347, 783781052, 783038974, 782444239, 781763256, 780922294, 780107498, 779489219, 778965294, 778320193, 777541161, 776833653, 776299119, 775746167, 775034487, 774260283, 773558974, 772946477, 772265315, 771394372, 770477057, 769697189, 768960059, 768088341, 767136097, 766302705, 765635252, 764952481, 764129221, 763290644, 762579918, 761931717, 761233807, 760492206, 759812057, 759280324, 758787096, 758171320, 757506609, 756966293, 756553471, 756087899, 755446970, 754772186, 754236102, 753792346, 753330648, 752846122, 752413690, 752072155, 751721621, 751240671, 750702262, 750245571, 749839604, 749334574, 748661518, 747942209, 747307718, 746704757, 745993495, 745162189, 744323373, 743495286, 742588580, 741556942, 740449965, 739347517, 738239288, 737029433, 735667825, 734256446, 732927978, 731587291, 730053484, 728386998]
2814.7G28386998j628458j579702j657069j802742j882971j904666j947761k051353
2831G13932276k173186k229809k260566k416253k697647k927720l045380l116668l149330
2849.3F89915717l040195k740383k399564k206087k266467k580642k979458l361225
2865.7F68341696l799319m224837m495680m646182m724205m631758m301965l785252
2882F33732498l160954k528846j945913j404762r46224o81996o34015o61909o92368
2900.3F21075511q11040j023651j295805j633703k001703k387464k823711l276825
2916.6F05821609l549218l510117l211737k731860k088368j309037n00560M26770J553893
2935E90901375K656519L542185M204810M674613M929781M988611N001783N061686N048216
$$ y = [728386998, 726758540, 725178838, 723521769, 721719027, 719836056, 717931390, 715983629, 713932276, 711759090, 709529281, 707268715, 704852462, 702154815, 699227095, 696181715, 693065047, 689915717, 686875522, 684135139, 681735575, 679529488, 677263021, 674682379, 671702921, 668341696, 664542377, 660317540, 655821860, 651175678, 646451473, 641819715, 637517750, 633732498, 630571544, 628042698, 626096785, 624692023, 623745799, 623063803, 622429788, 621767879, 621075511, 620264471, 619240820, 617945015, 616311312, 614309609, 611922145, 609098434, 605821609, 602272391, 598762274, 595550537, 592818677, 590730309, 589421272, 588920712, 589347482, 590901375, 593557894, 597100079, 601304889, 605979502, 610909283, 615897894, 620899677, 625961363, 631009579]
2953.4F31009579M927456M859448M873573M766763M430472M071355L830016L623545
2969.7F66392207L478289L378689L231406L129959L041566K810776K526164K287507
2986F90276563K064526J899481J743436J472950J182079R21846O58035M49657K32578
3004.4G00901151m0531k08736k89619n24342q81135j136661j264274j377106j481414
3022.7F93697333j575350j705587j769007j719296j729130j941026k143979k056956
3039F79057002j901507k023101k311886k409875k277553k231419k343655k400398k390325
3057.4F58767283k406240k421557k376259k294957k344788k522170k585232k458454
3073.7F39357626k255618k181769k355992k551794k584279k601504k589643k524436
$$ y = [631009579, 635937035, 640796483, 645670056, 650436819, 654867291, 658938646, 662768662, 666392207, 669870496, 673249185, 676480591, 679610550, 682652116, 685462892, 687989056, 690276563, 692341089, 694240570, 695984006, 697456956, 698639035, 699560881, 700218916, 700668573, 700901151, 700860620, 700651884, 700362265, 699837923, 698956788, 697820127, 696555853, 695178747, 693697333, 692121983, 690416396, 688647389, 686928093, 685198963, 683257937, 681113958, 679057002, 677155495, 675132394, 672820508, 670410633, 668133080, 665901661, 663558006, 661157608, 658767283, 656361043, 653939486, 651563227, 649268270, 646923482, 644401312, 641816080, 639357626, 637102008, 634920239, 632564247, 630012453, 627428174, 624826670, 622237027, 619712591]
3090F19712591k619386k718865k547682k340257k397180k581238k588988k418220k371967
3108.4E97128808k521991k480269k245664k239466k435744k648115k772093k664864
3124.7E77120602k467453k401770k461493k503871k378345k184093k211928k469659
3141E58041990k590716k446950k286374k170324k101839k258003k484202k463520k322018
3159.4E36918044k256274k223909k179503k128900k115488k148509k128422k065718
3175.7E19671321k053499k045334k048134k072692k014339j892090j855672j914978
3192E03774583j963257j948655j858085j753659j710027j713365j719565j723229j713247
3210.3D87671494j676470j619070j539678j510262j569540j603633j563280j508028
$$ y = [619712591, 617093205, 614374340, 611826658, 609486401, 607089221, 604507983, 601918995, 599500775, 597128808, 594606817, 592126548, 589880884, 587641418, 585205674, 582557559, 579785466, 577120602, 574653149, 572251379, 569789886, 567286015, 564907670, 562723577, 560511649, 558041990, 555451274, 553004324, 550717950, 548547626, 546445787, 544187784, 541703582, 539240062, 536918044, 534661770, 532437861, 530258358, 528129458, 526013970, 523865461, 521737039, 519671321, 517617822, 515572488, 513524354, 511451662, 509437323, 507545233, 505689561, 503774583, 501811326, 499862671, 498004586, 496250927, 494540900, 492827535, 491107970, 489384741, 487671494, 485995024, 484375954, 482836276, 481326014, 479756474, 478152841, 476589561, 475081533]
3226.7D75081533j414448j266479j224697j443773j632870j515031j318544j194060
3243D64071631j116842j171380j311332j276582j075000j001805j117408j185894j108974
3261.3D53706414j016051r49800q03828o48529p59452j027197j144111j102716r90331
3279.7D45264399q85010q42511q61347q36909o74486o25491q54880j036078j033246
3298D37614441r55999p79420n99533o95706j063526j329064j310915j162350j077145
3316.4D28640783j064599j020044r16391q96782j111239j301498j232773j122951j036942
3334.8D18937564r34094j019955j189053j227856j255303j188457j035214j175940
3351.1D09911692j480907j469076j204937j077414j185864j217514r79096q58873j152844
$$ y = [475081533, 473667085, 472400606, 471175909, 469732136, 468099266, 466584235, 465265691, 464071631, 462954789, 461783409, 460472077, 459195495, 458120495, 457118690, 456001282, 454815388, 453706414, 452690363, 451740563, 450936735, 450288206, 449528754, 448501557, 447357446, 446254730, 445264399, 444379389, 443536878, 442675531, 441838622, 441164136, 440538645, 439683765, 438647687, 437614441, 436658442, 435879022, 435279489, 434583783, 433520257, 432191193, 430880278, 429717928, 428640783, 427576184, 426556140, 425639749, 424742967, 423631728, 422330230, 421097457, 419974506, 418937564, 418003470, 416983515, 415794462, 414566606, 413311303, 412122846, 411087632, 409911692, 408430785, 406961709, 405756772, 404679358, 403493494, 402275980, 401296884, 400438011, 399285167]
3369.4C99285167j517087j496821j184225j018167j053065j056999r54032p94172n51880
3387.8C89658719l14206m53442q62837q49038l64989j62810n94229r94146p65681l95596
3408.2C83901745l41743m05073m99994n25176l22789j87934k35051j27881J26749K45034
3428.6C81627887J50919J75983L73155K43843j31190j28150K21461M61757M81159M13239
3449C83890063M42564N82129P25388Q32260Q72433P85232Q01950J090855J209736Q28802
3469.4C92061412M14968N30869Q92847J113445J078874Q40843Q40157J056462J026243
3487.7C99856120R07719J024127J203716J267672J190841J161218J222819J053721
3504D08887953Q39233R97037J304149J459956J346350J118988J130193J384587J636117
$$ y = [399285167, 397768080, 396271259, 395087034, 394068867, 393015802, 391958803, 391004771, 390210599, 389658719, 389344513, 388891071, 388028234, 387179196, 386814207, 386651397, 386057168, 385063022, 384297341, 383901745, 383560002, 383154929, 382654935, 382129759, 381806970, 381619036, 381383985, 381256104, 381382853, 381627887, 381778806, 381954789, 382327944, 382571787, 382440597, 382312447, 382533908, 382995665, 383476824, 383890063, 384332627, 384914756, 385640144, 386472404, 387344837, 388130069, 388932019, 390022874, 391232610, 392061412, 392476380, 393007249, 393900096, 395013541, 396092415, 396933258, 397773415, 398829877, 399856120, 400763839, 401787966, 402991682, 404259354, 405450195, 406611413, 407834232, 408887953, 409727186, 410724223, 412028372, 413488328, 414834678, 415953666, 417083859, 418468446, 420104563]
3522.4D20104563J460672J065194J100898J403958J578271J692146J660168J492590
3538.7D31558460J594752J816690J794398J582712J514345J658708J801550J880080
3555D45201695K052397K300232K328694K076179K066016K679974K979159K664507K576589
3573.4D66925442K792478K995252L156007L251135L181726L109753L313601L525436
3589.7D92250830L380418L390133L646106L787517L757596L707052L590822L494441
3606E21004915L718853L821016L746867L883004L821969L878295M179836L829717L264785
3624.4E55149257L064752L743291M442393L846407L536702L534793L408313L397942
3640.7E84123850L353119L142297L133953L777921M107356L314733K975524L450155
$$ y = [420104563, 421565235, 422630429, 423731327, 425135285, 426713556, 428405702, 430065870, 431558460, 433153212, 434969902, 436764300, 438347012, 439861357, 441520065, 443321615, 445201695, 447254092, 449554324, 451883018, 453959197, 456025213, 458705187, 461684346, 464348853, 466925442, 469717920, 472713172, 475869179, 479120314, 482302040, 485411793, 488725394, 492250830, 495631248, 499021381, 502667487, 506455004, 510212600, 513919652, 517510474, 521004915, 524723768, 528544784, 532291651, 536174655, 539996624, 543874919, 548054755, 551884472, 555149257, 558214009, 561957300, 566399693, 570246100, 573782802, 577317595, 580725908, 584123850, 587476969, 590619266, 593753219, 597531140, 601638496, 604953229, 607928753, 611378908]
3657F11378908L419101K904177K686858K668858K501786K572357K872288K507866K456784
3675.4F35968983K712608K451896K380312K390921K280414K358973K409637K085149
3691.7F55038893J845837J752913J625597J569331J721203J772046J512588J294255
3708F68132663J365363J639545J637221J382351J265823J239777J172900J080096J138508
3726.4F80054247J227141J101613J042247J250446J460373J223862O70433L42250P30455
3744.7F89103067J025259P41899R48251J203418R46760P83562R26912R90868P70628
3763.1F97440624P48873Q58247Q38042Q37087Q01504P50720P69079P52807N86688M62711
3783.5G04846382O19352P84874P23004N69105M85003O24598O67810M23968N17130O85930
$$ y = [611378908, 614798009, 617702186, 620389044, 623057902, 625559688, 628132045, 631004333, 633512199, 635968983, 638681591, 641133487, 643513799, 645904720, 648185134, 650544107, 652953744, 655038893, 656884730, 658637643, 660263240, 661832571, 663553774, 665325820, 666838408, 668132663, 669498026, 671137571, 672774792, 674157143, 675422966, 676662743, 677835643, 678915739, 680054247, 681281388, 682383001, 683425248, 684675694, 686136067, 687359929, 688030362, 688372612, 689103067, 690128326, 690870225, 691818476, 693021894, 693968654, 694752216, 695679128, 696669996, 697440624, 698189497, 699047744, 699885786, 700722873, 701524377, 702275097, 703044176, 703796983, 704383671, 704846382, 705465734, 706250608, 706973612, 707542717, 708027720, 708652318, 709320128, 709744096, 710261226, 710947156]
3803.9G10947156O24895P25806O17862L74198L53634O40035O67691M28796O33955O25908
3824.3G16639936L93867L55483L87132M98056N49138M18484L37064M40657O03259O30736
3844.6G21253812M15564J18136j56581N6147Q97170Q16166L40223K00033L04342M53710
3865G24698722K85745J74224M07219N08011M77552K69294K41756N63085M96567K70545
3885.4G28392720J67072R0122L26634N00440J80364n6982J09017L50416M46081M06861
3905.8G30912745K31147J56283K15411J77861R3698J67668K72214K04981J31666J79887
3926.2G32743561J91391J96218K88546K74420J70708J47819J07468N3286Q1003J49369
3946.6G34403789K46525L10898K80738J91211J04845R6321J28031J27136R5427J01984
$$ y = [710947156, 711572051, 712297857, 712915719, 713289917, 713643551, 714283586, 714951277, 715380073, 716014028, 716639936, 717033803, 717389286, 717776418, 718274474, 718823612, 719242096, 719579160, 720019817, 720623076, 721253812, 721669376, 721787512, 721630931, 721687078, 722584248, 723400414, 723740637, 723940670, 724245012, 724698722, 724984467, 725158691, 725565910, 726073921, 726551473, 726820767, 727062523, 727625608, 728122175, 728392720, 728559792, 728649914, 728976548, 729476988, 729657352, 729600370, 729709387, 730059803, 730505884, 730912745, 731143892, 731300175, 731515586, 731693447, 731787145, 731954813, 732227027, 732432008, 732563674, 732743561, 732934952, 733131170, 733419716, 733694136, 733864844, 734012663, 734120131, 734173417, 734254420, 734403789, 734650314, 734961212, 735241950, 735433161, 735538006, 735634327, 735762358, 735889494, 735984921, 736086905]
3967G36086905J42515J73211K05040K09152J87040J03414O8426J73688K07245J34766
3987.4G37691402P3255K7179M0591J60337K06649
3997.6G38199413
$$ y = [736086905, 736229420, 736402631, 736607671, 736816823, 737003863, 737107277, 737175703, 737349391, 737556636, 737691402, 737764657, 737791836, 737832427, 737992764, 738199413]
##END=$$ End of the data block
