##TITLE=$$ Begin of the data block
##JCAMP-DX=5.00 $$ ACD/SpecManager v 10.08
##SPECTROMETER/DATA SYSTEM=Alpha
##DATE=22 Dec 2014 10:36:42
##DATA TYPE=INFRARED SPECTRUM
##DATA CLASS=XYDATA
##ORIGIN=
##OWNER=
##NPOINTS=1765
##FIRSTX=399.76428223
##LASTX=3997.64306641
##MAXX=3997.64306641
##MINX=399.76428223
##MAXY=0.84494716
##MINY=0.33648553
##XFACTOR=1.0000000000
##YFACTOR=1.000000000000000e-9
##FIRSTY=0.62252653
##DELTAX=2.03961372
##XUNITS=1/CM
##YUNITS=ARBITRARY UNITS
##XYDATA=(X++(Y..Y))
$$ plain form
399.8 622526526 619273603 616265774 613974988 613490164 614642620 616236687 617993951 619540215 619664431
418.1 619664431 618034244 616290987 615082264 613909602 612016320 609279037 606421351 604028106
434.4 604028106 602324963 601744592 602940679 606229722 610490918 614381015 617459774 619582832 621205747
452.8 621205747 622358739 622265577 621076643 619895756 618686497 616902053 614390254 611477733 608514249
471.2 608514249 605644763 603267133 601382375 599820435 598810792 598423064 598339021 598482072 598798275
489.5 598798275 598758578 597915947 596322119 594523489 593105018 591738760 589686632 587091446 584536850
507.9 584536850 582119107 579193294 575268567 570886970 566949725 563597858 560463786 557697356
524.2 557697356 556022167 555750251 556085289 556460977 557691634 560960352 565953612 571011782 575038433
$$ packed form
399.8F22526526l252923l007829k290786m84824J152456J594067J757264J546264J24216
418.1F19664431j630187j743257j208723j172662j893282k737283k857686k393245
434.4F04028106j703143n80371J196087L289043M261196L890097L078759K123058J622915
452.8F21205747J152992r3162j188934j180887j209259j784444k511799k912521k963484
471.2F08514249k869486k377630j884758j561940j009643l87728q4043J43051L16203
489.5E98798275l9697q42631j593828j798630j418471j366258k052128k595186k554596
507.9E84536850k417743k925813l924727m381597l937245l351867l134072k766430
524.2E57697356j675189k71916L35038L75688J230657L268718M993260N058170M026651
$$ plain form
542.5 575038433 578132391 580407321 581236839 580285549 578322828 576272130 574149847 571141958 566815436
560.9 566815436 561769128 556502342 550532341 543683827 537486196 533848345 533245981 534847379 537840307
579.3 537840307 542507410 549093783 556411147 562605739 566858411 569861114 572223425 573641300
595.6 573641300 573770344 573213816 573118627 573579609 573743701 573549926 573998749 575584829 577692926 579631150
616 579631150 581702411 584749758 588840663 592895806 595942438 598582625 601677299 604733884 606831849
634.3 606831849 608034551 609281182 611069560 612713695 613491178 613936424 615089953 616814137 618052423
652.7 618052423 618566036 619208992 620621026 622146428 622887373 623024523 623697221 625893950 627700627
671 627700627 628508449 629483938 631299138 633335054 634672940 635488510 636462927 637633562 638383567
$$ packed form
542.5E75038433L093958K274930Q29518r51290j962721k050698k122283l007889m326522
560.9E66815436n046308n266786n970001o848514o197631l637851o02364J601398K992928
579.3E37840307M667103O586373P317364O194592M252672L002703K362311J417875
595.6E73641300J29044n56528r5189M60982J64092j93775M48823J586080K108097J938224
616E79631150K071261L047347M090905M055143L046632K640187L094674L056585K097965
634.3F06831849J202702J246631J788378J644135P77483M45246J153529J724184J238286
652.7F18052423N13613O42956J412034J525402P40945J37150O72698K196729J806677
671F27700627Q07822R75489J815200K035916J337886Q15570R74417J170635P50005
$$ plain form
689.4 638383567 638157904 637156785 636070132 634792626 632547915 629396796 626445532 624575555 623724341
707.7 623724341 623607397 624460816 626707911 630289435 634559691 638994753 643699288 648994088 654583097
726.1 654583097 659591198 663687825 667296708 670706630 673627138 675537825 676433027 676739633 676527143
744.5 676527143 675289333 672682405 669108987 665246189 661273956 657018661 652671576 649000943
760.8 649000943 646696806 645822823 646358252 648670793 653063655 659292221 666640580 674277723 681615055
779.1 681615055 688438892 694592118 699734092 703732848 707055330 710290372 713601232 716782808
795.4 716782808 719803095 723147154 727008998 730675042 733413637 735277712 736805201 738385141
811.8 738385141 739807308 740556240 740638971 740599930 740469992 739543140 737402439 734463573 731161535
$$ packed form
689.4F38383567k25663j001119j086653j277506k244711l151119k951264j869977q51214
707.7F23724341j16944Q53419K247095L581524M270256M435062M704535N294800N589009
726.1F54583097N008101M096627L608883L409922K920508J910687Q95202L06606k12490
744.5F76527143j237810k606928l573418l862798l972233m255295m347085l670633
760.8F49000943k304137q73983N35429K312541M392862O228566P348359P637143P337332
779.1F81615055O823837O153226N141974L998756L322482L235042L310860L181576
795.4G16782808L020287L344059L861844L666044K738595J864075J527489J579940
811.8G38385141J422167P48932Q2731l9041j29938r26852k140701k938866l302038
$$ plain form
830.1 731161535 727331400 722796559 717861295 713237643 709349096 705806077 702122569 698511839
846.4 698511839 695402741 692620814 689436615 685392559 680934310 677135587 675373077 676907718
862.8 676907718 682014525 689994097 699831605 710109770 719213963 726370931 731573820 734519541
879.1 734519541 734647274 732139587 728114426 723622620 718800306 713453770 708018661 703235924 699245274
897.4 699245274 695385337 690988839 686104774 681000710 675352514 668494225 660346925 651583612
913.7 651583612 642864466 634461522 626787722 620742679 617038012 615423858 614960968 615032256 615913153
932.1 615913153 618162930 621638596 625624716 629768491 634080589 637771130 638979793 636318505
948.4 636318505 629987121 621075511 610329151 597895384 583944619 568947494 553283989 536864519
$$ packed form
830.1G31161535l830135m534841m935264m623652l888547l543019l683508l610730
846.4F98511839l109098k781927l184199m044056m458249l798723j762510J534641
862.8F76907718N106807P979572R837508J0278165R104193P156968N202889K945721
879.1G34519541J27733k507687m025161m491806m822314n346536n435109m782737l990650
897.4F99245274l859937m396498m884065n104064n648196o858289q147300q763313
913.7F51583612q719146q402944p673800o045043l704667j614154m62890P1288Q80897
932.1F15913153K249777L475666L986120M143775M312098L690541J208663k661288
948.4F36318505o331384q911610j0746360j2433767j3950765j4997125j5663505j6419470
$$ plain form
964.7 536864519 519351065 500738382 481451958 461851448 442051381 422354400 403528631
979 403528631 386566967 372133076 360360026 351176739 344501764 340145826 337700486 336634398
995.3 336634398 336485535 337023556 338055640 339100152 339574933 339300096 338559538 337724805 337087005
1013.7 337087005 336907893 337493926 339076698 341644049 344919384 348645091 352775902 357211202 361620784
1032 361620784 365477502 368339002 370206177 371423185 372283459 373031944 374054283 375850081 378879964
1050.4 378879964 383410543 389443427 396826148 405494064 415395796 426220417 436966389 445404232
1066.7 445404232 448339731 443695933 433069736 421213686 412397504 407954216 407039046 408485234
1083 408485234 411680788 416343957 422156155 428648353 435302913 441650480 447107971 450978756 452989221
$$ packed form
964.7E36864519j7513454j8612683j9286424j9600510j9800067j9696981j8825769
979D03528631j6961664j4433891j1773050r183287o674975m355938k445340j066088
995.3C36634398j48863N38021J032084J044512M74781k74837p40558q34733o37800
1013.7C37087005j79112N86033J582772K567351L275335L725707M130811M435300M409582
1032C61620784L856718K861500J867175J217008Q60274P48485J022339J795798L029883
1050.4C78879964M530579O032884P382721Q667916R901732J0824621J0745972Q437843
1066.7D45404232K935499m643798j0626197j1856050q816182m443288r15170J446188
1083D08485234L195554M663169N812198O492198O654560O347567N457491L870785K010465
$$ plain form
1101.4 452989221 453793645 454663545 456658244 459938020 463953763 468193233 472363532 476061881 478785962
1119.8 478785962 480516791 481974959 484089762 487289131 491342098 495557576 498949349 500350595
1136.1 500350595 498741269 493941486 486826897 478701800 470563889 462954134 456328124 451260507
1152.4 451260507 448107541 446746647 446859598 448420167 451849133 457530946 465361476 474988490
1168.7 474988490 486231148 498901516 512452662 526121259 539434016 552356064 564853489
1183 564853489 576521397 586696982 594994485 601585507 606728256 610377133 612633288 614150584
1199.3 614150584 615662098 617415309 619338810 621565700 624524474 628446102 632961094 637368381
1215.6 637368381 641227722 644444466 646847427 648087084 648045361 647128105 645918489 644616961 643084228
$$ packed form
1101.4D52989221Q04424Q69900J994699L279776M015743M239470M170299L698349K724081
1119.8D78785962J730829J458168K114803L199369M052967M215478L391773J401246
1136.1E00350595j609326m799783p114589q125097q137911p609755o626010n067617
1152.4D51260507l152966j360894J12951J560569L428966N681813P830530R627014
1168.7D74988490J1242658J2670368J3551146J3668597J3312757J2922048J2497425
1183E64853489J1667908J0175585Q297503O591022N142749L648877K256155J517296
1199.3F14150584J511514J753211J923501K226890K958774L921628M514992M407287
1215.6F37368381L859341L216744K402961J239657m1723r17256j209616j301528j532733
$$ plain form
1234 643084228 641342878 639767349 638720870 638217270 638138473 638596773 639769197 641506970 643371642
1252.3 643371642 644992709 646296799 647403598 648338795 649070978 649808645 650909662 652520239 654353559
1270.7 654353559 655845404 656638086 656836689 656670153 656180620 655393541 654468060 653594911 652804375
1289 652804375 651877940 650581121 648983181 647322237 645662427 643929958 642136335 640386045 638756275
1307.4 638756275 637292504 635975182 634753585 633661866 632676601 631534934 629834890 627298295
1323.7 627298295 623861909 619633794 614867091 610018909 605727792 602504611 600434661 599299610
1340 599299610 598923385 599175334 599817872 600436389 600634933 600414515 600025296 599524975 598771751 597724497
1360.4 597724497 596605361 595800936 595305324 594911635 594731987 595055342 595928073 596876085 597567916
$$ packed form
1234F43084228j741350j575529j046479n03600p8797M58300J172424J737773J864672
1252.3F43371642J621067J304090J106799R35197P32183P37667J101017J610577J833320
1270.7F54353559J491845P92682J98603j66536m89533p87079r25481q73149p90536
1289F52804375r26435j296819j597940j660944j659810j732469j793623j750290j629770
1307.4F38756275j463771j317322j221597j091719r85265j141667j700044k536595
1323.7F27298295l436386m228115m766703m848182m291117l223181k069950j135051
1340E99299610l76225K51949O42538O18517J98544k20418l89219n00321p53224j047254
1360.4E97724497j119136q04425m95612l93689j79648L23355Q72731R48012O91831
$$ plain form
1378.8 597567916 598160505 599226713 601538658 605321705 609337270 612288415 614281297 615395725
1395.1 615395725 615448296 614678085 613630176 612538695 611225188 609648466 607953906 606329918 604968607
1413.5 604968607 603849769 602823257 602092445 601973951 602303088 602852404 603581429 604644060 606008887
1431.8 606008887 607438207 609094024 610984206 612663507 614234149 615583420 616449773 616732121 616430640
1450.2 616430640 615674317 614579558 612950325 611331284 610999107 611784458 613835752 617177963 621328294
1468.5 621328294 626953602 635287821 644288719 651938617 658761501 665229678 671364129 676767886
1484.9 676767886 681846201 687166035 692245662 696101844 699411035 703083396 706607342 709427834
1501.2 709427834 711657405 713986993 717091084 719571590 721260488 722813010 724383295 726088643
$$ packed form
1378.8E97567916N92589J066208K311945L783047M015565K951145J992882J114428
1395.1F15395725N2571p70211j047909j091481j313507j576722j694560j623988j361311
1413.5F04968607j118838j026512p30812j18494L29137N49316P29025J062631J364827
1431.8F06008887J429320J655817J890182J679301J570642J349271Q66353K82348l01481
1450.2F16430640p56323j094759j629233j619041l32177P85351K051294L342211M150331
1468.5F21328294N625308Q334219R000898P649898O822884O468177O134451N403757
1484.9F76767886N078315N319834N079627L856182L309191L672361L523946K820492
1501.2G09427834K229571K329588L104091K480506J688898J552522J570285J705348
$$ plain form
1517.5 726088643 727695704 729230225 730554402 731622577 732736349 733741641 734574854 735221863 735637784
1535.8 735637784 736015201 736542881 736784935 736704230 736644268 736618698 736503482 736214638 735881031 735613585
1556.2 735613585 735276103 734601557 733937860 733363032 732906699 732436895 731756985 731065750 730473995 729850888
1576.6 729850888 729117513 728287578 727365017 726436913 725410163 724111676 722509325 720783472 719014168
1595 719014168 717097640 714912593 712466896 709924936 707308590 704412758 701073289 697598279 694332838
1613.4 694332838 690791607 686621249 683194220 680415452 677432120 674479663 671564102 668755293
1629.7 668755293 666694462 665349364 664225698 663360775 662970304 663099289 663730502 664970040 666632712
1648 666632712 668012679 670109808 673903704 676776469 679098487 682065845 685946584 689944983 693234086
$$ packed form
1517.5G26088643J607061J534521J324177J068175J113772J005292Q33213O47009M15921
1535.8G35637784L77417N27680K42054q0705n9962k5570j15216k88844l33607k67446
1556.2G35613585l37482o74546o63697n74828m56333m69804o79910o91235n91755o23107
1576.6G29850888p33375q29935r22561r28104j026750j298487j602351j725853j769304
1595G19014168j916528k185047k445697k541960k616346k895832l339469l475010l265441
1613.4F94332838l541231m170358l427029k778768k983332k952457k915561k808809
1629.7F68755293k060831j345098j123666q64923l90471J28985O31213J239538J662672
1648F66632712J379967K097129L793896K872765K322018K967358L880739L998399L289103
$$ plain form
1666.4 693234086 696873009 701390624 705415189 709362626 713583767 717297435 720780611 724758327
1682.7 724758327 729718864 733778238 737030327 740423799 743335307 746148944 749150515 752050400
1699 752050400 755135655 757360995 759038568 760919690 762744367 764415026 765918612 767335892 768936396
1717.4 768936396 770316362 771200597 772047997 773208082 774664521 776277542 777746439 779278100 780889928
1735.7 780889928 782260120 783699870 785101354 786416888 787975311 789829314 791854143 793815553
1752 793815553 795529962 797313571 799168646 800739050 802157044 803451836 804653108 805829108 806877673
1770.4 806877673 807882309 808870554 809737623 810497642 811155796 811794043 812547386 813338816 813971817
1788.8 813971817 814512610 815205455 815955341 816583872 817081332 817555726 818148255 818820000 819422305 819891870
$$ packed form
1666.4F93234086L638923M517615M024565L947437M221141L713668L483176L977716
1682.7G24758327M960537M059374L252089L393472K911508K813637L001571K899885
1699G52050400L085255K225340J677573J881122J824677J670659J503586J417280J600504
1717.4G68936396J379966Q84235Q47400J160085J456439J613021J468897J531661J611828
1735.7G80889928J370192J439750J401484J315534J558423J854003K024829J961410
1752G93815553J714409J783609J855075J570404J417994J294792J201272J176000J048565
1770.4H06877673J004636R88245Q67069P60019O58154O38247P53343P91430O33001
1788.8H13971817N40793O92845P49886O28531M97460M74394N92529O71745O02305M69565
$$ plain form
1809.2 819891870 820350409 820887506 821447849 821906209 822267592 822659016 823150694 823647499 823968887 824221134
1829.6 824221134 824598849 825035214 825363636 825539887 825673759 825887263 826208234 826463103 826525390 826601624
1850 826601624 826829314 827074170 827212512 827288806 827405870 827572703 827728212 827809930 827906370 828139663
1870.3 828139663 828381956 828519821 828602910 828757644 829004884 829258442 829448581 829603493 829846084 830186248
1890.7 830186248 830433071 830495477 830517650 830657125 830871344 830984056 830955744 830960691 831114769 831278086
1911.1 831278086 831295848 831247509 831317425 831496418 831592798 831589639 831606269 831713915 831858575 831930935 831909776
1933.6 831909776 831901491 831986845 832080543 832125902 832171381 832282901 832472742 832632124 832664788 832673848 832813501
1956 832813501 833040059 833195567 833225548 833262265 833435595 833633661 833671689 833635330 833703518 833862901 833972812
$$ packed form
1809.2H19891870M58539N37097N60343M58360L61383L91424M91678M96805L21388K52247
1829.6H24221134L77715M36365L28422J76251J33872K13504L20971K54869O2287P6234
1850H26601624K27690K44856J38342P6294J17064J66833J55509Q1718R6440K33293
1870.3H28139663K42293J37865Q3089J54734K47240K53558J90139J54912K42591L40164
1890.7H30186248K46823O2406K2173J39475K14219J12712k8312M947J54078J63317
1911.1H31278086J7762m8339O9916J78993R6380l159J6630J07646J44660P2360k1159
1933.6H31909776q285Q5354R3698M5359M5479J11520J89841J59382L2664R060J39653
1956H32813501K26558J55508K9981L6717J73330J98066L8028l6359O8188J59383J09911
$$ plain form
1978.5 833972812 833951831 833911479 833958745 834020674 834007323 833955228 833961725 834048271 834113538 834064126 833939850
2000.9 833939850 833860815 833846807 833766103 833541512 833263814 833047211 832876980 832621515 832190514 831675291
2021.3 831675291 831129670 830627024 830449820 830508351 830444813 830238342 829972208 829661191 829364479 829159319
2041.7 829159319 829014122 828809440 828536034 828326225 828252554 828237891 828193367 828140140 828144491 828205884 828266919
2064.1 828266919 828299284 828339696 828402281 828457117 828486204 828480721 828471303 828519642 828616142 828698933 828745902 828797638
2088.6 828797638 828910768 829046190 829142749 829233587 829369783 829527199 829647660 829733431 829832554 829962432
2109 829962432 830082715 830157757 830195665 830241084 830320954 830392361 830401957 830371141 830355585 830385923 830451787 830484331
2133.5 830484331 830449164 830420196 830473423 830568671 830625415 830641806 830681682 830772161 830854416 830894351 830950499
$$ packed form
1978.5H33972812k0981m0352M7266O1929j3351n2095O497Q6546O5267m9412j24276
2000.9H33939850p9035j4008q0704k24591k77698k16603j70231k55465m31001n15223
2021.3H31675291n45621n02646j77204N8531o3538k06471k66134l11017k96712k05160
2041.7H29159319j45197k04682k73406k09809p3671j4663m4524n3227M351O1393O1035
2064.1H28266919L2365M0412O2585N4836K9087n483r418M8339R6500Q2791M6969N1736
2088.6H28797638J13130J35422R6559R0838J36196J57416J20461Q5771R9123J29878
2109H29962432J20283P5042L7908M5419P9870P1407R596l0816j5556L0338O5864L2544
2133.5H30484331l5167k8968N3227R5248N6744J6391L9876R0479Q2255L9935N6148
$$ plain form
2155.9 830950499 831090271 831306100 831538200 831748784 831926942 832118392 832416713 832772076 833076775 833389759
2176.3 833389759 833780706 834177852 834480405 834730744 835051119 835438371 835794985 836077452 836337984 836646318
2196.7 836646318 836965859 837208629 837391853 837613523 837930918 838270485 838545859 838800788 839096487 839410067
2217.1 839410067 839666843 839847267 840027809 840268195 840532362 840755045 840924859 841076732 841237605 841412425
2237.5 841412425 841557562 841641545 841753483 841952085 842139304 842240453 842336833 842498541 842667639 842769802
2257.9 842769802 842808962 842872083 843033254 843244076 843394697 843490481 843615711 843783200 843934476 844042420
2278.3 844042420 844159305 844315946 844467103 844568729 844627619 844690502 844813764 844937444 844924212 844828904
2298.7 844828904 844820976 844897330 844938874 844908953 844881833 844914138 844947159 844916224 844831407 844768167 844774008 844782829
$$ packed form
2155.9H30950499J39772K15829K32100K10584J78158J91450K98321L55363L04699L12984
2176.3H33389759L90947L97146L02553K50339L20375L87252L56614K82467K60532L08334
2196.7H36646318L19541K42770J83224K21670L17395L39567K75374K54929K95699L13580
2217.1H39410067K56776J80424J80542K40386K64167K22683J69814J51873J60873J74820
2237.5H41412425J45137Q3983J11938J98602J87219J01149R6380J61708J69098J02163
2257.9H42769802L9160O3121J61171K10822J50621R5784J25230J67489J51276J07944
2278.3H44042420J16885J56641J51157J01626N8890O2883J23262J23680j3232r5308
2298.7H44828904p928P6354M1544k9921k7120L2305L3021l0935q4817o3240N841Q821
$$ plain form
2323.1 844782829 844757259 844691336 844588339 844478846 844327033 844074488 843789160 843600035 843503535 843478680
2343.5 843478680 843519747 843444765 843192995 842936337 842769980 842643142 842529297 842353284 842135906 841993868
2363.9 841993868 841921747 841882706 841917574 841996670 842033863 842025042 841992080 841929674 841853082 841785908 841716766 841624320
2388.4 841624320 841491818 841338873 841209412 841087639 840916932 840702295 840487480 840271354 840039015 839786530
2408.8 839786530 839526832 839278519 838990688 838614225 838235795 837925971 837630332 837290585 836900949 836504400
2429.2 836504400 836122870 835740387 835341454 834918499 834512413 834145367 833742917 833280861 832835197 832428575
2449.6 832428575 832010567 831546545 831086099 830693603 830358922 830016315 829628050 829234540 828865707 828515470
2470 828515470 828149557 827729762 827320218 826997161 826703370 826353610 825980067 825697243 825501740 825251877
$$ packed form
2323.1H44782829k5570o5923j02997j09493j51813k52545k85328j89125r6500k4855
2343.5H43478680M1067p4982k51770k56658j66357j26838j13845j76013k17378j42038
2363.9H41993868p2121l9041L4868P9096L7193q821l2962o2406p6592o7174o9142r2446
2388.4H41624320j32502j52945j29461j21773j70707k14637k14815k16126k32339k52485
2408.8H39786530k59698k48313k87831l76463l78430l09824k95639l39747l89636l96549
2429.2H36504400l81530l82483l98933m22955m06086l67046m02450m62056m45664m06622
2449.6H32428575m18008m64022m60446l92496l34681l42607l88265l93510l68833l50237
2470H28515470l65913m19795m09544l23057k93791l49760l73543k82824j95503k49863
$$ plain form
2490.4 825251877 824921787 824621618 824411571 824232996 824001372 823722482 823480070 823318839 823157370 822905540
2510.8 822905540 822614789 822399557 822254360 822026849 821638525 821252465 820998490 820746481 820326090 819790363
2531.2 819790363 819350779 819058955 818742275 818265140 817736089 817317545 816951871 816480935 815882206 815332592
2551.6 815332592 814967513 814644039 814179063 813642025 813189745 812828302 812420905 811884046 811363041 811013520
2572 811013520 810741305 810330629 809747577 809240282 808964014 808697343 808225691 807703018 807380915 807218611
2592.4 807218611 806973338 806559503 806156158 805923879 805744350 805421352 804970026 804546833 804205418 803811193
2612.8 803811193 803220332 802539647 801998377 801538587 800915539 800078690 799223542 798510075 797823191 796990633
2633.2 796990633 796063125 795222819 794514060 793749928 792798460 791818440 790995479 790267885 789460063 788530886
$$ packed form
2490.4H25251877l30090l00169k10047j78575k31624k78890k42412j61231j61469k51830
2510.8H22905540k90751k15232j45197k27511l88324l86060k53975k52009m20391n35727
2531.2H19790363m39584k91824l16680m77135n29051m18544l65674m70936n98729n49614
2551.6H15332592l65079l23474m64976n37038m52280l61443m07397n36859n21005l49521
2572H11013520k72215m10676n83052n07295k76268k66671m71652n22673l22103j62304
2592.4H07218611k45273m13835m03345k32279j79529l22998m51326m23193l41415l94225
2612.8H03811193n90861o80685n41270m59790o23048q36849q55148p13467o86884q32558
2633.2G96990633r27508q40306p08759p64132r51468r80020q22961p27594q07822r29177
$$ plain form
2653.5 788530886 787645578 786933601 786258459 785417140 784490108 783725202 783124685 782459676 781636238 780823231
2673.9 780823231 780210733 779718101 779086232 778276324 777547121 777027369 776505709 775800586 775005639 774301410
2694.3 774301410 773682952 772968948 772086203 771185696 770418704 769707024 768872797 767920256 767039657 766324282
2714.7 766324282 765637219 764833093 763994575 763288081 762677193 762008548 761269450 760605633 760088384 759588301
2735.1 759588301 758965552 758280277 757706523 757263958 756778717 756158710 755540788 755061150 754635751 754127026
2755.5 754127026 753562212 753080964 752748132 752434254 751981378 751451194 751005054 750620186 750109553 749431789
2775.9 749431789 748749316 748136163 747500658 746745825 745907009 745105982 744321465 743410885 742344022
2794.3 742344022 741230369 740148783 739050031 737833202 736464858 735071898 733768821 732428670
$$ packed form
2653.5G88530886q85308p11977o75142q41319r27032p64906o00517o65009q23438q13007
2673.9G80823231o12498m92632o31869q09908p29203n19752n21660p05123p94947p04229
2694.3G74301410o18458p14004q82745r00507p66992p11680q34227r52541q80599p15375
2714.7G66324282o87063q04126q38518p06494o10888o68645p39098o63817n17249n00083
2735.1G59588301o22749o85275n73754m42565m85241o20007o17922m79638m25399n08725
2755.5G54127026n64814m81248l32832l13878m52876n30184m46140l84868n10633o77764
2775.9G49431789o82473o13153o35505p54833q38816q01027p84517r10580j066863
2794.3G42344022j113653j081586j098752j216829j368344j392960j303077j340151
$$ plain form
2810.6 732428670 730898380 729271710 727690935 726099551 724370420 722489536 720568180 718697548
2826.9 718697548 716799438 714748859 712573290 710354030 708086371 705675244 702998638 700081289
2843.2 700081289 697049677 693940520 690757990 687657535 684866548 682428062 680195570 677925587
2859.5 677925587 675370812 672431350 669079006 665233552 660925806 656367481 651701629 646975338
2875.9 646975338 642347693 638048053 634275615 631140351 628602266 626592219 625099361 624089360
2892.2 624089360 623409867 622835279 622219503 621528804 620729208 619723558 618416071 616786003 614829004
2910.5 614829004 612453759 609563649 606236517 602704883 599215388 595997632 593246460 591128230
2926.8 591128230 589790404 589301467 589774430 591363370 594020784 597531319 601699829 606364429 611310601
$$ packed form
2810.6G32428670j530290j626670j580775j591384j729131j880884j921356j870632
2826.9G18697548j898110k050579k175569k219260k267659k411127k676606k917349
2843.2G00081289l031612l109157l182530l100455k790987k438486k232492k269983
2859.5F77925587k554775k939462l352344l845454m307746m558325m665852m726291
2875.9F46975338m627645m299640l772438l135264k538085k010047j492858j010001
2892.2F24089360o79493n74588o15776o90699p99596j005650j307487j630068j956999
2910.5F14829004k375245k890110l327132l531634l489495l217756k751172k118230
2926.8E91128230j337826m88937M72963J588940K657414L510535M168510M664600M946172
$$ plain form
2945.2 611310601 616300762 621288717 626365602 631455064 636422396 641320467 646216810 650963128
2961.5 650963128 655384600 659501433 663381994 667031705 670514643 673925638 677235007 680405438
2977.8 680405438 683424950 686186373 688676238 690977931 693101287 695070982 696860850 698378980
2994.2 698378980 699625134 700582802 701238275 701687574 701937497 701929152 701743126 701485336 701044619 700207293
3014.5 700207293 699019670 697719574 696382165 694956779 693394601 691681087 689922750 688204110
3030.9 688204110 686451435 684512138 682411253 680392027 678469718 676400721 674092591 671715438
3047.2 671715438 669448376 667183220 664774597 662346005 659977436 657603621 655223966 652871370
3063.5 652871370 650570273 648214221 645654619 643014431 640530109 638272166 636097908 633758307
$$ packed form
2945.2F11310601M990161M987955N076885N089462M967332M898071M896343M746318
2961.5F50963128M421472M116833L880561L649711L482938L410995L309369L170431
2977.8F80405438L019512K761423K489865K301693K123356J969695J789868J518130
2994.2F98378980J246154R57668O55473M49299K49923q345j86026k57790m40717q37326
3014.5G00207293j187623j300096j337409j425386j562178j713514j758337j718640
3030.9F88204110j752675j939297k100885k019226j922309k068997k308130k377153
3047.2F71715438k267062k265156k408623k428592k368569k373815k379655k352596
3063.5F52871370k301097k356052k559602k640188k484322k257943k174258k339601
$$ plain form
3079.8 633758307 631194770 628553569 625937343 623401284 620885372 618256450 615586340 613059938
3096.1 613059938 610693276 608264625 605628967 602996290 600576103 598225653 595748663 593304276
3112.4 593304276 591052890 588804662 586393833 583767593 580954552 578196585 575654745 573230326
3128.8 573230326 570787251 568317115 565931857 563703656 561470509 558998883 556396127 553915679
3145.1 553915679 551575243 549368382 547283888 545073986 542603552 540123403 537807286 535544574
3161.4 535544574 533284247 531088948 528953433 526837707 524717808 522581100 520429313 518290579
3177.7 518290579 516226590 514212728 512178659 510174811 508270621 506386042 504425287 502438843
3194 502438843 500523984 498690754 496884525 495083988 493310809 491585523 489876032 488175303 486539394
$$ packed form
3079.8F33758307k563537k641201k616226k536059k515912k628922k670110k526402
3096.1F13059938k366662k428651k635658k632677k420187k350450k476990k444387
3112.4E93304276k251386k248228k410829k626240k813041k757967k541840k424419
3128.8E73230326k443075k470136k385258k228201k233147k471626k602756k480448
3145.1E53915679k340436k206861k084494k209902k470434k480149k316117k262712
3161.4E35544574k260327k195299k135515k115726k119899k136708k151787k138734
3177.7E18290579k063989k013862k034069k003848j904190j884579j960755j986444
3194E02438843j914859j833230j806229j800537j773179j725286j709491j700729j635909
$$ plain form
3212.4 486539394 484950244 483374625 481805474 480201662 478587687 477014482 475479335 474050790
3228.7 474050790 472811520 471620888 470206738 468623012 467138231 465763479 464450896 463283539
3245 463283539 462150991 460861802 459554404 458427012 457403630 456302702 455131024 454026520 453000635
3263.4 453000635 452029854 451197475 450498402 449690044 448664784 447563082 446473509 445469856 444575191
3281.7 444575191 443708688 442827761 441990018 441295058 440649688 439824790 438813001 437761515 436782807
3300.1 436782807 435989827 435379684 434660256 433570027 432239771 430957228 429814905 428717345 427614987
3318.4 427614987 426568717 425650537 424763024 423649311 422347933 421122342 419994771 418957174 418035775
3336.8 418035775 417019814 415798336 414507121 413194716 411979944 410975993 409872979 408444583
$$ packed form
3212.4D86539394j589150j575619j569151j603812j613975j573205j535147j428545
3228.7D74050790j239270j190632j414150j583726j484781j374752j312583j167357
3245D63283539j132548j289189j307398j127392j023382j100928j171678j104504j025885
3263.4D53000635r70781q32379o99073q08358j025260j101702j089573j003653q94665
3281.7D44575191q66503q80927q37743o94960o45370q24898j011789j051486r78708
3300.1D36782807p92980o10143p19428j090229j330256j282543j142323j097560j102358
3318.4D27614987j046270r18180q87513j113713j301378j225591j127571j037597r21399
3336.8D18035775j015961j221478j291215j312405j214772j003951j103014j428396
$$ plain form
3353.1 408444583 406960845 405703694 404634625 403506726 402305990 401296556 400397897 399238467
3369.4 399238467 397740066 396253675 395090878 394121826 393113643 392007053 390940696 390116215 389603436
3387.8 389603436 389309824 388878763 388042331 387142688 386705339 386531770 385924250 384903878 384144396
3406.1 384144396 383783937 383470029 383044541 382532388 382038027 381694674 381465644 381266266 381176233 381299853
3426.5 381299853 381569117 381774276 381965876 382293433 382499546 382403642 382314742 382489443 382898301 383406609
3446.9 383406609 383876622 384342879 384873331 385500550 386300355 387207747 387985080 388731271 389809698
3465.3 389809698 391075760 391960979 392380774 392876297 393719763 394815177 395925134 396795243 397609234
3483.6 397609234 398609579 399620950 400577605 401668787 402903080 404171169 405361980 406517893
$$ packed form
3353.1D08444583j483738j257151j069069j127899j200736j009434q98659j159430
3369.4C99238467j498401j486391j162797r69052j008183j106590j066357q24481n12779
3387.8C89603436k93612m31061q36432q99643m37349j73569o07520j020372p59482
3406.1C84144396l60459l13908m25488n12153m94361l43353k29030j99378r0033J23620
3426.5C81299853K69264K05159J91600L27557K06113r5904q8900J74701M08858N08308
3446.9C83406609M70013M66257N30452O27219P99805R07392P77333P46191J078427
3465.3C89809698J266062Q85219M19795M95523Q43466J095414J109957Q70109Q13991
3483.6C97609234J000345J011371R56655J091182J234293J268089J190811J155913
$$ plain form
3500 406517893 407708794 408734858 409579426 410574466 411891431 413409531 414806485 415928423 417029530
3518.3 417029530 418385714 420004934 421484113 422601461 423739254 425158471 426750094 428441226
3534.6 428441226 430082232 431584537 433225483 435094863 436931163 438490868 439955354 441625655
3551 441625655 443469584 445389867 447464854 449746370 452053487 454126686 456169903 458857715 461936444
3569.3 461936444 464662641 467228532 470023662 473037481 476229995 479535460 482749075 485863179
3585.6 485863179 489154458 492658347 496036321 499432474 503113985 506971955 510793328 514538109
3601.9 514538109 518166363 521665394 525323212 529106081 532876730 536788285 540588498 544425309
3618.3 544425309 548656881 552575231 555838406 558816671 562461734 566904187 570851386 574488223
$$ packed form
3500D06517893J190901J026064Q44568R95040J316965J518100J396954J121938J101107
3518.3D17029530J356184J619220J479179J117348J137793J419217J591623J691132
3534.6D28441226J641006J502305J640946J869380J836300J559705J464486J670301
3551D41625655J843929J920283K074987K281516K307117K073199K043217K687812L078729
3569.3D61936444K726197K565891K795130L013819L192514L305465L213615L114104
3585.6D85863179L291279L503889L377974L396153L681511L857970L821373L744781
3601.9E14538109L628254L499031L657818L782869L770649L911555L800213L836811
3618.3E44425309M231572L918350L263175K978265L645063M442453L947199L636837
$$ plain form
3634.6 574488223 578078985 581515789 584932148 588284194 591383517 594469905 598207057 602274656
3650.9 602274656 605585277 608551919 612029076 615547657 618532240 621245861 623879731 626284122
3667.2 626284122 628788590 631671786 634157360 636537552 639271915 641839266 644281864 646638751
3683.5 646638751 648830831 651082695 653466821 655655146 657561183 659325123 660993636 662569463
3699.8 662569463 664250314 666024864 667557120 668795049 670044303 671720445 673541605 674979091
3716.2 674979091 676135421 677265286 678413987 679524601 680699885 681925178 682983696 683948159
3732.5 683948159 685106516 686577380 687895119 688576043 688770890 689367652 690525889 691395521 692288101
3750.8 692288101 693544030 694654822 695506573 696420848 697441220 698269784 699009776 699823976 700636327
$$ packed form
3634.6E74488223L590762L436804L416359L352046L099323L086388L737152M067599
3650.9F02274656L310621K966642L477157L518581K984583K713621K633870K404391
3667.2F26284122K504468K883196K485574K380192K734363K567351K442598K356887
3683.5F46638751K192080K251864K384126K188325J906037J763940J668513J575827
3699.8F62569463J680851J774550J532256J237929J249254J676142J821160J437486
3716.2F74979091J156330J129865J148701J110614J175284J225293J058518R64463
3732.5F83948159J158357J470864J317739O80924J94847N96762J158237Q69632Q92580
3750.8F92288101J255929J110792Q51751R14275J020372Q28564P39992Q14200Q12351
$$ plain form
3769.2 700636327 701438844 702208459 702958703 703753531 704513609 705084324 705570161 706223011 707006931 707745373
3789.6 707745373 708343625 708817899 709381342 709953189 710305512 710877359 711651444 712246597 712929487 713587523
3810 713587523 714027703 714388371 714957774 715562463 715959847 716656625 717410326 717849553 718150973 718474269
3830.4 718474269 718983412 719553471 719903111 720177352 720626533 721272826 722007990 722496033 722521961 722124398
3850.8 722124398 721980870 722978234 724027514 724519670 724748433 724934816 725252330 725551844 725794256
3869.1 725794256 726247072 726787329 727309883 727658451 727903366 728382111 728847265 729177237 729405761 729473054
3889.5 729473054 729706883 730174005 730446100 730443358 730469525 730743647 731214821 731698692 732007623 732190788
3909.9 732190788 732387066 732567549 732673407 732842505 733138263 733363390 733504117 733684957 733855188 734028757
$$ packed form
3769.2G00636327Q02517P69615P50244P94828P60078N70715M85837O52850P83920P38442
3789.6G07745373N98252M74274N63443N71847L52323N71847P74085N95153O82890O58036
3810G13587523M40180L60668N69403O04689L97384O96778P53701M39227L01420L23296
3830.4G18474269N09143N70059L49640K74241M49181O46293P35164M88043K5928l97563
3850.8G22124398j43528R97364J049280M92156K28763J86383L17514K99514K42412
3869.1G25794256M52816N40257N22554L48568K44915M78745M65154L29972K28524O7293
3889.5G29473054K33829M67122K72095k742K6167K74122M71174M83871L08931J83165
3909.9G32190788J96278J80483J05858J69098K95758K25127J40727J80840J70231J73569
$$ plain form
3930.3 734028757 734297216 734545350 734688520 734809697 734906435 734992504 735169053 735407531 735639632 735850930
3950.7 735850930 736041725 736225367 736376643 736496270 736625433 736776292 736921728 737043798 737174571 737327754
3971.1 737327754 737464011 737573802 737715542 737889528 738071442 738280594 738470197 738567650 738598645 738652825
3991.5 738652825 738744736 738855422 739002585
3997.6 739002585
$$ packed form
3930.3G34028757K68459K48134J43170J21177R6738Q6069J76549K38478K32101K11298
3950.7G35850930J90795J83642J51276J19627J29163J50859J45436J22070J30773J53183
3971.1G37327754J36257J09791J41740J73986J81914K09152J89603R7453L0995N4180
3991.5G38652825R1911J10686J47163
3997.6G39002585
##END=$$ End of the data block
