##TITLE=$$ Begin of the data block
##JCAMP-DX=5.00 $$ ACD/SpecManager v 10.08
##SPECTROMETER/DATA SYSTEM=Alpha
##DATE=22 Dec 2014 10:36:42
##DATA TYPE=INFRARED SPECTRUM
##DATA CLASS=XYDATA
##ORIGIN=
##OWNER=
##NPOINTS=1765
##FIRSTX=399.76428223
##LASTX=3997.64306641
##MAXX=3997.64306641
##MINX=399.76428223
##MAXY=0.84615868
##MINY=0.33670032
##XFACTOR=1.0000000000
##YFACTOR=1.000000000000000e-9
##FIRSTY=0.62380368
##DELTAX=2.03961372
##XUNITS=1/CM
##YUNITS=ARBITRARY UNITS
##XYDATA=(X++(Y..Y))
399.8 623803675 619939983 617049038 615260363 614732981 615396738 616621733 617888153 618962288 619236410
418.1 619236410 618340969 617030203 615473568 613647699 611539423 608983040 606316328 604076684 602653444
436.5 602653444 602494955 604058325 607337296 611253440 614653707 617260993 619223237 620971739 622281373
454.8 622281373 622237086 620972872 619682133 618525147 616896331 614472568 611753464 609105945 606290996
473.2 606290996 603617966 601475835 599960685 599052131 598537445 598282993 598395228 598863065 599034190
491.5 599034190 598211288 596637189 595021844 593651116 592153907 589983165 587292552 584633231 582094967
509.9 582094967 579199612 575503230 571258664 567208886 563709319 560635149 558121204 556647778
526.2 556647778 556305230 556557894 557094991 558432519 561632812 566661835 571875095 575971782 578923047
544.6 578923047 580963850 581752121 580939531 579126596 577173352 574943841 571659207 567189753 562175333
562.9 562175333 556954920 551016450 544284701 538198471 534494936 533765256 535274565 538209319 542914689
581.3 542914689 549616337 556976140 563123941 567377448 570464730 572918773 574295878 574304283 573725641
599.6 573725641 573584318 573931932 574145734 574081123 574594975 576257050 578311086 580047309 582062244
618 582062244 585264862 589524627 593642414 596754014 599492192 602592111 605578601 607606053 608795047
636.4 608795047 610117555 611951411 613540769 614291310 614756703 615877092 617542744 618764997 619357646
654.7 619357646 620149195 621620595 623123944 623879373 624117374 624997020 627217352 628810346 629544377
673.1 629544377 630566597 632380903 634401679 635758817 636536658 637465537 638725817 639642835 639477968
691.4 639477968 638422728 637252033 635887265 633606315 630450070 627464235 625600994 624833763 624758542
709.8 624758542 625549436 627753317 631349444 635601878 640067875 644917190 650296092 655844927 660776615
728.1 660776615 664758742 668324172 671834648 674852431 676828384 677776992 678059518 677685678 676236570
746.5 676236570 673542976 669988096 666153908 662187099 657942712 653670490 650043309 647644162
762.8 647644162 646662235 647200882 649555445 653945327 660151064 667483211 675136924 682541072 689400911
781.2 689400911 695520580 700618148 704620361 707965374 711160660 714413643 717657983 720884264
797.5 720884264 724354506 728143036 731696010 734337091 736156285 737788618 739499271 740899563
813.8 740899563 741568267 741688192 741681933 741425216 740338981 738137245 735197783 731939971 728195906
832.2 728195906 723673165 718661964 713963747 709989667 706349790 702644110 699109256 696088374
848.5 696088374 693327606 690112710 686035931 681559265 677789211 676077247 677602172 682668507
864.8 682668507 690646589 700526774 710842490 719900966 726926148 731985688 734845996 734976649
881.1 734976649 732502162 728450179 723870754 718998075 713657439 708207667 703432739 699491858
897.4 699491858 695680559 691334903 686428547 681217432 675500631 668645442 660505235 651724100
913.7 651724100 642983973 634580016 626920402 620880425 617182553 615581393 615107536 615175426 616094649
932.1 616094649 618364036 621802628 625742197 629876137 634210050 637922645 639136434 636444211
948.4 636444211 630052865 621090055 610321760 597874105 583863914 568800986 553154588 536787033
964.7 536787033 519289851 500667930 481339127 461715430 441957831 422301054 403509289
979 403509289 386601359 372209936 360440940 351237804 344577193 340305239 337947518 336882800
995.3 336882800 336700320 337222308 338219583 339251578 339773059 339546174 338826686 337989032 337335110 337167293
1015.7 337167293 337766528 339316338 341838926 345102191 348831177 352954954 357378751 361753732
1032 361753732 365573317 368439466 370318174 371545434 372443408 373227805 374259293 376067102 379130274
1050.4 379130274 383668244 389655381 397002459 405671388 415565908 426350325 437022626 445356935
1066.7 445356935 448195785 443536341 432983935 421265095 412614852 408252299 407287389 408659965
1083 408659965 411828905 416473269 422240376 428698391 435370266 441739291 447174698 451036751 453091830
1101.4 453091830 453929394 454789281 456768990 460029244 464017719 468258798 472453445 476146132 478840619
1119.8 478840619 480554134 482005447 484117359 487319082 491369903 495567381 498946220 500360906
1136.1 500360906 498763621 493936509 486794889 478696764 470608532 463036805 456438273 451380044
1152.4 451380044 448219508 446855158 446994185 448616177 452098966 457809538 465655684 475251913
1168.7 475251913 486407936 498991251 512505412 526176989 539504230 552451491 564969420
1183 564969420 576610863 586745262 595052719 601659358 606763661 610375762 612643957 614154220
1199.3 614154220 615634322 617411852 619401097 621673048 624640226 628537476 633007944 637376666
1215.6 637376666 641204000 644389272 646779001 648041487 648037314 647128701 645903111 644579470 643039763
1234 643039763 641336262 639810264 638777018 638287544 638251960 638741016 639914453 641647458 643506944
1252.3 643506944 645099401 646354973 647433281 648389220 649173856 649951875 651061594 652656913 654473841
1270.7 654473841 655949652 656746745 656985044 656849265 656366646 655583560 654664457 653802454 653016388
1289 653016388 652074158 650781095 649229586 647592902 645901918 644135773 642332017 640610158 639059603
1307.4 639059603 637640893 636285186 635005355 633880317 632889330 631758749 630064607 627534807
1323.7 627534807 624132812 619935036 615162194 610316515 606046379 602821946 600755155 599662900
1340 599662900 599303484 599515855 600119710 600717545 600901127 600675225 600295424 599826515 599093437 598025203
1360.4 598025203 596863985 596031189 595535934 595159709 594989419 595296144 596154332 597116649 597824395
1378.8 597824395 598425746 599496484 601770937 605466247 609409690 612315595 614272296 615404725
1395.1 615404725 615512371 614764750 613710761 612609446 611281812 609685063 607987463 606383204 605033815
1413.5 605033815 603921890 602932096 602230132 602077842 602383673 602961361 603723288 604802370 606180429
1431.8 606180429 607604265 609247208 611164570 612878680 614459991 615810335 616669416 616947114 616661072
1450.2 616661072 615902007 614763737 613089859 611478388 611164510 611935019 613967240 617327154 621503055
1468.5 621503055 627120733 635435879 644451320 652130842 658983052 665462792 671579123 676948011
1484.9 676948011 681981683 687292337 692425191 696295798 699569046 703263819 706863165 709701777
1501.2 709701777 711899996 714165509 717219293 719758868 721508086 723064840 724617064 726326108
1517.5 726326108 727955401 729482710 730804026 731915712 733057618 734032094 734808505 735451877 735925496
1535.8 735925496 736327827 736837745 737089515 737058997 737064242 737070143 736942053 736628890 736286342 736002862
1556.2 736002862 735592961 734914482 734339654 733833790 733409762 732942164 732266426 731574059 730925083 730245173
1576.6 730245173 729548991 728766799 727852941 726908445 725852728 724549711 722976565 721270740 719516873
1595 719516873 717625082 715435386 712954164 710409522 707833290 704961181 701628983 698176205 694923818
1613.4 694923818 691378474 687223971 683795393 680988133 678025126 675120354 672229707 669466674
1629.7 669466674 667440176 666066647 664911389 664093733 663780332 663951874 664550960 665727198 667410672
1648 667410672 668843746 670933425 674728334 677685201 680081904 683066964 686935484 690949202 694254935
1666.4 694254935 697865367 702353477 706390917 710338831 714534223 718226314 721684754 725604832
1682.7 725604832 730521023 734597385 737839639 741193473 744083047 746881366 749837518 752666712
1699 752666712 755729795 757992268 759690762 761566222 763377905 765024424 766499102 767896056 769493103
1717.4 769493103 770900667 771801054 772630274 773774207 775214374 776775181 778176785 779711187 781387091
1735.7 781387091 782752097 784154534 785581350 786939800 788492262 790317416 792321146 794294357
1752 794294357 796044052 797834754 799659729 801193833 802612245 803940356 805159450 806323707 807327867
1770.4 807327867 808303833 809325278 810222864 810987771 811652005 812307358 813079596 813879013 814502239
1788.8 814502239 815018594 815706968 816478848 817121625 817626834 818117917 818736434 819409430 819962204 820369601
1809.2 820369601 820827901 821416855 821999907 822445989 822788596 823165417 823666155 824170411 824474394 824714541
1829.6 824714541 825097322 825544059 825882137 826067388 826207161 826418698 826734066 826984823 827056408 827163637
1850 827163637 827419877 827663779 827775538 827831566 827967525 828168392 828323126 828362525 828430414 828707933
1870.3 828707933 829009414 829155624 829213381 829341114 829582453 829852045 830046415 830183029 830400646 830722988
1890.7 830722988 830971777 831066549 831137359 831303358 831502914 831577122 831536829 831553578 831701577 831857741
1911.1 831857741 831863284 831787169 831856549 832076848 832198560 832182705 832200766 832335174 832494617 832555115 832513034
1933.6 832513034 832498252 832592845 832689762 832728088 832787991 832916498 833090067 833243966 833310544 833359301 833526671
1956 833526671 833750844 833859444 833857596 833913624 834091425 834276795 834341526 834322691 834357381 834463835 834524989
1978.5 834524989 834498703 834511042 834615409 834710956 834709883 834654629 834644258 834697485 834752977 834736049 834641993
2000.9 834641993 834554732 834516048 834432781 834226549 833969712 833766043 833586276 833312154 832894385 832400680
2021.3 832400680 831845999 831330359 831157327 831228733 831187606 831012070 830766737 830447018 830127597 829908609
2041.7 829908609 829762816 829585314 829334199 829105437 829012394 829013050 828988552 828921258 828909218 828980803 829061568
2064.1 829061568 829103649 829132199 829188585 829266667 829320788 829321384 829323113 829390407 829483569 829542279 829579532 829638660
2088.6 829638660 829745770 829884589 830004454 830098510 830220580 830371976 830507040 830604315 830670297 830755830
2109 830755830 830885589 831006110 831071556 831110358 831162572 831233799 831299961 831315279 831279099 831272364 831330419 831366122
2133.5 831366122 831339717 831347108 831443727 831548214 831587434 831584752 831619382 831715882 831805348 831856489 831910729 832029700
2157.9 832029700 832226336 832452834 832664907 832833111 833005250 833299816 833688915 834036410 834357440 834727466
2178.3 834727466 835104048 835415542 835686326 835997164 836354911 836677313 836924195 837185204 837538242 837887406
2198.7 837887406 838131905 838331997 838580251 838899016 839203060 839425623 839657664 839985907 840362966 840668917
2219.1 840668917 840846956 840973377 841160834 841420829 841652870 841806352 841965377 842177868 842380285 842501283
2239.5 842501283 842547059 842648566 842865229 843068600 843195558 843318999 843483627 843653560 843758643 843795300
2259.9 843795300 843861461 844032586 844251513 844384313 844449759 844583750 844778955 844939888 845033884 845115662
2280.3 845115662 845259190 845452368 845603645 845651925 845680475 845793724 845920265 845946550 845920742 845952749
2300.7 845952749 846015632 846024990 845994413 846003950 846083224 846139848 846109331 846069396 846102715 846158683 846138537 846061885
2325.2 846061885 845972836 845893741 845857382 845776796 845506907 845158339 844985545 844963908 844955742 844929695 844805360
2347.6 844805360 844583571 844395578 844294071 844215930 844124377 843955934 843756437 843668461 843671322 843634605 843566537
2370.1 843566537 843507528 843392789 843251944 843165278 843074203 842950702 842858732 842790127 842699826 842573345 842419446
2392.5 842419446 842270315 842144907 842003644 841798186 841570377 841376603 841178179 840909839 840587378 840294361
2412.9 840294361 840034425 839716196 839348674 838994324 838662803 838335097 837966561 837569594 837180555 836803198
2433.3 836803198 836412072 835995436 835609078 835249186 834832549 834370315 833941162 833549380 833154142 832736015
2453.7 832736015 832292199 831843853 831457376 831120074 830744743 830353856 830016077 829696774 829312563 828878939
2474.1 828878939 828489125 828178287 827881813 827538908 827190638 826921046 826709092 826416433 826048493 825752020
2494.5 825752020 825555384 825388312 825177372 824918449 824698448 824534953 824343443 824080229 823815286 823638737
2514.9 823638737 823489428 823220968 822815061 822437882 822187424 821927965 821519852 821031690 820635438 820331514
2535.3 820331514 819938481 819383442 818849742 818493783 818185329 817717969 817106187 816562891 816190243 815846622
2555.6 815846622 815372646 814831197 814411342 814121366 813763857 813240051 812723279 812375367 812078774 811633408
2576 811633408 811066806 810604870 810319126 809998751 809485734 808952391 808660150 808525503 808276951 807890713
2596.4 807890713 807537735 807323456 807152152 806820750 806326628 805892348 805574238 805162787 804530621 803829670
2616.8 803829670 803281784 802821398 802205324 801395476 800579488 799887002 799183249 798310637 797376931 796564400
2637.2 796564400 795863330 795095921 794155121 793184638 792378426 791682661 790889680 789976120 789139688 788449526
2657.6 788449526 787738860 786878586 785978854 785235107 784613311 783917367 783098698 782307625 781700909 781192482
2678 781192482 780545950 779758573 779063702 778546154 778003454 777278960 776500523 775851548 775278747 774569869
2698.4 774569869 773652613 772711456 771920979 771183908 770340860 769427180 768610835 767932534 767215967 766367257
2718.8 766367257 765521705 764831841 764241338 763583064 762850463 762183249 761650324 761149585 760554969 759915292
2739.2 759915292 759366453 758908808 758395076 757758379 757136166 756664753 756283760 755837739 755306661 754826188
2759.6 754826188 754462719 754113674 753676116 753188610 752743781 752316356 751760125 751049101 750345349 749744177
2780 749744177 749164462 748461783 747616112 746766746 745965064 745100796 744091034 742980957 741874993
2798.4 741874993 740783095 739594042 738234222 736831963 735524058 734185755 732674360 731053352
2814.7 731053352 729439974 727840841 726161242 724345803 722453713 720554948 718607605 716531396
2831 716531396 714332938 712104917 709873199 707461059 704722047 701770663 698753953 695661128 692482293
2849.3 692482293 689397693 686641395 684220195 681946814 679605186 677014112 674062133 670675099
2865.7 670675099 666801274 662505209 657961786 653289557 648563921 643923283 639563084 635723531
2882 635723531 632557511 630031765 628031850 626515925 625500321 624846995 624271095 623593509 622823715
2900.3 622823715 621988773 620997787 619708896 618059158 616061330 613669217 610803723 607510149 603975773
2918.7 603975773 600450933 597202241 594440937 592318296 590975344 590505540 591021121 592622221 595247090
2937 595247090 598732650 602908731 607573509 612503350 617506146 622513175 627577126 632656276 637653708
2955.4 637653708 642594397 647495747 652257919 656756461 660927773 664789915 668420315 671931922
2971.7 671931922 675399959 678752840 681938469 684996784 687860191 690448046 692802787 694982469
2988 694982469 697010279 698846102 700398922 701649129 702609062 703298450 703779817 704054296 704084933
3006.4 704084933 703953564 703733921 703268826 702441990 701343358 700061858 698675156 697242498 695701182
3024.7 695701182 694002509 692260742 690568268 688840806 686916590 684841514 682851076 680936635
3041.1 680936635 678865969 676577151 674257815 672041655 669802248 667413533 664957881 662520826
3057.4 662520826 660123885 657769263 655417442 653081656 650697410 648157120 645583630 643150687
3073.7 643150687 640881538 638670862 636324286 633779883 631163597 628548026 625976503 623460352
3090 623460352 620851874 618143439 615575254 613209486 610790431 608162105 605532289 603111207 600757003
3108.4 600757003 598236263 595702350 593387544 591115296 588666558 586012006 583223462 580514610
3124.7 580514610 578035057 575666189 573204160 570664823 568239272 566006184 563754797 561254025
3141 561254025 558659852 556196392 553851843 551636159 549513221 547241569 544740856 542223036 539823115
3159.4 539823115 537503660 535240829 533053160 530895531 528722286 526550710 524415255 522325158
3175.7 522325158 520250201 518194377 516122580 514005184 511940897 509988964 508080065 506156147
3192 506156147 504218996 502282798 500392914 498556316 496714711 494892657 493161470 491467714 489758790
3210.3 489758790 488089174 486456931 484818667 483209521 481645077 480069667 478478611 476933151
3226.7 476933151 475510418 474254489 473015964 471518576 469844401 468318075 466968447 465721548
3243 465721548 464609057 463465959 462098807 460733920 459619701 458594799 457448095 456250072 455120951
3261.3 455120951 454058647 453106433 452339113 451659083 450810552 449751586 448655069 447594255 446585387
3279.7 446585387 445632607 444724202 443857104 443041593 442337394 441675484 440842777 439813465 438717991
3298 438717991 437674105 436831206 436228037 435567617 434520721 433179796 431847155 430672228 429604620
3316.4 429604620 428523958 427444279 426478207 425575286 424493164 423219740 421993673 420858353 419797808
3334.8 419797808 418839306 417810231 416582286 415265471 413956553 412763894 411764652 410664350 409219205
3353.1 409219205 407707512 406422347 405263156 404021680 402797282 401849061 401027501 399912804 398428619
3371.5 398428619 396919727 395684868 394661486 393663079 392603517 391588628 390770733 390205801 389869183
3389.8 389869183 389416605 388568133 387718439 387360960 387197495 386537462 385483474 384707868 384307355
3408.2 384307355 383995056 383655071 383200347 382659853 382253259 382041872 381899983 381835610 381934702 382117450
3428.6 382117450 382247865 382435769 382776111 382995158 382913828 382820278 382968038 383319288 383780062 384259760
3449 384259760 384755224 385318726 385978997 386782527 387691200 388501734 389296889 390424043 391720384 392584980
3469.4 392584980 392915189 393306494 394131839 395268828 396390826 397244602 398057252 399102628 400150627
3487.7 400150627 401064336 402090430 403307289 404592127 405807734 406960160 408125192 409137607
3504 409137607 409974724 410987526 412331909 413867772 415280342 416401118 417512476 418906093 420557350
3522.4 420557350 422042519 423160821 424331337 425801694 427422941 429131448 430801034 432328731
3538.7 432328731 433973372 435810059 437594473 439173251 440711200 442375898 444185227 446148336
3555 446148336 448297262 450639606 452984035 455056757 457069039 459737927 462826163 465593159 468218744
3573.4 468218744 471056223 474102974 477301121 480593175 483817935 486940831 490240127 493792146
3589.7 493792146 497212976 500610352 504310369 508213937 512042522 515786529 519424081 522884071
3606 522884071 526498199 530321717 534164786 538099766 541875482 545694709 549965382 553965688 557317793
3624.4 557317793 560342908 563950419 568339407 572251916 575840592 579413831 582905173 586378753
3640.7 586378753 589728117 592772663 595726371 599394500 603622913 607081115 610069096 613498092
3657 613498092 616978168 619958580 622651100 625232339 627594769 630081654 632981598 635495603 637845635
3675.4 637845635 640551567 643168330 645684481 648074746 650252879 652464390 654786229 656970680
3691.7 656970680 658971786 660814941 662473977 664022565 665695846 667455673 668991923 670239329
3708 670239329 671419978 672991335 674819350 676343799 677562952 678672016 679779708 680889130 682057917
3726.4 682057917 683290005 684368312 685325682 686482430 687971592 689286470 689949095 690137923 690726817
3744.7 690726817 691829860 692650616 693538666 694756329 695817947 696670592 697640061 698730230 699587345
3763.1 699587345 700347543 701183677 701993167 702815115 703601897 704324424 705096960 705853820 706422329 706920564
3783.5 706920564 707615554 708436072 709152341 709712207 710173726 710749388 711357772 711697280 712205768 712998927
3803.9 712998927 713666856 714381993 715022683 715404749 715684593 716192067 716776013 717130363 717757225 718548179
3824.3 718548179 719123781 719554067 719905257 720291793 720730543 721105278 721454382 721937537 722615182 723348796
3844.6 723348796 723833263 723917902 723597407 723442376 724391818 725448549 725935161 726132751 726352751 726730168
3865 726730168 726954639 727075100 727509797 728129268 728726387 729066133 729258478 729690909 730136216 730466664
3885.4 730466664 730723619 730841517 731116235 731591940 731799066 731703162 731722116 732031584 732463002 732928634
3905.8 732928634 733293414 733540356 733797073 733989596 734023511 734108448 734416604 734731436 734913766 735081792
3926.2 735081792 735242307 735395074 735647917 735920608 736105204 736247957 736345589 736443400 736603081 736753464
3946.6 736753464 736914217 737153113 737395704 737574458 737739801 737903476 738007724 738098502 738232613 738407731
3967 738407731 738602281 738756835 738896549 739060402 739224195 739379704 739511251 739615202 739729345 739875078
3987.4 739875078 740000963 740065992 740117013 740239799 740430772
3997.6 740430772
##END=$$ End of the data block
