##TITLE=$$ Begin of the data block
##JCAMP-DX=5.00 $$ ACD/SpecManager v 10.08
##SPECTROMETER/DATA SYSTEM=16PC
##DATE=Mon Sep 23 16:07:54 2013
##DATA TYPE=INFRARED SPECTRUM
##DATA CLASS=XYDATA
##ORIGIN=
##OWNER=
##NPOINTS=3601
##FIRSTX=400.00000000
##LASTX=4000.00000000
##MAXX=4000.00000000
##MINX=400.00000000
##MAXY=41.94145203
##MINY=18.91152954
##XFACTOR=1.0000000000
##YFACTOR=0.000000100000000
##FIRSTY=34.83650589
##DELTAX=1.00000000
##XUNITS=1/CM
##YUNITS=TRANSMITTANCE
##XYDATA=(X++(Y..Y))
400C48365059P357597K680321j1138458j3044586n012017k01950N727539Q568497R438057
409C52740059Q072853L360748J0720m537583m754295J054764N81741m750252q327026
418C43451729j5277863j1702041O189804R335746J246224l060341j0200252q726826
426C11256180J769523Q200646J7331123J5188217j494407n681992j249313K65121K503662
435C48088760K434693N44319k082558p447510q629303p312316l680954O079712O891479
444C34886322j587868k911567J192779J189003j556396k976876n173950l811817K463589
453C21713219L899345K078514M22020l634949l256301K341232L185043N23567o67305
462C26604385k943039j060485O927948P987747L394851J079560r22928k687225n134583
$$ y = [348365059, 355722656, 358402977, 347264519, 334219933, 329207916, 329005966, 334733505, 343302002, 352740059, 360812912, 364173660, 364184380, 359646797, 354892502, 355947266, 356529007, 351778755, 343451729, 328173866, 316471825, 322661629, 331997375, 333243599, 330183258, 319983006, 311256180, 313025703, 321226349, 338557472, 353745689, 352251282, 346569290, 345319977, 345585098, 348088760, 350523453, 351067772, 348985214, 341537704, 332908401, 325596085, 321915131, 327994843, 334886322, 333298454, 330386887, 331579666, 332768669, 331212273, 328235397, 323061447, 319249630, 321713219, 325612564, 327691078, 328113098, 324478149, 321221848, 323563080, 326748123, 327271690, 326604385, 323661346, 322600861, 329528809, 337516556, 340911407, 341990967, 341068039, 338380814, 333246231]
471C33246231m505615n03540J923523N041847M732132K44636j304855j590042j033287
480C36251030O17714K773552P597923P023316O04629j812935k442818k280006J37558
489C48469963m5776l127556l064881j33056P24563M50631K17170p51228n26428J169929
499C43383331J296501K07673m72565j555214j422615L35197M58985j245270p44820
508C40241203K271881K522927k1439L8376K456894K814560K926559m9820q964538r577027
518C34659576l042450J018525O843071P099876J171570j144142k070198k512932k480736
527C39542160j034012L179054L809472J504898K1209k207031k673645r68933j239777
536C39933395l833770l215065P69119J970062J377106J181373L71705P98912L238449
$$ y = [333246231, 328740616, 328237076, 330160599, 335202446, 339934578, 340179214, 338874359, 337284317, 336251030, 336868744, 339642296, 347240219, 354263535, 354868164, 353055229, 350612411, 348332405, 348469963, 348424187, 345296631, 342231750, 342098694, 342823257, 343273888, 343491058, 342739830, 342213402, 343383331, 344679832, 344887505, 344414940, 342859726, 341437111, 341772308, 342231293, 340986023, 340241203, 342513084, 345036011, 345014572, 345052948, 347509842, 350324402, 353250961, 353201141, 344236603, 334659576, 331617126, 332635651, 339478722, 346578598, 347750168, 346606026, 344535828, 342022896, 339542160, 338508148, 341687202, 345496674, 347001572, 347022781, 344815750, 342142105, 341173172, 339933395, 336099625, 332884560, 333653679, 335623741, 337000847, 338182220, 338553925, 339352837, 342591286]
545C42591286K736320r44366j902085p19337r67751k507667k326012l01132O7482r90410
555C34736328q94546q9150O21300J814155J984826J515159L81203k432098k841950
564C34795227j224022j59988J600036J636963n9585j031418k243767k295952p22885
573C30294609p88689k900352k166519J641731K716789K338906J192321k453575k363434
582C27511787J992455K256889j238823j466064R90410J439819Q09441Q0566j979828
591C30396652j424064K421608K912979O23245r8000N1499m87557k149124j638870J782188
601C32390556J860619j572380j588326J254311K259026K958526J915207j818886l016243
610C34642410k509613k197494j835823n05448K565880L369560K443085J642227J36605
$$ y = [342591286, 345327606, 344383240, 342481155, 341761818, 340794067, 338286400, 335960388, 335659256, 335726738, 334736328, 333841782, 333752632, 334373932, 336188087, 338172913, 339688072, 340069275, 337637177, 334795227, 333571205, 333411217, 335011253, 336648216, 336588631, 335557213, 333313446, 331017494, 330294609, 329505920, 326605568, 324439049, 326080780, 328797569, 331136475, 332328796, 329875221, 327511787, 329504242, 331761131, 330522308, 329056244, 330046654, 331486473, 332295914, 332376480, 330396652, 328972588, 331394196, 334307175, 334930420, 334832420, 334883919, 334396362, 332247238, 330608368, 332390556, 334251175, 332678795, 331090469, 332344780, 334603806, 337562332, 339477539, 337658653, 334642410, 332132797, 329935303, 328099480, 327594032, 330159912, 333529472, 335972557, 337614784, 337751389]
619C37751389o09398j234780o48498J754303K460479J866341J898995K523422J952400
628C47714653q3656p21970m78744j51864J111527O95000j844673k118111m20075L8834
638C43740921l09219J6708J054039J170883K65351L74794J683464J416435l66211j130562
648C47916603j804123j212807J277428J954804J529693Q70705p16934j322747j150131
657C47342491j298904j970063j259574J186866K047997M71115L185768J4881134J0070076
666C74656906j5074234j9760628r953498k586136J1238098J2863159J875648j416893
674C51842422j325378r16252J558533K171058J260758J395225K290955K511024K518883
683C63307228J897354Q7242k58903N89371J055488J636238J919976K370376J543045
$$ y = [337751389, 337141991, 335907211, 335258713, 337013016, 339473495, 341339836, 343238831, 345762253, 347714653, 347630997, 346909027, 346430283, 346278419, 347389946, 348084946, 346240273, 344122162, 343702087, 343740921, 343431702, 343448410, 344502449, 345673332, 345938683, 346313477, 347996941, 349413376, 349047165, 347916603, 346112480, 344899673, 346177101, 348131905, 349661598, 350532303, 349815369, 348492622, 347342491, 346043587, 344073524, 342813950, 344000816, 346048813, 346519928, 349705696, 364586830, 374656906, 359582672, 339822044, 329868546, 327282410, 338520508, 351383667, 353259315, 351842422, 350517044, 349600792, 351159325, 353330383, 354591141, 355986366, 358277321, 360788345, 363307228, 365204582, 365291824, 365032921, 365622292, 366677780, 368314018, 370233994, 372604370, 374147415]
692C74147415r42955k120247l119697k388954J173248J607666j058350r78470J366387
701C67686043K052765K113342J340866j178474j584549l53089N56946K099991K414474
710C75148315J732331R87282k32201j214295k928466k210388J755943K542267Q27293
719C76408081L21884L7918K15035J425972J138229j003990j045456P95860J436463
728C79729996J706581J367340k6474m56810k62718j08490L31650M17709K53410O1035
738C83013229l05633m85420p11441m14391M61121J121063J795730K355576L320007
747C90149841K740631L59765q44231j535912k036094k739907j746902J812477K558441
756C88718109Q31146O48270J545181J361847K66304k56042n42183p30972r06716n95322
$$ y = [374147415, 373204460, 371084213, 367964516, 365575562, 366748810, 368356476, 367298126, 366319656, 367686043, 369738808, 371852150, 373193016, 372014542, 370429993, 370076904, 370633850, 372733841, 375148315, 376880646, 377867928, 377635727, 376421432, 373492966, 371282578, 373038521, 375580788, 376408081, 376729965, 376767883, 376982918, 378408890, 379547119, 378543129, 377497673, 378293533, 379729996, 381436577, 382803917, 382777443, 382320633, 382057915, 381949425, 382281075, 382698784, 382952194, 383013229, 382707596, 382222176, 381510735, 381096344, 381557465, 382678528, 384474258, 386829834, 390149841, 392890472, 393250237, 392406006, 390870094, 388834000, 386094093, 384347191, 386159668, 388718109, 389549255, 390197525, 391742706, 393104553, 393370857, 393114815, 392572632, 391841660, 390934944, 390339622]
766C90339622O19889N97458p06673r77020p03583k43187J001358R97543m50630n26428
776C89948349N63660Q27064P94869L32374j052131j258851n13343j6213O77338R88502
786C91291618J053086R05761M95911j0948r05991j193313j127015o86149N16891R08394
796C91248245Q94280M21524q75206j482506k010841j534424L22075J129646J521835
805C89634628J392594M90875p6027p01179r23424o27976p35054j325836j156349k14806
815C85757446K05269K00997O75659K272148J515159k165565l016701j854172j170425
824C82419815j65214M50859J133422P67251r78966j668206k065429j548271N35469
833C78880730R54399L3607k97546o14891n45731K76108J0719j634102j649856j19705
$$ y = [390339622, 390959511, 391556969, 390850296, 389873276, 389169693, 388926506, 389927864, 390925407, 390474777, 389948349, 390512009, 391339073, 392133942, 392466316, 391414185, 390155334, 389641991, 389625778, 390303116, 391291618, 392344704, 393250465, 393746376, 393735428, 392829437, 391636124, 390509109, 389822960, 390339851, 391248245, 392142525, 392564049, 391688843, 390206337, 388195496, 386661072, 386983147, 388112793, 389634628, 391027222, 391518097, 391442070, 390740891, 389817467, 389189491, 388454437, 387128601, 385972252, 385757446, 385962715, 386163712, 386839371, 389111519, 390626678, 388461113, 385444412, 383590240, 382419815, 382254601, 382705460, 383838882, 384606133, 383627167, 381958961, 379893532, 378345261, 378880730, 379835129, 379868736, 379571190, 378956299, 378410568, 378686676, 378697395, 377063293, 375413437, 375293732]
843C75293732K80838J48773k29111j374473j487503p76520k11220P14989R44404N67169
853C73871078K79198r3231n53360j264801j572151j773834j331101M6501O56128R98726
863C69263153P70569k86331q36602j336822j297226n17120k91596m08897m22936m26788
873C64209404m94728n29518q49228j512070j967430k757072k268067j42326N74798
882C54263763N29557J79290j142730j226921j17760J49689r5826j35650k11487p8201
892C52113724N76477K55127j308213j553535r55315j76468J486817J880379J272697
901C53591690P42416j75476p00225j024018j160126j070976q96721o56814j35651J182289
911C49696388J019707p30515j365890j529465j352997p07168K1477J429328J513711
$$ y = [375293732, 375574570, 375723343, 375494232, 374119759, 372632256, 371855736, 371644516, 372359505, 373303909, 373871078, 374150276, 374057045, 373503685, 372238884, 370666733, 368892899, 367561798, 367608299, 368264427, 369263153, 370033722, 369747391, 368910789, 367573967, 366276741, 365759621, 365468025, 365059128, 364636192, 364209404, 363714676, 363185158, 362335930, 360823860, 358856430, 356099358, 353831291, 353688965, 354263763, 354793320, 354972610, 353829880, 352602959, 352485199, 352634888, 352539062, 352403412, 352191925, 352113724, 352690201, 352945328, 351637115, 350083580, 349128265, 348951797, 350438614, 352318993, 353591690, 354334106, 354158630, 353458405, 352434387, 351274261, 350203285, 349306564, 348649750, 348514099, 349696388, 350716095, 349985580, 348619690, 347090225, 345737228, 345030060, 345051537, 346480865, 347994576]
920C47994576L05175l16620q78563j153717j126556j088104j031189o95229K92092
929C42301865J78566j122971j511803j334190j306534j287689j128922p58400o14395
938C33415527n65567p01408j258621j203766n45731k83012l66936M769Q41865J302719
948C30639839J700401J622925J011124N13534l96957k62260J065750J533012J676102
957C39103470J400223M90188r8953o79703r58481r02633r37462j049271q68568r5825
967C35402985k98767j491547k049179k487908k368927j477241j114388j015663r41009
976C22158356r66568j028786j203995j252670j189938j197567j096019j421681k523670
985C10277462k469769j243839q44955q85010r17683j178245j171837r44862q06561
$$ y = [347994576, 348299751, 347983131, 347104568, 345950851, 344824295, 343736191, 342705002, 342009773, 342301865, 342480431, 341357460, 339845657, 338511467, 337204933, 335917244, 334788322, 334029922, 333415527, 332849960, 332148552, 330889931, 329686165, 329140434, 328857422, 328490486, 328495255, 329337120, 330639839, 332340240, 333963165, 334974289, 335487823, 335090866, 334828606, 335894356, 337427368, 339103470, 340503693, 340993881, 340894928, 340215225, 339256744, 338354111, 337416649, 336367378, 335498810, 335402985, 335104218, 333612671, 331563492, 329075584, 326706657, 325229416, 324115028, 323099365, 322158356, 321191788, 320163002, 318959007, 317706337, 316516399, 315318832, 314222813, 312801132, 310277462, 307807693, 306563854, 305718899, 304833889, 303916206, 302737961, 301566124, 300621262, 299814701]
994B99814701o58989n86758n81970n94864n50975p98474j566391j593590r52491o16074
1004B91314125l25432j45206j65940L7671O11782N45501j35898n22614r40552r98992
1014B89274445n85785n41916p41501q48274j146317q38775K42958O24656M82559N84603
1024B86506653Q99792P81536J97887p7496k02884l20912m42733l81470o4392K8381
1034B86924362K6474j09215m54177o69480j062870p42206N52177Q88367N69343L13034
1044B86235809j44958m67072p25975r70611j377812j191845l05900R5138K28157M06990
1054B81781921P03812N15442l91007m83264R9887L80764O88076O83556L29723J14689
1064B84423599j15394k34604k42234k69184l89576j76429M94232O99768O14891M60625
$$ y = [299814701, 299155712, 298568954, 297986984, 297392120, 296841145, 296042671, 294476280, 292882690, 291930199, 291314125, 290988693, 290843487, 290677547, 290715218, 291327000, 291872501, 291736603, 291213989, 290273437, 289274445, 288688660, 288146744, 287405243, 286556969, 285410652, 284571877, 284814835, 285439491, 285922050, 286506653, 287406445, 288187981, 288385868, 288308372, 288105488, 287784576, 287341843, 286960373, 286895981, 286924362, 286950836, 286841621, 286387444, 285717964, 284655094, 283912888, 284465065, 285353432, 285922775, 286235809, 286090851, 285623779, 284897804, 283927193, 282549381, 281357536, 281051636, 281146774, 281374931, 281781921, 282485733, 283001175, 282610168, 282126904, 282226791, 282607555, 283295631, 283979187, 284308910, 284423599, 284308205, 284073601, 283831367, 283562183, 283172607, 282996178, 283490410, 284190178, 284805069, 285265694]
1074B85265694j7891k3117M42962N90325O29921N07812J00136m6234p3929L6964M34647
1085B87847290N05905L32604J98364j32332j411P59124Q17528K41509R1095K42939
1095B90902615J27544k31018l59535m39167k18869O07968N62420l25203o99272r85623
1105B88941860q37078L4332J29452m91848n72700k70348k12440k88735l12805m11263
1115B85708427k67753K87304K56786m83284m42982K84195N79129Q92391N37395q35190
1125B86516418j142959p26471l08266N45006Q19206O09894N48363N16395L53108j10874
1135B87619820m0760O02474Q26378Q61873P74861N65529J66416p01905q56151m13437
1145B89405098q8921M15573O20595O17504N20706K52724O904l95279m32968p9155L5744
$$ y = [285265694, 285247803, 285224686, 285667648, 286257973, 286887894, 287395706, 287495842, 287449608, 287375679, 287412643, 287847290, 288353195, 288685799, 288884163, 288751831, 288750420, 289509544, 290327072, 290568581, 290659676, 290902615, 291030159, 290799141, 290439606, 290000439, 289781570, 290389538, 290951958, 290626755, 289927483, 288941860, 288104782, 288139114, 288268566, 287776718, 287204018, 286933670, 286721230, 286432495, 286119690, 285708427, 285440674, 285727978, 285984764, 285501480, 285058498, 285342693, 285921822, 286814213, 287351608, 286516418, 285373459, 284646988, 284338722, 284883728, 285702934, 286312828, 286861191, 287377586, 287730694, 287619820, 287579060, 288181534, 289007912, 289869785, 290644646, 291210175, 291376591, 290674686, 289818535, 289405098, 289316177, 289731750, 290352345, 290969849, 291490555, 291743279, 291750183, 291354904, 290921936, 290842781, 290878525]
1156B90878525L8147N0792p152O2466L43074L00656l5763k50588n67188n07831j20163
1167B90184975L06606J039028J299133J243840J022587M21276J44252q1787J30883
1176B95710793R42001J323929J610298J491299Q80947M31060l03726j96953J011391
1185C02901039J152744L46432K81563Q69980P72724R0599k42939n23815n04971r1324
1195C05052032Q7510K39849J60465k82288l60031j37081q5583k62260L1471R16233
1205C05360317J208058J219043Q83809j30158m28448k38170m7684L65963N96523O76384
1215C09465637Q80013J247635J340637J210441J088391Q62369P48635P43370O43730
1224C18230858L87440M23679Q07037Q68302P05261N94368L81241M06494P67937P31506
$$ y = [290878525, 290916672, 290967464, 290960312, 291022778, 291365852, 291666508, 291630745, 291380157, 290812969, 290305138, 290184975, 290491581, 291530609, 292829742, 294073582, 295096169, 295517445, 295661697, 295579910, 295710793, 296652794, 297976723, 299587021, 301078320, 301959267, 302390327, 302086601, 301889648, 302901039, 304053783, 304400215, 304681778, 305551758, 306324482, 306415081, 306172142, 305648327, 305143356, 305052032, 305139542, 305379391, 305539856, 305257568, 304897537, 304760456, 304674873, 304412613, 304444084, 305360317, 306568375, 307787418, 308671227, 308541069, 308112621, 307874451, 307826767, 308192730, 308789253, 309465637, 310345650, 311593285, 312933922, 314144363, 315232754, 316095123, 316843758, 317587128, 318230858, 318618298, 319041977, 319849014, 320717316, 321422577, 322016945, 322398186, 322804680, 323572617, 324304123]
1234C24304123K47459K47460P04536P91817O69708N21660J80931J27564L14712M47769
1244C28557739P26471O42777N4321L5324N14259P01180Q05130P79648N02815N06401
1254C33826065P58400Q53081J178741N84336j352768j791954j021157p28836n10940
1263C31794968k97547k80151K34604J610298J696587N05447J36871J43967K13165N47638
1273C36305847O45905N91278N49774N56488L03726l62396n19028l11851q2741M42505
1283C38119507N09033J86424n0544m14353n32150m28200l78380l84559j63803M65889
1293C36928864M90875r0332k60849j09902k97546r39369r15070k01950j1444j84517
1303C34408760j45912J27334l3149p98722q15162o1722K4300m65126m60892j67618
$$ y = [324304123, 324551582, 324799042, 325503578, 326295395, 326965103, 327486763, 327667694, 327795258, 328109970, 328557739, 329284210, 329926987, 329981308, 330016632, 330530891, 331232071, 332037201, 332816849, 333319664, 333826065, 334584465, 335437546, 336616287, 337200623, 335847855, 334055901, 333034744, 332305908, 331794968, 331497421, 331217270, 331451874, 333062172, 334758759, 335264206, 335401077, 335545044, 335758209, 336305847, 336951752, 337543030, 338092804, 338649292, 338953018, 338590622, 338071594, 337759743, 337677002, 338119507, 338628540, 338814964, 338764420, 338350067, 337817917, 337389717, 337011337, 336626778, 336462975, 336928864, 337419739, 337329407, 337068558, 336958656, 336661110, 335721741, 334806671, 334604721, 334593277, 334408760, 334262848, 334390182, 334357033, 333558311, 332743149, 332681427, 332705727, 332240601, 331779709, 331612091]
1313C31612091J61667J024704O80237j190911j571655r73930l69339R28650J144905
1322C31446419L38058M6501r7732j62125j5526j17530o20842m58489L21388Q42820
1332C31522942J435508J654892J844864J072884q51174k237320m540176l634949J507302
1341C27774773K644310O71615K49138M47273L24250J05857j72157r38415n17350J548539
1351C32137833J750450M00810k43683j024475q34732M63486J210937K851486J266022
1360C37978134n028992n981903k862205o45867L524056L193855k887268l262749J309853
1369C25336914K403030K332230K59628o362457o508331j91212J613865Q81901O84986
1378C20450554l5286j19705m7455R36050M162789L546714j122245k918701m184723
$$ y = [331612091, 331773758, 332798462, 333478699, 332287788, 330716133, 329742203, 329372864, 330301514, 331446419, 331784477, 331830978, 331733246, 331571121, 331555595, 331438065, 330817223, 330358734, 330680122, 331522942, 332958450, 334613342, 336458206, 337531090, 336679916, 334442596, 329902420, 326267471, 327774773, 330419083, 331090698, 331339836, 331787109, 332111359, 332217216, 332045059, 331106644, 330589294, 332137833, 333888283, 334289093, 334045410, 333020935, 332186203, 332649689, 333860626, 336712112, 337978134, 332949142, 326967239, 324105034, 323459167, 326983223, 330177078, 327289810, 324027061, 325336914, 327739944, 330072174, 330331802, 323969345, 317461014, 317269802, 318883667, 319765568, 320450554, 320415268, 320295563, 320248108, 321184158, 325346947, 328893661, 327771416, 324852715, 320667992]
1387C20667992k478848L590107O012421P806778M906921o319542p279854J969338L058891
1396C31934204j851540l032226l366928j052399P027397O602059k862702m959602k378197
1405C26060066p67250K438812K625924n45502j103172p8431O81878J562843K867927
1414C33743095O795884M248619o439934r510994q941403m584560R305000R598008n044938
1423C29168777o137123M179726N984535K836724M17709m903565m287262K497941N686264
1432C35443726J0523071N792618j3726693j5933036l268719J932621O143341N804787
1440C32711716j524964k520523J676293K305755J539002n49813o753921n975952K737770
1449C23645363M474373r89914K150078J8789062J3539314j7099876k3740501j3808270
$$ y = [320667992, 318189144, 321779251, 327791672, 335598450, 340505371, 334185829, 326905975, 328875313, 331934204, 330082664, 327050438, 323683510, 322631111, 329658508, 336260567, 333397865, 328438263, 326060066, 325292816, 327731628, 330357552, 329812050, 328708878, 328630447, 329312325, 330875168, 333743095, 340538979, 344787598, 338347664, 328836670, 319895267, 315310707, 324615707, 334213715, 329168777, 323031654, 327211380, 333195915, 336032639, 336450348, 331546783, 327259521, 329757462, 335443726, 345966797, 351759415, 338032722, 322099686, 318830967, 320763588, 326906929, 332711716, 331186752, 328666229, 330342522, 332648277, 334187279, 333637466, 326883545, 320907593, 323645363, 328119736, 327129822, 329279900, 348068962, 361608276, 344508400, 320767899, 306959629]
1457C06959629o990185M074555R625931J4111518R500733r993553j3193360l482113
1465C10613155J494656P024040R601822J2281647O351471j4149399j6668320k667198
1473C13881874J147747p24544M24137L456363M210472L544808K186508k147407j053582
1482C24926376O637802P843972M392166K055855k50550l959198j3036232j0185966
1490C18424225O517639J2074242J2945404Q282203p565765j1150093n134850k315025
1498C32077980k07405M048080J1319161J5273094K3639221J1830063l1249008l6631851
1506C30099335r413224J819382J0577431J1400223p92046k22435J4678230J1854668
1514C70001564j1440773j2166023R191513J1537094R58214n804062j8765488j4604301
$$ y = [306959629, 299969444, 304043999, 313669930, 327781448, 337282181, 327288628, 314095268, 310613155, 312107811, 319131851, 328733673, 341015320, 347366791, 333217392, 316549072, 313881874, 315029621, 314305077, 314729214, 318185577, 322396049, 325940857, 328127365, 325979958, 324926376, 331564178, 339408150, 343800316, 345856171, 345605621, 341646423, 328610191, 318424225, 324941864, 337016106, 349961510, 358243713, 350677948, 339527855, 334393005, 332077980, 331870575, 335918655, 347237816, 362510910, 386150131, 397980194, 366731186, 330099335, 320686111, 322505493, 333082924, 344483147, 343691101, 343468666, 358146896, 370001564, 358560791, 346394768, 355586281, 367123375, 368081589, 362277527, 343512039, 328907738]
1522C28907738J3218651J5223960p271766j0056992Q46405N314598R897957Q516770
1530C64597321J68075n058517j5416870p983933K5655289K8914680Q693466o021728
1538C93547783l2238731l0912629L028870J0249367k660752k728462N604019P130623
1546C51020088M432221K388000k297630j323242P081260P533074k252579K244492L0689926
1555C99515610J9898910l8459320m7878723k0834923l934135K3312797K5555611j491089
1563C55684738n337448Q985024R110679R8496n922318j7665863j2407532J5356751
1571C47902527K0885696J2661248J496086k6562729k6519509L314019J1188278O021499
1579C50387115L886910q49495j727562J340370J542130l12348o53991J06125M2419
$$ y = [328907738, 342126389, 357350349, 350078583, 340021591, 340867996, 346182594, 356080551, 364597321, 364765396, 359706879, 344290009, 336306076, 361961365, 390876045, 399569511, 393547783, 361309052, 330396423, 333425293, 343674660, 341013908, 338285446, 343889465, 351020088, 355452309, 357840309, 355542679, 354219437, 361300697, 368833771, 366581192, 368825684, 399515610, 419414520, 380955200, 333076477, 312241554, 308307419, 331620216, 357175827, 355684738, 350347290, 359332314, 368442993, 368541489, 362619171, 344953308, 332545776, 347902527, 368788223, 381449471, 382945557, 356382828, 329863319, 333177338, 344365616, 350387115, 354274025, 353424530, 351696968, 353037338, 354579468, 354267120, 353613129, 353719254, 353761673]
1588C53761673q60443o16570J214028Q82148j795768k336273j507264p20520R45816
1597C48966827J216202K98233l63579j619339j515617J44959O16073O17027J6213j775055
1607C46601944k271156k562752p74384L675690O583710J3586044O340485k2806626
1615C48372955k4900207l103981O280174J4917145J2449493o011963j0553817o317635
1623C31132164k651939O925125N834808q970718q724213M758835R970398J3490219
1631C51764679J0507126K88696r427528k9070854k4664422R411583J6699562K800942
1639C28309784J764297Q147469R667397J2286415M435310k1937866k3059578l085861
1647C16527367J0831833L8050422K8292389k8751106m1569023k4950009j1252403J6637325
$$ y = [353761673, 352901230, 352284660, 353498688, 354380836, 352585068, 350248795, 348741531, 348021011, 348966827, 350183029, 350481262, 350117683, 348498344, 346982727, 347127686, 347743759, 348360786, 348376999, 346601944, 344330788, 341768036, 340993652, 344669342, 351253052, 364839096, 371179581, 348372955, 323472748, 320368767, 326648941, 341566086, 354015579, 348003616, 337449799, 331132164, 328480225, 335405350, 341240158, 332269440, 323545227, 328304062, 338274460, 351764679, 362271805, 362560501, 353132973, 324062119, 299397697, 308809280, 325508842, 328309784, 330074081, 338221550, 347888947, 360175362, 364610672, 342672806, 319613228, 316527367, 327359200, 365409622, 393702011, 364950905, 323381882, 298431873, 287179470, 303816795]
1655C03816795K2622109P616768M057388P676353L106156j2414704j2475013J931190
1663C25937042Q368225J4736672J1867523k994766r659310j6460647j0251541J8342743
1671C39885941J8674850r373894j4682541n744934K90413J1152954J3070832M588127
1679C57861748N296478K1355858Q532295m6861153m5843849J2786865K5239449N998840
1687C44366531R16024k810479J73111J5212021J5568772L471374l255844j3714104
1695C59927406r325256K0917664J4406433l7760277l7370911J4082184K4356155O971131
1703C56204529Q6517q602829q036651M202156P384986M389306M431266N931130N991440
1712C71981850O975441K327881r986611j5272865j9875527j3113250J2102356J6735572
$$ y = [303816795, 326438904, 334055672, 338113060, 345789413, 348895569, 336480865, 324005852, 325937042, 334305267, 349041939, 360909462, 357914696, 348255386, 331794739, 321543198, 339885941, 358560791, 349186897, 334504356, 328759422, 329049835, 340202789, 353273621, 357861748, 363158226, 384514084, 393046379, 346185226, 300341377, 313128242, 338367691, 344366531, 345282555, 342472076, 342645187, 357857208, 373425980, 376897354, 373641510, 359927406, 350602150, 371519814, 385926247, 348165970, 310795059, 324877243, 349233398, 356204529, 356291046, 347688217, 339651566, 343853722, 351238708, 355628014, 360059280, 365990410, 371981850, 378957291, 381285172, 371298561, 356025696, 336150169, 323036919, 335139275, 351874847]
1720C51874847M060479J3618k252846j285782N534897O273003J163254J201172N563011
1729C72145653O545524J0596314l75061m0345192l5318833K0490876K9939880L931770
1737C67610931m004249p231941n827179M765968O397972j41869J37330P163047O231079
1746C75101089j657943n802880j0340690r425430k768975K626915J2707215J0691871
1754C71131172p359962q907318M423828O593475K567520j481018j1967430r405861
1762C45594406R370804J2206802J775017m60853J626243K061119M822006l2424j7912369
1771C59050751j7237664K387276P799378M257202L888626M938850K298355o695289
1779C60687485o283493N065918N464286m538307n256386P60537M024276Q433114P879486
$$ y = [351874847, 355935326, 355948944, 353696098, 352410316, 357945213, 364218216, 365381470, 366582642, 372145653, 378691177, 389287491, 388912430, 348567238, 313248405, 333739281, 363679161, 367610931, 363606682, 356374741, 350547562, 355313530, 361711502, 361569633, 361706963, 368870010, 375101089, 373443146, 367640266, 357299576, 347874146, 345105171, 347732086, 360439301, 371131172, 363771210, 354863892, 359287720, 365881195, 368448715, 366967697, 355000267, 345594406, 354965210, 367172012, 368947029, 368486176, 370112419, 372173538, 376995544, 376963120, 359050751, 341813087, 344200363, 351999741, 356256943, 360145569, 365084419, 367382774, 360687485, 354403992, 359469910, 364934196, 360395889, 355139503, 355900040, 359924316, 368357430, 376236916]
1788C76236916L239173k886543j7141113j5554428L883591R159355N545120L963241
1796C66445312J491776j104584n628357n637169q55903J170120K265015K676239K046585
1805C62869034J556396J239052k22664l897934m192810j576690K31781L200264L172874
1814C62379303l26614j241227q66623p9422J717339L011704N973320L433494p942696
1823C66058578p650833N116196O623535J82877l718147j0807992q661041N501747Q135338
1832C60780258J679878q0833J4572m63028k173424n0087Q127213Q407860K992363k973786
1842C76260986j6459694j4734764N002747Q813171L42827j054268J260987J376609
1850C60808601K01722Q583N19485N71976M53949J73569m77295o75698o44684l17077
$$ y = [376236916, 379476089, 376589546, 359448433, 343894005, 347777596, 356936951, 362482071, 366445312, 367937088, 366832504, 361204147, 355566978, 354711075, 355881195, 358146210, 360822449, 362869034, 364425430, 365664482, 365441818, 361543884, 357351074, 355774384, 356006165, 359206429, 362379303, 362052689, 360811462, 359944839, 359865417, 361582756, 364594460, 370567780, 374001274, 366058578, 358407745, 363523941, 370147476, 370330353, 366612206, 355804214, 347143173, 352644920, 360780258, 362460136, 362379303, 362393875, 361930847, 359757423, 359707336, 367834549, 376242409, 379234772, 376260986, 359801292, 345066528, 350069275, 358882446, 359225273, 358171005, 359431992, 360808601, 361010323, 361018906, 361538391, 362110367, 362564316, 362737885, 362260590, 361584892, 360940208, 360623131]
1860C60623131J25389J339912M284859M466057L289223l75023r995232j0569305k731820
1869C50457191J049767M690170M997940J079331l00865o07033p46460l20206j8616
1878C60281219M07715O49453R91554O02493j407394o51093M243622L400078l615151
1887C64902496n192756l632546j347313M751473M721145k014160l208160m23889L41415
1896C58897705M12674M85687L76931J22070o84014m56848J003762J311531R99679L19023
1906C62788200j336097j795540j566391p93724R87320K060394L520966K703437p33375
1915C65835190k761612n834351m170379M699440N116005k693673l980636r34334M52728
1924C55728378K248078K171478k33612q61435l20663k84920m81110l30467K53448L44506
$$ y = [360623131, 360748520, 362088432, 366373291, 370839348, 374128571, 373753548, 363758316, 353189011, 350457191, 351506958, 356197128, 361195068, 362274399, 361973534, 361366501, 360620041, 360299835, 360281219, 360688934, 361338387, 362329941, 362932434, 361525040, 360873947, 365117569, 368517647, 364902496, 359709740, 356077194, 354729881, 359481354, 364202499, 362188339, 358980179, 358556290, 358897705, 359310379, 359796066, 360172997, 360295067, 359611053, 359154205, 360157967, 361469498, 362469177, 362788200, 361452103, 359656563, 358090172, 357296448, 358283768, 360344162, 363865128, 366568565, 365835190, 363073578, 357239227, 353068848, 357768288, 362884293, 360190620, 356209984, 355275650, 355728378, 357976456, 360147934, 359914322, 359052887, 358732224, 358447304, 357966194, 357635727, 357889175, 358233681]
1934C58233681k74163J90735K050171K264710J799850j68838n820732n613823R68704
1943C53630295K316475k49596m03671R83238J067886Q4153o1264N57441L27797q77113
1953C57375641r37004Q2741L20892J39236m8370n90591n07355J87416N67894J327286
1963C57917786O17752k314835k609711o25381K11029Q91914Q74520k09580l44047K95639
1973C54705086L94821J84288N5313j40152k04582j42822j35422k28615n7487O02493
1983C55032921M88052o58531n43823J038551R68208l87878j377602l312111k601394
1992C48646393J532326K387771P13577K16256J02996j65252o26068n91050O7482J49498
2002C52433929k49404l13759j36376j64718m51813l40729K11983L75023K03361L08533
$$ y = [358233681, 357959518, 358150253, 360200424, 362465134, 364264984, 364096146, 358275414, 352661591, 353630295, 355946770, 355697174, 355293503, 356276741, 357344627, 357428780, 357367516, 357924957, 358252754, 357375641, 356438637, 356521378, 356842270, 356981506, 356933136, 356342545, 355835190, 356022606, 356590500, 357917786, 358535538, 356220703, 353610992, 352985611, 353196640, 354088554, 354963074, 354753494, 354409447, 354705086, 355099907, 355284195, 355339508, 355199356, 354994774, 354851952, 354716530, 354487915, 354430428, 355032921, 355520973, 354862442, 354318619, 355357170, 356325378, 355937500, 354559898, 351247787, 348646393, 350178719, 352566490, 353280067, 353496323, 353599319, 353434067, 352807999, 352216949, 352284431, 352433929, 352184525, 351870766, 351734390, 351569672, 351117859, 350777130, 350989113, 351364136, 351567497, 351876030]
2012C51876030R77020M47769j716156k006988p43408j61858L57132N70297M60625L36647
2022C50397110L3607j00822j45950j32523M0970m044l34243l05672P6294J89323K03362
2033C49917412N7716m20608m81339j33285r2736k47497l30696m87557m03862k7656
2043C47349892J16348J77116Q3695l29476l31421J25885J16120l18527m20571l92456
2053C46176605j82838M61807M72527j91651l00178p0572J36833O98585M66805p90100
2063C46877823r99680m06265j07079K71569L30429P896n0316P1297O4850j6708p7706
2074C45966110j75476j78108q7242l1510L7690N2681J3351j2398o1989n4359N2223
2085C45520973O218j91727k92511m41818l10173J99547L65753L26157K51541Q5106
$$ y = [351876030, 352853050, 353300819, 351584663, 349577675, 348834267, 348672409, 349029541, 349599838, 350060463, 350397110, 350430717, 350329895, 350183945, 350051422, 350092392, 350088348, 349754105, 349448433, 349524727, 349714050, 349917412, 349975128, 349554520, 349073181, 348939896, 348847160, 348599663, 348268967, 347781410, 347377548, 347349892, 347466240, 347643356, 347727051, 347397575, 347066154, 347192039, 347308159, 346989632, 346569061, 346176605, 345993767, 346455574, 346928101, 346736450, 346436272, 346365700, 346502533, 347201118, 347667923, 346877823, 345878143, 345471878, 345364799, 345636368, 345966797, 345974693, 345924377, 345995674, 346060524, 346043816, 345966110, 345790634, 345612526, 345525284, 345493774, 345531464, 345584145, 345597496, 345585098, 345523109, 345468750, 345520973, 345527191, 345335464, 345042953, 344601135, 344290962, 344490509, 344856262, 345182419, 345433960, 345519066]
2095C45519066j19438n02854n58586l55720j25199L79830M03404q6784k08168j17531
2105C44228020p3204J0032M9820J21117O676l52593n05447n94177n00908j90010P4615
2116C42273941M87595N32150J84517N5084J5488l2921q7967n9586J39923O9161l19939
2127C43257446l95813k36511j61133n1498o2943l06625j83563L93371M73252J48086
2137C42874069k632j81923j56631J89056J56860k29110l67890m57267l07312K36969
2147C41754189L63349J89324N6267k09809k57263j47819J2626M06266M09126P6065
2157C42652321j89057o85691o22292J36147K56309j62620j87607M1694J47362K71073
2167C41657639K20069n6037j63079j63536k01950l02582k24571O2218J95999K86560
$$ y = [345519066, 345399628, 344896774, 344338188, 343982468, 343857269, 344237099, 344640503, 344553719, 344345551, 344228020, 344154816, 344164848, 344214668, 344335785, 344342461, 343989868, 343484421, 342890244, 342389336, 342199326, 342273941, 342761536, 343293686, 343478203, 343533287, 343548775, 343515854, 343427887, 343368301, 343508224, 343577385, 343257446, 342861633, 342625122, 342463989, 342412491, 342349548, 342042923, 341859360, 342252731, 342725983, 342874069, 342871437, 342689514, 342532883, 342721939, 342878799, 342649689, 342281799, 341824532, 341517220, 341754189, 342117538, 342306862, 342363129, 342153320, 341896057, 341748238, 341760864, 342167130, 342576256, 342652321, 342463264, 341777573, 341155281, 341291428, 341547737, 341385117, 341197510, 341239204, 341386566, 341657639, 341877708, 341821671, 341658592, 341495056, 341293106, 340990524, 340765953, 340828171, 341024170, 341310730]
2177C41310730K56309J13945j01547n71022o11763k45590o7940L8147J96457M84963
2187C40802689M67987J28288k9106j86196j19438K81334L49045K07634K8152l63578
2197C41566811m43230k58217j43280M8866O3172j75934j11809K93236L30925P7476
2207C41248016o7215k27203l06625m30336j98136O15616P08580J34926j9531Q2969
2217C41541061N227k07406k99682l58124k93274n1002O0081J02043J33286J62849R5825
2228C40890884j18484j83106j98860o1989L89595M02184J8845j81656m20342l92418
2238C40144653o8435J28250M09622L50723j57127k55852n7678K7428J59721J05629
2248C40786934k26250k37236J5259J62621M01954L10402j92146l65486m18930k56997
$$ y = [341310730, 341567039, 341680984, 341579437, 341008415, 340396652, 340151062, 340083122, 340121269, 340317726, 340802689, 341270676, 341398964, 341369858, 341183662, 341064224, 341345558, 341694603, 341902237, 341930389, 341566811, 341123581, 340865364, 340722084, 340770950, 340834122, 340658188, 340546379, 340839615, 341170540, 341248016, 341180801, 340953598, 340646973, 340216637, 340018501, 340634117, 341342697, 341477623, 341458092, 341541061, 341546288, 341338882, 341039200, 340681076, 340387802, 340336800, 340396881, 340498924, 340632210, 340795059, 340890884, 340772400, 340589294, 340390434, 340328445, 340718040, 341120224, 341139069, 340957413, 340537071, 340144653, 340076218, 340204468, 340614090, 340964813, 340807686, 340551834, 340494156, 340521584, 340681305, 340786934, 340560684, 340323448, 340338707, 340501328, 340903282, 341213684, 341021538, 340656052, 340237122, 339980125]
2258C39980125L04947M30794K25563J03226o0768j84555k83738l80249n81283m39644
2268C39114418J77650K89193L5743j65710n27840o16798m74205l67623k81372j1901
2278C37171555N61943P49359N70068O34422R50585Q72116M79698R7046o09894o31332
2288C40845566J09215K95410J33247J12076J30882J01586m2916N1003M61578N22385
2298C42720032K53906K40326L25203N47905J177063J096725K81105n2948r1552l08266
2308C46189499o70929q36105j245728m77104J849403K791443L156166K655029J124154
2317C54535828m94233l004798m134179m734268l674049m4365J385002J892548J132011
2326C42859497j810074k936096l396301k588959L29475J380692J497498R25064j226654
$$ y = [339980125, 340285072, 340715866, 340941429, 341044655, 340983887, 340799332, 340515594, 340135345, 339554062, 339114418, 339292068, 339581261, 339617004, 339451294, 338923454, 338306656, 337832451, 337464828, 337183456, 337171555, 337733498, 338482857, 339052925, 339687347, 340637932, 341510048, 341989746, 342086792, 341476898, 340845566, 340954781, 341250191, 341383438, 341495514, 341626396, 341727982, 341685066, 341736069, 342197647, 342720032, 342973938, 343214264, 343539467, 344087372, 345264435, 346361160, 346642265, 346589317, 346497765, 346189499, 345518570, 344682465, 343436737, 342959633, 344809036, 347600479, 350756645, 353411674, 354535828, 354041595, 351036797, 346902618, 342168350, 338494301, 338449936, 339834938, 341727486, 342859497, 341049423, 338113327, 334717026, 332128067, 332457542, 333838234, 335335732, 336260796, 335034142]
2335C35034142j642724j55677p50084k451401n174179j0505657j2182236j3622284
2343B88549900p418384Q793106J8146991K7670613K6118049J1423340L093720m888306
2351C71489029p960053n124092m935989n574226n771637n891800n748291n422097m779090
2360C20281754l484269l011703l177872l242969l674031l345718k458115j336555O57310
2369B97207832J294613P20024N80540K19116O16551K079487K399673J651764J745224
2378C08514824K369652K856025L555527L731499L566513L063431J971969J287690P59353
2387C31676483L94821K20299J21117J66397J92413L21160K25067k22435j90735L60718
2397C33265305M35829J55678K9106p4654j44463j91459j83106j41372j3581L02048
$$ y = [335034142, 333391418, 333235741, 332485657, 330034256, 324860077, 314354420, 302172184, 288549900, 281131516, 289924622, 308071613, 335742226, 361860275, 373283615, 376377335, 371489029, 363528976, 358404884, 353468895, 347894669, 342123032, 336231232, 330482941, 325060844, 320281754, 316797485, 313785782, 310607910, 307364941, 303690910, 300345192, 297887077, 296550522, 297207832, 298502445, 299222469, 299803009, 300022125, 300638676, 302718163, 305117836, 306769600, 308514824, 310884476, 313740501, 317296028, 321027527, 324594040, 327657471, 329629440, 330917130, 331676483, 332071304, 332291603, 332412720, 332579117, 332771530, 333092690, 333317757, 333095322, 332904587, 333265305, 333701134, 333856812, 333885918, 333811264, 333666801, 333475342, 333292236, 333150864, 333137283, 333439331]
2407C33439331L45001R2507R2506L86734K59400l46184m89960k96135k11220q9149
2417C33182831o7978j06316k33421o17027n58625j18980K44637Q77876Q53500Q6823
2427C33543320j57128n4855j67580m96177m77295j23024N1269K53907J66168l23792
2437C32214813m53224l63808k51541J2627J05858O3438O4583O6528N9357Q9645j9760
2448C31588516l54080l97911k14348o7940K63214J53771n50957o06804j19896R0104
2458C29783669K81333K38419j53046k22206n5809K0752J64261P2975l24516m44412
2468C29361420m47502k76299K43645L56674J42555L7460p8697j64032k35557k68440
2478C28671227l08037j98365J90239J81694k86827k88505J76201J82647k33421k93961
$$ y = [333439331, 333784332, 333876839, 333969345, 334356079, 334615479, 334269295, 333779335, 333483200, 333271980, 333182831, 333114853, 333008537, 332775116, 332158089, 331599464, 331480484, 331725121, 332602997, 333456497, 333543320, 333386192, 333331337, 333163757, 332667580, 332190285, 332067261, 332118530, 332372437, 332538605, 332214813, 331761589, 331397781, 331146240, 331158867, 331264725, 331328163, 331392746, 331459274, 331518631, 331608276, 331588516, 331234436, 330836525, 330622177, 330554237, 330817451, 330971222, 330420265, 329813461, 329693565, 329783669, 330065002, 330303421, 330150375, 329928169, 329872360, 329893112, 330057373, 330130348, 329805832, 329361420, 328913918, 328637619, 328881264, 329237938, 329380493, 329417953, 329339256, 329175224, 328939667, 328671227, 328363190, 328164825, 328355064, 328536758, 328249931, 327961426, 328137627, 328320274, 328086853, 327792892]
2488C27792892j10397j7624P4845J39465K01950J85013J53770p6523p14073p42416
2498C26886902j66435J4801O0768o7673n94406n86968o3667J15891J55182R8724k22206
2509C25630913j80016K26250L61938M31519K50587l71704m88739j86462p1259j1711
2519C25591316P0572K71568J28518m79470o08215m62265j69754N74798O75927K02903
2529C25795898k6931k34604l55034m41055l47405P4158Q5831l74794l23754K41738
2539C24094048L25202O9161j02043l78380m25835l22799r0599N16891N33829m8638
2549C24170837k29377k09084j85966q8234q087Q9874J53541K45819J63804j30654k83241
2560C23689232m45366l66211R0332J25427l10898k23159M27704M88281J07803j59530
$$ y = [327792892, 327682495, 327664871, 327739716, 327879181, 328081131, 328266144, 328419914, 328343391, 327629318, 326886902, 326720467, 326735268, 326796036, 326728363, 326133957, 325546989, 325483322, 325599213, 325754395, 325853119, 325630913, 325450897, 325677147, 326039085, 326470604, 326721191, 326349487, 325860748, 325674286, 325603027, 325591316, 325661888, 325933456, 326061974, 325582504, 324974289, 324512024, 324342270, 324917068, 325592995, 325795898, 325768967, 325534363, 325179329, 324738274, 324390869, 324465027, 324550858, 324176064, 323852310, 324094048, 324419250, 324488411, 324386368, 324007988, 323582153, 323259354, 323168755, 323685646, 324219475, 324170837, 323941460, 323732376, 323546410, 323458176, 323450089, 323539963, 323693504, 323939323, 324103127, 323972473, 323689232, 323243866, 322877655, 322967987, 323093414, 322782516, 322559357, 322987061, 323475342, 323583145, 323423615]
2570C23423615o02494o22024j70212l9597j73340o637N48324N71747J81198j74293
2580C22936287q30650q95958l60260j58310r5864j6670L0289Q4381K13394J04675l12347
2591C20698967m45824m60624k92321K21501L65734K69890J30424j85509l43551m39415
2601C19519272m26293l13987j13488L35694L99818J10398k7428j83106j83563J7166
2611C19134483O1989n3177M3869M24862M29859J12763q4152l37601l85742k52018j06564
2622C18988571K07653K30313m5777j32561r0599j67846m24385l72658J6937J36604
2632C18346252R4662O3648l8375n7946O0082n9128n23567n28565r4185N4608N1498
2643C17368984Q5354J09673J18980J52092N9376k49615k66075J5964O2466r0122n5065
$$ y = [323423615, 322821121, 322199097, 322028885, 321989288, 321815948, 321809311, 322357635, 322929382, 323110580, 322936287, 322105637, 321209679, 320849419, 320691109, 320595245, 320578575, 320608864, 320693245, 320906639, 321011314, 320698967, 320253143, 319792519, 319500198, 319721699, 320087433, 320357323, 320487747, 320302238, 319958687, 319519272, 319092979, 318778992, 318665504, 319001198, 319401016, 319511414, 319483986, 319300880, 319117317, 319134483, 319196472, 319143295, 319187164, 319612026, 320041885, 320154648, 320070496, 319732895, 319347153, 319095135, 318988571, 319196224, 319426537, 319380760, 319248199, 319157600, 318989754, 318565369, 318192711, 318209648, 318346252, 318440914, 318504562, 318466187, 318408241, 318468323, 318409195, 317885628, 317357063, 317262878, 317317486, 317368984, 317454338, 317564011, 317682991, 317835083, 317894459, 317644844, 317378769, 317394733, 317457199, 317367077, 317312012]
2654C17312012K33154J22566n52673m78020M06494N45044J03951k8382l9577o8665
2664C17555904r7980o1531J29471N2452l63827m11739k08149N474M61578M71115L9349
2675C17572117j67599l27358l96977l72638l15419j73816r3708l9101j0719l8376l815
2686C15632591J40419Q5602k39868k41280O7482J45684J48277m273n11417m96387P0571
2697C14797401J92166L3626o9866k66323l00159k09103j00594J63537J36375k29588
2707C14147472k98252j90735o1531K06948K96840L01609J64986k27470l65010l10897
2717C13663960l24002l68366l32127k15282j31855m3869J0738Q0357O180l62397k67486
2728C11715851L72391M71363J82399k2182l90530m04834K5749J6689m22707m45137
$$ y = [317312012, 317545166, 317667732, 317115059, 316637039, 317043533, 317588577, 317692528, 317664146, 317624569, 317555904, 317457924, 317396393, 317525864, 317578316, 317214489, 316802750, 316594601, 316600075, 317061653, 317532768, 317572117, 317404518, 317077160, 316680183, 316307545, 315992126, 315818310, 315724602, 315685501, 315674782, 315636406, 315632591, 315773010, 315858612, 315618744, 315377464, 315444946, 315590630, 315738907, 315734634, 315223217, 314726830, 314797401, 314989567, 315023193, 314953327, 314687004, 314386845, 314177742, 314077148, 314240685, 314377060, 314147472, 313849220, 313658485, 313596954, 313803902, 314100742, 314402351, 314567337, 314339867, 313974857, 313663960, 313339958, 312971592, 312639465, 312424183, 312292328, 312248459, 312259197, 312339554, 312345734, 311983337, 311715851, 312088242, 312559605, 312742004, 312719822, 312329292, 311924458, 311950207, 311966896, 311544189, 311099052]
2738C11099052j54972J6690K49138K55126O1265j53065n80311o30856m07695r1324
2748C09663048O11801P06177K14348L9329J8120j00842l67641l30925J07288J02997
2758C10663700l61690l73345K0733R2983p9632p8678K7657R3689K01225J66893k0027
2769C10353508j33266k33899l04451l74317l45230j93844j14670m2190m4117j37577
2779C08429947j87626k25067k65122l39984l05653j66645n0316J41869J40190k6245
2789C07145348k04544n02129o43005p31240o29654k08625j25390k42004m55379r75609
2799C02427769j066914p28607o99291q75225r32694r56077r32446q08010q11806q75244
2809B93741455j044502j461754j514187j351604r90143j75705Q7967R060k41528r80377
$$ y = [311099052, 310944080, 310960770, 311209908, 311465034, 311526299, 311373234, 310792923, 310162067, 309754372, 309663048, 310274849, 310981026, 311195374, 311234703, 311252823, 311151981, 310784340, 310453415, 310560703, 310663700, 310302010, 309928665, 309949398, 310042381, 309962749, 309884071, 309911728, 310005417, 310206642, 310373535, 310353508, 310220242, 309986343, 309681892, 309307575, 308962345, 308768501, 308653831, 308611641, 308567524, 308429947, 308242321, 308017254, 307752132, 307412148, 307106495, 306939850, 306889534, 307031403, 307171593, 307145348, 306940804, 306438675, 305795670, 305064430, 304434776, 304226151, 304100761, 303858757, 303403378, 302427769, 301360855, 300632248, 299932957, 299057732, 298125038, 297168961, 296236515, 295428505, 294616699, 293741455, 292696953, 291235199, 289721012, 288369408, 287379265, 287203560, 287291527, 287300587, 287059059, 286078682]
2819B86078682j113644p61280n40733j61171j71413o65417p20978l90053l87440p03334
2829B80463219o62327l05176j47343p9155k6702l5763p06J49727K2888m53720n97725
2840B78327217n86738l93391K10762K83489j52130k46506j11351j49498k96345m10327
2850B76475182o23703n49775o8206n0049m65393n64575m38462m75158o79512o45638
2860B71914711l62396k80609k96822l73840o03924o55880n37167n52654o55651p29313
2870B66866455r04579p75795k40326j17073l79086l16619J30653R289p64351r04579
2880B62603989n53131m31061l47595l45002n38597m24614N1022J64985J4554o6300
2890B60128250k18620k15302P25k7656k47231m13895o86187o75202m00295j75476K13871
$$ y = [286078682, 284965038, 284203758, 283663025, 283501854, 283330441, 282665024, 281944046, 281553993, 281166553, 280463219, 279800892, 279495716, 279348373, 279269218, 279242516, 279206753, 279206047, 279355774, 279378662, 278924942, 278327217, 277740479, 277347088, 277557850, 277841339, 277689209, 277442703, 277331352, 277181854, 276885509, 276475182, 275851479, 275301704, 275233498, 275183449, 274718056, 274153481, 273715019, 273239861, 272560349, 271914711, 271552315, 271271706, 270974884, 270601044, 269997120, 269341240, 268804073, 268251419, 267595768, 266866455, 265961876, 265186081, 264945755, 264828682, 264449596, 264132977, 264263630, 264272919, 263508568, 262603989, 262050858, 261619797, 261272202, 260927200, 260388603, 259963989, 260015011, 260179996, 260194550, 260128250, 259909630, 259694328, 259695053, 259667397, 259420166, 259006271, 258320084, 257644882, 257244587, 257069111, 257282982]
2901B57282982K20756j77841l45230m94003m11282J0739J27544j1444L7441L23525
2911B56563187K05993l72886n44072m88987l53813N2204J09425j83811k02656Q6060
2921B54870644p7477q38756q56648j95255N7926J30901J99566K63214J47095k66304
2931B53434906l32375p0800m8867k19593k03609o2466O8665K38170L87917N74589O27994
2942B54394531O25382M26292j87645k03132L78837N47657M77085M79203M83284M57038
2952B57878532M11759L31878J58310J41869L00636L10421J95504J80244K88258J99318
2962B60396729j75725j60465K24610L81927L99590N20954Q36372P39346J46618n722
2972B63304234J44958K08855L44276L07331K9793K8610L60012K78721l24745k70596
$$ y = [257282982, 257503738, 257325897, 256980667, 256486664, 256075382, 256086121, 256213665, 256202221, 256239662, 256563187, 256769180, 256396294, 255852222, 255363235, 255009422, 255061626, 255171051, 254987240, 254784584, 254870644, 254793167, 253954411, 253097763, 252902508, 252960434, 253091335, 253290901, 253554115, 253701210, 253434906, 253102531, 253031731, 252982864, 252763271, 252559662, 252497196, 252565861, 252804031, 253191948, 253766537, 254394531, 255019913, 255446205, 255258560, 255055428, 255434265, 255981922, 256459007, 256938210, 257421494, 257878532, 258290291, 258622169, 258780479, 258922348, 259222984, 259533405, 259728909, 259909153, 260197411, 260396729, 260221004, 260060539, 260285149, 260667076, 261066666, 261587620, 262423992, 263163338, 263309956, 263304234, 263449192, 263658047, 264002323, 264309654, 264339447, 264368057, 264728069, 265006790, 264682045, 264411449]
2982B64411449M42982O28472N04722L82424k6932J17779R79900J064777M79450K87781
2992B69272804K36511K73476N23071N39551K74887L64552Q59508R17435O30837M70657
3002B74363289K18849K72999P07874Q24204P94181O26793J72844J9322R289J83105
3012B78192749P54604Q27542M18434L55949M76837O04401R91345Q01086j53542k87532
3022B82981873K90641M29154L78608K85378R9182j27067n97954n48363J00136K65827
3032B83557415L3131J44500N75295O78539N97000M04110o0539k31743k13394j56403
3042B85327911O0082J02768Q087l8605j29242q2473J87873J52588k02903k93255k31991
3053B84860840j52817j5984J52359M68255M92324K83738M4326m34875n20210k29607
$$ y = [264411449, 264854431, 265482903, 265987625, 266370049, 266343117, 266460896, 267440796, 268505573, 268985023, 269272804, 269509315, 269782791, 270305862, 270845413, 271120300, 271484852, 272344360, 273261795, 273892632, 274363289, 274582138, 274855137, 275563011, 276387215, 277181396, 277808189, 277981033, 278000355, 278009644, 278192749, 278947353, 279774895, 280193329, 280549278, 281026115, 281630516, 282621861, 283422947, 283269405, 282981873, 283272514, 283701668, 284080276, 284365654, 284464836, 284337769, 283739815, 283191452, 283291588, 283557415, 283590546, 283735046, 284310341, 284988880, 285585880, 285989990, 285929451, 285697708, 285484314, 285327911, 285387993, 285490761, 285498848, 285460243, 285331001, 285248528, 285436401, 285588989, 285386086, 285092831, 284860840, 284708023, 284692039, 284844398, 285312653, 285804977, 286088715, 286133041, 285698166, 285177956, 284948349]
3063B84948349j27068j22566j2855K47459K71340J10855n7450m27494m02698K6245
3073B84454117K23865M47522L03726l57380n43842m12217l31154j96456n7221J71166
3083B83702126J97906J907m2457K9812j8826k26974k05994N7220J19439M6253J8120
3094B83678532J8367o8664k32239m00772p99656o00338M02222N55992m8409j23748
3104B82381287K07195J45664k91824l73345k24113p6294K71797K44141j71204l53317
3114B81759987m37279n07355n65986n22156l68576k28424J0033K1934k78015k26250
3124B78657913J81923K60811J36375j1673k75135m68502p54585o69956r6569K9106
3134B76989708j46160k74410n79834n16186m2439J29929J41869J38053J25389o9122
$$ y = [284948349, 284821281, 284698715, 284685860, 284933319, 285204659, 285315514, 285258064, 284830570, 284427872, 284454117, 284677982, 285125504, 285429230, 285071850, 284528008, 284115791, 283784637, 283588181, 283530960, 283702126, 283900032, 283901939, 283859482, 283889294, 283870468, 283643494, 283437500, 283494720, 283614159, 283660412, 283678532, 283696899, 283628235, 283395996, 282995224, 282195568, 281595230, 281997452, 282553444, 282505035, 282381287, 282588482, 282734146, 282442322, 282068977, 281844864, 281768570, 282040367, 282284508, 282113304, 281759987, 281322708, 280815353, 280249367, 279727211, 279358635, 279130211, 279140244, 279162178, 278884163, 278657913, 278839836, 279100647, 279237022, 279225349, 278950214, 278481712, 277727127, 277057171, 276960602, 276989708, 276843548, 276569138, 275989304, 275473118, 275430679, 275560608, 275702477, 275840530, 275965919, 275896797]
3144B75896797o34193o45886o1512K4319k84443l08742j23272j10627k37693k54631
3154B73260117j35899k35310o72340o16074q0833J59264L42369K87056r7275k67258
3164B71943817k94456m36554p61738p40051l70026j90029m7188j6708o8894k48184
3174B68769989p50790p48157k78702j7662L01361K85149p6752l52402p65800q52585
3184B65513649o61850m65145j23730P6294K53678K19573m9819k72294n32150p76748
3194B63181458j211892j068115k28405O6509%P8202L35464J25408o98337r05266p11670
3205B58963356m86145M2439J57833r4414j80721k33403k58693j85013k93484o43730
3215B56788025p16457o03924m57268j17073p2708k53220m53949r11712q86193l63350
$$ y = [275896797, 275262604, 274616718, 274555206, 274579525, 274295082, 273986340, 273863068, 273752441, 273514748, 273260117, 273124218, 272888908, 272216568, 271600494, 271519661, 271678925, 272021294, 272308350, 272211075, 271943817, 271649361, 271212807, 270451069, 269711018, 269340992, 269150963, 269103775, 269087067, 269018173, 268769989, 268019199, 267271042, 266992340, 266974678, 267276039, 267561188, 267484436, 267132034, 266366234, 265513649, 264851799, 264386654, 264262924, 264339218, 264592896, 264812469, 264762650, 264490356, 263958206, 263181458, 261969566, 260901451, 260673046, 260739555, 260739555, 260817757, 261153221, 261278629, 260580292, 259675026, 258963356, 258477211, 258519650, 258677483, 258583069, 258402348, 258168945, 257910252, 257725239, 257431755, 256788025, 256071568, 255467644, 255010376, 254893303, 254820595, 254567375, 254113426, 253201714, 252315521, 251952171]
3225B51952171j39465m6024L7193J52836Q583m72317o93321q63552p45545j99546k1935
3236B48969078r2277r6550n3406k05040o34194p70340p75089n72452n1251K65370O63032
3247B46646881N19524l41664n93662m04129m29382n85327n53360l46661k31495r3956
3257B43586769j23730l81221m37508l99113k69413K6703J91212L34492L13053J21364
3267B42962608p8449l58581n94845r08394r40552p53631m60625J76182L18279O6757
3277B39428749j46370n66482o44455m40121k63214P3910J28746n8651k07653m54903
3287B36849556n34782m69437m37985m09603l30925j17778j63784n61486n50041j01089
3297B33172646r0104n36460m88987O8912J18961k82764l45230j00861k11220p30514
$$ y = [251952171, 251812706, 251766682, 251803875, 251956711, 251965294, 251492977, 250799656, 249936104, 249190559, 248991013, 248969078, 248876801, 248780251, 248726845, 248521805, 247887611, 247117271, 246342182, 245769730, 245718479, 245983849, 246646881, 247166405, 246824741, 246231079, 245826950, 245397568, 244812241, 244258881, 243912220, 243680725, 243586769, 243463039, 243081818, 242644310, 242245197, 241975784, 242002487, 242193699, 242528191, 242841244, 242962608, 242884159, 242525578, 241930733, 241022339, 240081787, 239328156, 238867531, 239043713, 239361992, 239428749, 239282379, 238715897, 238071442, 237631321, 237368107, 237442017, 237570763, 237512112, 237304459, 236849556, 236314774, 235845337, 235407352, 234997749, 234666824, 234549046, 234385262, 233823776, 233273735, 233172646, 233082542, 232546082, 232057095, 232126007, 232244968, 231962204, 231616974, 231516113, 231304893, 230574379]
3307B30574379p81555l45936l77407r59168q07533J53542L33328n0793k79178o35872
3317B26823807p05948n31922l61919o1035P7000J93595J5984o75201p32899j56651
3327B23884811r5367l73344n45273q13713q14686n24769m01955l93867k54173R9678
3337B19767342Q8920k82059m52041n75524n98201n14508m01496j18027j52817o35624
3347B16125965n62420J54953J58081n56717o17256r1324q2245m48951o53973r06238
3357B12519875r07898o64940m52271j40190K4300J51176M7188l04928o44932j291504
3367B08335876j233577m87328P06O92367O85940o4144m74930r88235r21726j54972
3377B05389977J46636L81222J21594r23386j162300q23250n88417k47002L6698M59442
$$ y = [230574379, 229792824, 229446888, 229069481, 228110313, 227302780, 227456322, 227789650, 227738857, 227459679, 226823807, 226117859, 225585937, 225224018, 225162983, 225239983, 225433578, 225449562, 224774361, 224041462, 223884811, 223789444, 223416100, 222870827, 222057114, 221242428, 220717659, 220315704, 219921837, 219667664, 219767342, 219856262, 219574203, 219122162, 218546638, 217948437, 217433929, 217032433, 216914406, 216761589, 216125965, 215563545, 215718498, 215876579, 215319862, 214702606, 214611282, 214529037, 214080086, 213426113, 212519875, 211611977, 210947037, 210494766, 210354576, 210378876, 210530052, 210577240, 210272312, 209627380, 208335876, 207102299, 206614971, 206615677, 207308044, 207993984, 207929840, 207454910, 206466675, 205544949, 205389977, 205536613, 205917835, 206039429, 205116043, 203953743, 203130493, 202542076, 202295074, 202331772, 202791214]
3387B02791214L96004k72751m48227k97051k51312j20621k36759p30037p48158k99454
3397A99782848k04334l99589l19710O5079O7005l23773l80516j26610j98116o35624
3407A97326660o43005l29972n5313M46549M72069M043j86672j89781m17233r31263
3417A95496082j072883j064549o77566M16755O74000K64874M9133j96953m40349r18389
3427A92530155p17640L63579O04172K28157N8899j57356k30084j94302j02996J57585
3437A92540169J84536m7684l4084L20663J27316o41117r89914j371136r73454O19889
3447A89735184R30538J97887n6991k35558k55337o4601M4822K46048J37787l95527
3457A90284252m90665k52247j27792k5998J32561M93298L93619l50952l39737M63715
$$ y = [202791214, 203187218, 202914467, 202466240, 202169189, 201917877, 201797256, 201560497, 200830460, 200082302, 199782848, 199578514, 199178925, 198859215, 198924294, 198991299, 198667526, 198287010, 198160400, 197962284, 197326660, 196683655, 196353683, 196298370, 196744919, 197216988, 197221031, 197034359, 196844578, 196427345, 195496082, 194423199, 193358650, 192681084, 193097839, 193771839, 194036713, 194085846, 193888893, 193448544, 192530155, 191812515, 192176094, 192780266, 193008423, 193067322, 192909966, 192679882, 192485580, 192382584, 192540169, 192724705, 192677021, 192642937, 192963600, 193090916, 192449799, 191459885, 190088749, 189115295, 189735184, 190665722, 190863609, 190806618, 190571060, 190315723, 190251122, 190295944, 190541992, 190679779, 190284252, 189793587, 189541340, 189413548, 189387550, 189520111, 190013409, 190407028, 190056076, 189716339, 190180054]
3467A90180054N11169q2245k31018j23520r1781j98136J38054J312981J159172l81222
3477A92193508r10053r72252p87735o5098K46754L81470L51677r308m8390J20163K99931
3488A90800667P37915O40373r0599k70596j49478Q4381O56852Q50678J019955M63962
3498A94744110j302719j640549r74655k45590J302719J584778Q52108J83582j232376
3507A93271408j228104K97070P71046P38620N89123o5555o1989N14030Q39234J286754
3517A96951637J185875N90821m5548j242866j375447l43571j72843o88076n66006l2902
3527A94261074M89483J353264J570701J368523Q24680n87711q39462l16391M93297
3536A98617458K365113K681484J917133P87487j471271k520085l210067k475510L22838
$$ y = [190180054, 190691223, 190608978, 190377960, 190254440, 190162659, 189964523, 190102577, 191415558, 192574730, 192193508, 191283455, 190311203, 189523468, 189458370, 189705124, 190086594, 190438271, 190428963, 190380573, 190500736, 190800667, 191538582, 192178955, 192088356, 191817760, 191668282, 191752663, 192409515, 193260193, 194280148, 194744110, 193441391, 191800842, 190826187, 190580597, 191883316, 193468094, 194320202, 194503784, 193271408, 192043304, 192340374, 193111420, 193850040, 194439163, 194373608, 194311619, 194825649, 195664883, 196951637, 198137512, 198728333, 198682785, 197439919, 196064472, 195720901, 195548058, 194859982, 194293976, 194261074, 194750557, 196103821, 197674522, 199043045, 199867725, 199280014, 198440552, 198124161, 198617458, 200982571, 203664055, 205581188, 206368675, 204897404, 202377319, 199167252, 196691742, 197014580]
3545A97014580J559715K377281J829872j002311j497994k81105N20954J887799K027988
3554B04436779P89166N69820P64599J394043L066540L326168L371238Q64754n789528
3563B12793579p872085p565747m859218K746353N242347M219285L323097P93457K2392
3572B08843460P18117O55899J17779J98364N66006J449356L410339L970604M292030
3581B24221954K202492l305187o031513q726120o590844K331505N413056N420437L912677
3590B18848457j515140k802601q95996p2937J115303J151085l95279k90871R66530
3599B16108551K133865M420739M230747J858959k79922m026165m435788j623153p5798
3608B18312035J690368K222786R98726J561661N098572L316402m567394p131081p611522
$$ y = [197014580, 198574295, 200951576, 202781448, 201779137, 200281143, 200000038, 200520992, 202408791, 204436779, 205225945, 205795765, 206560364, 207954407, 211020947, 214347115, 217718353, 218583107, 212793579, 204921494, 197355747, 192496529, 195242882, 200485229, 204704514, 208027611, 208821068, 208843460, 209561577, 210217476, 210335255, 210533619, 211099625, 212548981, 215959320, 219929924, 224221954, 226424446, 223119259, 217087746, 208361626, 201770782, 204102287, 209515343, 214935780, 218848457, 217333317, 214530716, 213634720, 213561783, 214677086, 215828171, 215432892, 215142021, 216108551, 218242416, 222663155, 226893902, 228752861, 228472939, 224446774, 220010986, 218387833, 218312035, 220002403, 222225189, 223223915, 224785576, 229884148, 233200550, 228633156, 221502075, 213890553]
3617B13890553m484883M443875Q867263J2148609J1142025N901337o43024j2714386
3625B38551369j6351452j5003681q835793Q298149J1976242L933201J651764J181603
3633B25401402Q40892J379738J477242Q16345J984825N207787O993770Q924961Q162270
3642B61189232O466617l68118j6837368k0754318j5959511r280434N228997J0608425
3650B20293522J0571232P221222m153481o809959l061295l97682M624367N718479K564182
3659B36570587K729912N254021O414184Q428574O145229j258373n342007j0096798
3667B48845329p998466M213581N970249J043320n087147k0530701j8328914L674755
3675B11802006R894123N483398N411377O193886O796608Q251648P464180N723476R66072
$$ y = [213890553, 209405670, 213849545, 222716808, 234865417, 246007442, 251908779, 251265755, 238551369, 222199917, 207196236, 198360443, 206658592, 218634834, 222568035, 224219799, 225401402, 226242294, 227622032, 229099274, 229915619, 231900444, 237108231, 244102001, 253026962, 261189232, 267655849, 267287731, 250450363, 229696045, 213736534, 204456100, 209685097, 220293522, 230864754, 238085976, 233932495, 227122536, 224061241, 223663559, 228287926, 234006405, 236570587, 239300499, 244554520, 250968704, 259397278, 265542507, 264284134, 258942127, 248845329, 240846863, 245060444, 251030693, 252074013, 246986866, 226456165, 208127251, 211802006, 221696129, 227179527, 232590904, 238784790, 245581398, 253833046, 261297226, 267020702, 267986774]
3684B67986774r099960j3245582j5046368j1430016Q64506N718479N995980O356239
3692B38100052N308151M155884K330284Q00629m29402k347469o803284n411377K260933
3701B37964401O097069R611359Q863220L867626j496792j0763397j3679275j2667885
3709B27796326q291741K698670P867584J0493984R895325M305363J470794n14984j774540
3718B53946781j926174k377281l183136k718430j284370O96182L671417O268006J1322975
3727B64415970Q860588k098312p664681j1582603j2767086j2039662p200012L794918
3735B23719120J0569820J8252831J6706009N002727l013363j4232177j4940720n288620
3743B36775627J605988J4986763J0996093j5385379k0223618r676456l048897O883144
$$ y = [267986774, 258886814, 245641232, 230594864, 219164848, 220029354, 225747833, 231743813, 238100052, 243408203, 247564087, 249894371, 250695000, 250265598, 247918129, 241114845, 235703468, 237964401, 244061470, 253672829, 262536049, 266403675, 264906883, 254143486, 240464211, 227796326, 219504585, 222203255, 230070839, 240564823, 250460148, 254765511, 256236305, 255721321, 253946781, 252020607, 249643326, 246460190, 243741760, 242457390, 243153572, 246824989, 253092995, 264415970, 273276558, 271178246, 263513565, 251930962, 239163876, 227124214, 219924202, 223719120, 234288940, 252541771, 269247780, 274250507, 271237144, 257004967, 242064247, 236775627, 238381615, 253368378, 264364471, 248979092, 228755474, 219079018, 216030121, 222913265]
3751B22913265J0525227R815693O593456k900581n471955l249645r13143M491806N827675
3760B47631798M248123K273331k080918l401756j651039k397308o208191n245915J96705
3769B33364830L451347P267456P315636L322373P11212k296219m011631n598316m093171
3778B39433517K331505L400326O199j147270k094498j402855J737824K651939J743069
3787B46659756K070427L514042L493557K265682J382370J07517j68095J282235J59969
3796B60767460l129254n909919j1702538r101143M810810O960164k83490l325462p954598
3805B31132030m610309R691238J3453980J0449638P084847K7656l803024o864777o249656
3814B50311623M18167P27424m049530o592292j1370163p828961P071018J0615120N543213
$$ y = [222913265, 233438492, 243254185, 249847641, 246947060, 241475105, 238225460, 237312317, 241804123, 247631798, 251879921, 254153252, 252072334, 248670578, 247019539, 244622231, 238414040, 233168125, 233364830, 236816177, 244083633, 251399269, 254721642, 255432854, 253136635, 249125004, 243526688, 239433517, 241765022, 245165348, 245171547, 244024277, 241929779, 240526924, 242264748, 244916687, 246659756, 248730183, 252244225, 255737782, 258003464, 259385834, 259493351, 259325256, 260607491, 260767460, 257638206, 251728287, 240025749, 230924606, 235735416, 242695580, 242412090, 239086628, 231132030, 226521721, 236212959, 249666939, 260116577, 267201424, 267229080, 263426056, 256561279, 250311623, 250729790, 251457214, 247407684, 240815392, 229445229, 221616268, 228687286, 239302406, 244845619]
3823B44845619L608952J283397R27220L322353K978325j29204m13894K424698J598854
3832B60446320k141953n008945r592305r323120l925552j072884J415482K488861J109123
3841B34395027K477875N839844R014358J4919510J4061470Q493176n05925j8135070
3849B70560265k4879456k6942730j9025097N492459J4832248J4968415J3780593P566910
3857B56353607L254662j786461l964195l936043k666474J703721K698898K093563p36713
3866B53014565q877278r364605k941360L99589L605595M877090L863335L766060M938831
3875B53281822K765904m301777n455971j452694p7000J142731J04904n535602m298458
3884B36173859N143890N997429o8665k937088p020225m788399N695572R150028Q896351
$$ y = [244845619, 248454571, 249737968, 250665188, 253987541, 256965866, 256836662, 256422768, 258847466, 260446320, 258304367, 253295422, 243703117, 234379997, 230454445, 229381561, 230797043, 233285904, 234395027, 236872902, 242712746, 251727104, 266646614, 280708084, 289201260, 288695335, 270560265, 245680809, 218738079, 199712982, 205205441, 220037689, 235006104, 248786697, 256353607, 259608269, 257821808, 253857613, 249921570, 247255096, 248958817, 251657715, 253751278, 253014565, 244137287, 234772682, 231831322, 232230911, 235836506, 240713596, 244576931, 248342991, 253281822, 256047726, 251745949, 246289978, 244837284, 244760284, 245903015, 246007919, 240472317, 236173859, 241317749, 247315178, 247246513, 244309425, 237289200, 232500801, 238196373, 247346401, 256242752]
3893B56242752O927967J374245k278328n903492p494202p068157o562233n659351l692379
3902B25886822k97299K399903N911598O311893L027916K273560L239879K946129K390385
3911B54090786N58147l598461m876384m461995k815952J832237K859116R13849K2888
3920B44524231j261940j175404L08285J319161L184318K464066j278649k857933l795852
3929B41430283l192673m84219J169682K923736L319016K355347J489639J81656q65689
3938B48326778k251873k283325r62486K6455J839390J534710j316777k056846j588593
3947B41267433r60808N35469J112938J162300R06945j13011k84195L86715L10669l45726
3957B43978729o60171r82762q38279j37577K85644P42416Q21839N04494K77748K2888
$$ y = [256242752, 263170719, 264544964, 262266636, 256363144, 248868942, 241800785, 235238552, 229579201, 225886822, 225589523, 227989426, 233901024, 240212917, 243240833, 245514393, 248754272, 251700401, 254090786, 254648933, 251050472, 246174088, 241712093, 238896141, 240728378, 243587494, 244501343, 244524231, 243262291, 242086887, 242395172, 243714333, 246898651, 249362717, 248084068, 245226135, 241430283, 238237610, 237753391, 238923073, 241846809, 245165825, 247521172, 249010811, 249192467, 248326778, 246074905, 243791580, 242829094, 242855549, 244694939, 246229649, 244912872, 242856026, 241267433, 240306625, 240842094, 241955032, 243117332, 244024277, 243911266, 243627071, 244013786, 244324455, 243978729, 243318558, 242335796, 241497517, 241359940, 241645584, 242388000, 243209839, 243714333, 243992081, 244014969]
3967B44014969k75841p61032q49495n88875l74088k5501J32065R9678J96914M34418
3977B42003212M47273K77977J19210j93825j95732J70707K11220M768p3432j37082
3987B42634296j10149J40915O180n82924p45297p14054m38232K47002O29425R74903
3997B42042065R28878M50612N5313
4000B43476868
$$ y = [244014969, 243739128, 242978096, 242128601, 241539726, 241165638, 241140137, 241272202, 241371880, 241568794, 242003212, 242450485, 242728462, 242847672, 242653847, 242458115, 242628822, 242840042, 242844810, 242771378, 242634296, 242524147, 242665062, 242671242, 242088318, 241343021, 240628967, 240190735, 240437737, 241067162, 242042065, 242970943, 243421555, 243476868]
##END=$$ End of the data block
