##TITLE=$$ Begin of the data block
##JCAMP-DX=5.00 $$ ACD/SpecManager v 10.08
##SPECTROMETER/DATA SYSTEM=16PC
##DATE=Mon Sep 16 14:34:40 2013
##DATA TYPE=INFRARED SPECTRUM
##DATA CLASS=XYDATA
##ORIGIN=
##OWNER=
##NPOINTS=3601
##FIRSTX=400.00000000
##LASTX=4000.00000000
##MAXX=4000.00000000
##MINX=400.00000000
##MAXY=39.88854980
##MINY=4.90417480
##XFACTOR=1.0000000000
##YFACTOR=0.000000100000000
##FIRSTY=39.88854980
##DELTAX=1.00000000
##XUNITS=1/CM
##YUNITS=TRANSMITTANCE
##XYDATA=(X++(Y..Y))
400C98885498p671585k6809235k8235435k1167278Q846530J3215523m685631r765396
408C22612991r938469q640060l407230o57082K581348Q38051o087074j1924973k3475875
417B61901627j9810925L80039J0926247K2054672J9028187l519764r388695m392147
425B77179241j477489M964828N444069j606941m32263Q344403J1462211J4346123Q556595
434C26780777j1153908j5356312p390499l327369K974033L018856n611649m749298
442B85184631M188042Q700371J4912853J0824680p719040j2099990o601334k710800
450B94679413N420189N881805j529941m089604m402160m773369m849911l741741j106262
459B81488419P92732K886772L711243L434639K846489J105079P86782K389183J345405
$$ y = [398885498, 391213913, 364404678, 336169243, 315001965, 323848495, 337064018, 332378387, 322612991, 312674522, 304034462, 300627232, 299970150, 302551498, 303389549, 297302475, 285377502, 261901627, 242090702, 242470741, 253396988, 275451660, 294479847, 290960083, 281571388, 277179241, 275701752, 280666580, 286110649, 284503708, 284071445, 292415848, 303878059, 318224182, 326780777, 315626869, 300270557, 292880058, 289552689, 292526722, 295545578, 289933929, 285184631, 289372673, 298073044, 312985897, 323810577, 316091537, 303991547, 297390213, 294679413, 300099602, 305981407, 304451466, 300361862, 295959702, 291186333, 286336422, 282594681, 281488419, 282281151, 285167923, 288879166, 292313805, 295160294, 296265373, 297052155, 299441338, 300786743]
468C00786743l129959l328323Q42552J302013j201877j582604n52425l51429n88188
477B92196503n89371p01656k11964R67522J772880K884865K641182N69591K18640J642933
487C01391125J072178j491795k286911k027512j621246n48363J8826P25Q85238L165245
497B98557510L380547J734734Q72135K68936o24905j559963k986660n885124n885620
506B87871590l545266j007576L834973M693031K108574K02427l577232l147374J971722
515B89404869L778229M848709K876282m153729n878696l517609k557754j062165j294365
524B82443771m007835l928185j227836m94251j046658j021156r09558o12011l04718
533B68891563O15845L492584K347947l811112n035629k383003j573334j125088j245022
$$ y = [300786743, 297656784, 294328461, 295171013, 296473026, 295271149, 293688545, 293136120, 292784691, 292196503, 291607132, 290905476, 290693512, 291661034, 293433914, 296318779, 298959961, 299529552, 299748192, 301391125, 302463303, 300971508, 298684597, 296657085, 295035839, 294487476, 294506302, 294507027, 295392265, 298557510, 301938057, 303672791, 304544926, 304813862, 304188957, 302628994, 299642334, 293757210, 287871590, 284326324, 283318748, 287153721, 291846752, 293955326, 294157753, 290580521, 287433147, 289404869, 293183098, 298031807, 300908089, 296754360, 290875664, 287358055, 284800301, 283738136, 282443771, 278435936, 274507751, 273279915, 272785664, 271739006, 270717850, 269808292, 269196281, 268891563, 269507408, 272999992, 275347939, 271536827, 266501198, 264118195, 262544861, 261419773, 260174751]
542B60174751l077736j841316L256798M261494K120266R95140l87192j097183j583348
551B62821674r83715J562844J746406m56085o43024R29584Q82874m89464r83734j072884
561B63314476j070251r15528n38826J59264P11212J527538J431713J37329l6964J346588
571B66066551K17438m354706m580746j172771R26476L738651M119167J684895J109600
580B67754555J696110J557102R97085O83060M40121L00884K1458N43117K796898K115002
590B78905392k244702k646446L29247J368751J691589J730195J929054P5817o162891
599B74976006n243531L808499N551338J927376O06537k60354r47246j681080j282215
608B77455330R04083J075745n87940j002312r49154l86696J613369J294842k037048
$$ y = [260174751, 257097015, 255255699, 258512497, 262773991, 264894257, 265889397, 265502205, 264405022, 262821674, 261837959, 263400803, 265147209, 264691124, 264048100, 264977684, 265860558, 265371094, 264387360, 263314476, 262244225, 261328697, 260789871, 260949135, 261660347, 263187885, 264619598, 264756927, 264719963, 266066551, 266283989, 261929283, 257348537, 256175766, 257102242, 260840893, 264960060, 266644955, 267754555, 269450665, 271007767, 272004852, 272687912, 273128033, 273428917, 273450375, 273993492, 276790390, 278905392, 276660690, 274014244, 274343491, 275712242, 277403831, 279134026, 281063080, 281138897, 274976006, 269732475, 273540974, 279092312, 281019688, 281626225, 281365871, 280418625, 278737545, 277455330, 278359413, 279435158, 278847218, 277844906, 276895752, 276509056, 278122425, 279417267, 277380219]
617B77380219j846772J520615K908707L898868L320217M25816o27995p46250m67052
626B85766373J065254R64165q11825j210690n30719o34194j589069j260987M29154
635B82187462J028786J032829R14326M49180O0082j56403j008987l148079l164044
644B78195152j451034J54743L422260L110886j154900k633571l046284k251377J105785
653B75451660J464844q90007j535416j781463q10872K238980L099212K737523J550922
662B81525383k945442j209488J0598907P573357j2582054j5780449o409893j007557
670B59762764P460365P395020k852211n088558k127171r11941P79151J000405k35558
679B65182266j036644k247104k382527j596451p62214J230240Q13007j901379l797779
$$ y = [277380219, 275533447, 277054062, 279962769, 283861637, 287181854, 287607670, 286979675, 286233425, 285766373, 286831627, 287795792, 286983967, 285773277, 285242558, 284608364, 283019295, 281758308, 282187462, 283216248, 284249077, 285163403, 285612583, 285672665, 285516262, 284507275, 281359196, 278195152, 276744118, 276898861, 280321121, 283432007, 282277107, 279643536, 276597252, 274345875, 275451660, 276916504, 276026497, 274491081, 272709618, 271898746, 274137726, 277236938, 279974461, 281525383, 278579941, 277370453, 287969360, 295542717, 282960663, 267180214, 260770321, 259762764, 267223129, 274618149, 271765938, 266677380, 264550209, 263638268, 264417419, 265417824, 265182266, 264145622, 261898518, 259515991, 257919540, 257157326, 258387566, 259200573, 257299194, 253501415]
688B53501415n721798p407436p672558j1512508j9116402k4733295l1881342l2239437
696A13216639k6274443k0441294j2266397n192757L189564O682873L653049O831646
704F9398880J5564203J9735098K1347284K2501946K2802839K1730652J8779526J6491642
712B28352070J4434814J1793843Q326530N817185L802776K349148J675834Q38509k42939
721B77147770l06835Q18252J182556J329175J033782L80764p45315l190994l457527
730B74191628j556645r43184n93433j150589l275166l683338k550583k460728k925872
739B55052090l314724m122734m001389k742042k530594k887955l544807m716645n814304
748B21376896p813206p402916l930549l318081m725209n592594o959667p230759o823310
$$ y = [253501415, 247779617, 240372181, 232699623, 221187115, 202070713, 177337418, 145456076, 113216639, 86942196, 66500902, 54234505, 49041748, 52231312, 58914185, 62567234, 69398880, 84963083, 104698181, 126045465, 148547411, 171350250, 193080902, 211860428, 228352070, 242786884, 254580727, 262907257, 268724442, 272527218, 274876366, 276552200, 277390709, 277147770, 276840935, 277659187, 278841743, 280170918, 281204700, 281585464, 280840149, 277649155, 274191628, 272634983, 271691799, 271098366, 269947777, 266672611, 262989273, 260438690, 257977962, 255052090, 251737366, 247614632, 243613243, 240871201, 238340607, 235452652, 231907845, 227191200, 221376896, 213563690, 206160774, 202230225, 198912144, 194186935, 188594341, 181634674, 174403915, 167580605]
757A67580605n662919l513336j394987J355171L102293L889084N177269O921044P839203
766A85293427Q173713Q237362P749310P516861P409343P141114O660709O458282O633511
775B51273632O296158N478153M940987M434814M194737M387149M111043L463745K956867
784B91537285K599487J841545K22664J31855J746426J965275J240253Q62598M71116
793C02618504K17437J44482p4387n48133n14985r0103M22230J492500J542569M18186
803C05628300L11374J377831Q01792j832714k047310q8921N49546P61032M63257j206894
813C04717293p14760K503853K657432K32449r29356k165069j970787P5588P79400Q28247
823C06014290O64959O0081n13782j671334j427402N85308R10053r8705m03175m07925
$$ y = [167580605, 161917686, 158404350, 157009363, 158364534, 161466827, 165355911, 170533180, 177454224, 185293427, 193467140, 201704502, 209453812, 216970673, 224380016, 231521130, 238181839, 244640121, 251273632, 257569790, 263047943, 267988930, 272423744, 276618481, 281005630, 285116673, 288580418, 291537285, 294136772, 295978317, 296200981, 296332836, 298079262, 300044537, 301284790, 302147388, 302618504, 302835941, 302980423, 302906036, 302357903, 301842918, 301752815, 302175045, 303667545, 305210114, 305628300, 305939674, 307317505, 308119297, 306286583, 304239273, 304150352, 304699898, 305460930, 305924187, 304717293, 304002533, 306506386, 309163818, 309396267, 308466911, 306301842, 304331055, 304406643, 305186043, 306014290, 306679249, 306739330, 306225548, 304554214, 303126812, 303712120, 304622173, 304523468, 304120293, 303712368]
833C03712368n34763n81990r36756j889686j893540r01928o47793q02040r48181j641502
843B92934189j077423J219978J542339K25544l69072j165866q28743J179943J373043
852B95033932p7496l75252r5863K66075J274605J165619p6523o26564q84552j075745
862B94528236j339416q94318P07855Q91457j7395p49130j982689k273064j731415j360893
872B85779228o90460o04134j402626j000404P06673J215458Q98838P68184M30355M45824
882B86546936O44932J145363K336979K542018K028943J400222J30902k83490q6784
891B96406021J98364J004715J122704Q11577K41756j031627j402398r71069r44366
900B95435677p23839j498718l831864m282703l122807k707710k492905k304573k628784
$$ y = [303712368, 303177605, 302595615, 301658859, 299769173, 297875633, 296973705, 296325912, 295523872, 294575691, 292934189, 291856766, 293076744, 294619083, 294844627, 294475555, 293309689, 292480946, 293660889, 295033932, 294956436, 294581184, 294485321, 294751396, 296026001, 297191620, 297115097, 296488533, 295603981, 294528236, 293188820, 292294502, 293002357, 293893814, 293876419, 293127289, 291144600, 288871536, 287140121, 285779228, 285088768, 284484634, 283082008, 282081604, 282788277, 284003735, 284902573, 285670757, 286101112, 286546936, 287191868, 288337231, 290674210, 293216228, 295245171, 296645393, 296776295, 296492805, 296406021, 296604385, 297609100, 298731804, 299543381, 299785137, 298753510, 297351112, 296380043, 295435677, 294711838, 293213120, 289381256, 285098553, 281975746, 279268036, 276775131, 274470558, 271841774]
909B71841774j695404P43141J925717K287864K846012L311158L822078M679432M539738
918B94301510L247509K767792K960929K419701J096497N85785P20748N71480M83284
927C09155235K861j228828j324654k04544p8201o01769r43183j607667j407852j16119
937C01645279J66416m29401l28293M52766M03405l78380p73907j170158j138211l86238
947B98063278n11169j477967j832008j883736j847267j227150j794567l660679m609584
956B79219151m919758n696297o917496p567157q265496p549286n190601l566036k180805
965B27366219o38733J058578K519131L894806M969349O091118O083030M610520M187355
974B60141373M452934M332313M285584L543854J688957J160374J897335J701355P18841
$$ y = [271841774, 270146370, 270889511, 272815228, 275103092, 277949104, 281260262, 285082340, 289761772, 294301510, 297549019, 300316811, 303277740, 305697441, 306793938, 307379723, 308100471, 308671951, 309155235, 309158096, 307929268, 306604614, 306400070, 306321869, 305720100, 304776917, 303169250, 301761398, 301645279, 301811695, 301382294, 301054001, 301506767, 301910172, 301531792, 300757885, 299587727, 298449516, 298063278, 297552109, 296074142, 294242134, 292358398, 290511131, 289283981, 287489414, 283828735, 279219151, 274299393, 268603096, 261685600, 254118443, 245852947, 238303661, 233113060, 229547024, 227366219, 226727486, 227786064, 230305195, 234200001, 239169350, 245260468, 251343498, 255954018, 260141373, 264594307, 268926620, 273212204, 276756058, 278445015, 279605389, 281502724, 283204079, 283922920]
983B83922920N60990J194725J139869O43730J96686n89828o51608R8229K47955j49479
993B86614189J05858J039734J347771J550216Q68073j191139j880417j684895j412868
1002B85356522p06902j91231M74701N52902p400k67983l77426o80198j237393j461506
1012B81454086j302719j549721k087822k589473l305912l561249l390808l330231l119926
1021B57216225l262520l991852l870735k977123k437344k576599r70116K802353M634400
1030B44566689N131950N973816P279396O891251M553794L445626K942314K359886K020836
1039B85165558J316776R5844m26063m04110m34170k62966l10650m92096p27653j116295
1049B82404175j344433j544247j503696j016865j120567j762848k115975k556076k408752
$$ y = [283922920, 284483910, 285678635, 286818504, 287462234, 287658920, 287069092, 286417484, 286515713, 286763668, 286614189, 286720047, 287759781, 289107552, 290657768, 291525841, 290334702, 288454285, 286769390, 285356522, 284649620, 284458389, 284933090, 285485992, 285478592, 285210609, 284833183, 284152985, 282915592, 281454086, 280151367, 278601646, 276513824, 273924351, 270618439, 267057190, 263666382, 260336151, 257216225, 253953705, 249961853, 246091118, 243113995, 240676651, 238100052, 237129936, 239932289, 244566689, 249698639, 255672455, 262951851, 269843102, 274396896, 277842522, 280784836, 283144722, 285165558, 286482334, 286578178, 286152115, 285748005, 285313835, 285050869, 284740219, 284248123, 283520470, 282404175, 281059742, 279515495, 278011799, 276994934, 275874367, 274111519, 271995544, 269439468, 267030716]
1058B67030716j513958j185894j130829j211872j637211j712093j657009j286984m43706
1067B55251160N4130L75023O60668P86552J106720J751442J845589J504669J138439
1076B64474392L47614L16849J033783J362801J624107J672039J490116J287937J068115
1085B74677753O07968l34511n70526k2659j89534r24587j317978j900902j458416M53701
1095B69020309Q40683n1746k14825j28975J17779Q95024Q09192l1719o68030j640568
1105B68947124j746425q80699o68297p15981r74655j823654j797199r58920n22384
1114B58858910j49727K0523j44501K2430N43824O59713N52636K52018m93050p08828
1124B59413948l35445n89123j506100j726150j398564j288643j003990j351356k412319
$$ y = [267030716, 265516758, 264330864, 263200035, 261988163, 260350952, 258638859, 256981850, 255694866, 255251160, 255305290, 255680313, 256340981, 257127533, 258234253, 259985695, 261831284, 263335953, 264474392, 264822006, 265138855, 266172638, 267535439, 269159546, 270831585, 272321701, 273609638, 274677753, 275285721, 274951210, 274380684, 274358025, 274168491, 273243904, 271925926, 270025024, 268566608, 269020309, 269860992, 269809246, 269594421, 269465446, 269583225, 270478249, 271287441, 271255722, 270587692, 268947124, 267200699, 266320000, 265651703, 264935722, 263961067, 262137413, 260340214, 259381294, 258858910, 258709183, 258729706, 258585205, 258607635, 259151459, 259811172, 260363808, 260615826, 260122776, 259413948, 259078503, 258489380, 256983280, 255257130, 253858566, 252569923, 251565933, 250214577, 247802258]
1133B47802258l056050l804931l700715k350807k285003l232251l748417m368782m396209
1142B16859093l681183l518810l806820l661156l338356k696495j472721q61416q08220
1151A93013916l38325L87916J034012J917610K101402J474629J414547J684646J852761
1160B04543114K256164J977673R49859L59784k9564m57306j063805j048088k10762
1169B07277069j51882p30991r12896r01470r19342r36260q50926n49793n88894j073360
1179A99661255j027107o19889j49727O00090J059781J275768J631737K187500K319564
1188B06938972K114068J850128J202354J190186J978149J888752Q69045Q08220J677285
1197B20517159J701583Q97656R72500J820106K157669K328873K241135J834640J441231
$$ y = [247802258, 244746208, 240941277, 237240562, 234889755, 232604752, 229372501, 225624084, 221255302, 216859093, 213177910, 209659100, 205852280, 202191124, 198852768, 196156273, 194683552, 193822136, 193013916, 192675591, 193063507, 194097519, 196015129, 198116531, 199591160, 201005707, 202690353, 204543114, 206799278, 208776951, 209726810, 210086594, 210057030, 209599724, 208535919, 207487831, 207277069, 207125187, 206394196, 205481300, 204579830, 203660488, 202724228, 201873302, 201323509, 200734615, 199661255, 198634148, 198014259, 197864532, 198464622, 199524403, 200800171, 202431908, 204619408, 206938972, 209053040, 210903168, 212105522, 213295708, 215273857, 217162609, 218031654, 218839874, 220517159, 222218742, 223116398, 224088898, 225909004, 228066673, 230395546, 232636681, 234471321, 235912552]
1206B35912552Q69293N51682L33786M00543R20544J034030Q49476P90348P68433P11918
1216B43142605O04877N79834N95322O81400J048565Q23975q6060m35829m35600m91867
1226B46027222n27134m44660o4850k03591q42819j239300j681328j761188j520405
1235B37741947j200676o99997j87168O10352P68203K41738J33762J16348L97931J147270
1245B39069710J478653J579284J584301J335144J328221J569290J538029J291523J119842
1254B51893997R25293Q06809R29832N31197n19028r40323r30309r80377r53923r09309
1264B49853859r78966n76477M49410R06715J106491R95636L08762J60217K80380O32515
1274B53138542J393089J892796K395630K512455K246857J971473J501084J204033R11941
$$ y = [235912552, 236781845, 237333527, 237667313, 238067856, 238988400, 240022430, 240871906, 241662254, 242430687, 243142605, 243747482, 244327316, 244922638, 245604038, 246652603, 247476578, 247390518, 246954689, 246519089, 246027222, 245500088, 245055428, 244990578, 244786987, 243944168, 242704868, 241023540, 239262352, 237741947, 236541271, 235841274, 235654106, 236264458, 237032661, 237274399, 237408161, 237524509, 237922440, 239069710, 240548363, 242127647, 243711948, 245047092, 246375313, 247944603, 249482632, 250774155, 251893997, 252819290, 253626099, 254555931, 255087128, 254568100, 253627777, 252697468, 251717091, 250763168, 249853859, 248874893, 248298416, 248747826, 249654541, 250761032, 251756668, 252065430, 252225647, 252506027, 253138542, 254531631, 256424427, 258820057, 261332512, 263579369, 265550842, 267051926, 268255959, 269167900]
1283B69167900R27925J452923J378765Q33283M11510j97411l47843l1719P0572K90623
1293B73956528k0485j255036j195201J29451O16570Q05855O38713k28881l65735J51406
1303B73233185J97162j05152j26342M57J75247O60172N05219n24521n40734K60125
1313B73734818P74383J626015J420974j82399m24633M24385O83079Q23726O36101k2163
1323B79494286l73364p07378o42319o9122J93348L92437L55491j88370J3352R85870
1333B79454231J375923J809349J133690r46045k099990l473053k816201P68891J437187
1342B76643982l55473n88894L03269L3379j367798j738549j656074r76067J115799
1351B71413574J217346p19070j101246n58853j67370N81017P27653Q54035m08669m177322
$$ y = [269167900, 270095825, 271548748, 272927513, 273760796, 274172306, 273974895, 273627052, 273595333, 273665905, 273956528, 273936043, 272681007, 271485806, 271615257, 272231827, 273037682, 273676395, 273447514, 273081779, 273233185, 273430347, 273325195, 273198853, 273199310, 273374557, 274034729, 274539948, 274015427, 273474693, 273734818, 274509201, 276135216, 277556190, 277373791, 276949158, 277373543, 278056622, 278880348, 279516449, 279494286, 279120922, 278413544, 277771225, 277702103, 277895451, 278287888, 278643379, 278455009, 278468361, 279454231, 280830154, 282639503, 283773193, 282827148, 280727158, 277254105, 274437904, 275206795, 276643982, 276288509, 275699615, 276002884, 276036263, 274668465, 272929916, 271273842, 270297775, 271413574, 272630920, 271911850, 270810604, 270251751, 270084381, 270665398, 271393051, 272247086, 271838417, 267661095]
1361B67661095m617462k388707o88801K482186K321720k134323k229939J622448K413273
1370B64441490J852513J09424n008926m900456P10011K117157R46998L99590o70204
1379B59997597q83808o45161K79427L118038K721538j032829k507210l705482k251625
1388B55090485L016929N070935O589412L885041o412507p135391J813164K877006k017021
1397B62778053l023395k680302o82106N634308N308857k384434l584366k17437J560668
1406B62709846M104615M150161J003266P01427K672673L166198K336731L313561Q113861
1415B92272339N539646n766392r180298q669147m991779P151374P319222n497704o823539
1424B71353722J487007K375374j274109l940106q928051q537788k391091K98272L947010
$$ y = [267661095, 263043633, 260654926, 259966125, 262448311, 264770031, 262635708, 260405769, 262028217, 264441490, 266294003, 266403427, 261394501, 256494045, 257204056, 259321213, 260268211, 260667801, 259997597, 259113789, 258468628, 258748055, 261866093, 264587631, 263554802, 261047592, 257342110, 255090485, 258107414, 263178349, 269767761, 273652802, 267240295, 260104904, 261918068, 264795074, 262778053, 259754658, 257074356, 256392250, 262026558, 267335415, 264950981, 261366615, 261149178, 262709846, 266814461, 270964622, 271967888, 272669315, 275341988, 278508186, 280844917, 284158478, 292272339, 297811985, 292045593, 282865295, 274196148, 269204369, 276355743, 283674965, 278177261, 271353722, 272840729, 275216103, 273941994, 270001888, 261073837, 252536049, 250144958, 250443230, 254390240]
1433B54390240R9430j5626679j7250061o575107k366772O73523J16348n951156p450829
1442B00058937n537758n672207o382236q098107j2475509j2463322p681131o705523
1450A35043144j0957479o179810R369850J4464140J0884524J2729177J8600216J9990444
1458B03944206J7968178J6764641J7305851J1654377l626595o854763j99795L332615
1466B60288715Q197308R577751R969483M206161j3316383j5016327j423340J999130
1474B64482498p07149k45571J947402K320290J652489L74794l081322k874622K068767
1483B65937576J610260l297310o328582p699967j2874374k5090695k5933513j7263642
1491A69059753j0055065p41720P384310J6529312K1158943K2516251K1162262J4009704
$$ y = [254390240, 254489670, 238862991, 221612930, 215037823, 212671051, 213344574, 213460922, 207509766, 200058937, 194521179, 188848972, 182466736, 174368629, 161893120, 149429798, 141748667, 135043144, 124085665, 117905855, 127275705, 141739845, 152624369, 165353546, 183953762, 203944206, 221912384, 238677025, 255982876, 267637253, 264010658, 257155895, 256956100, 260288715, 268486023, 278063774, 288033257, 292239418, 278923035, 263906708, 262483368, 264482498, 263775349, 263529778, 265477180, 267797470, 269449959, 269824753, 266743431, 263868809, 265937576, 267547836, 264250526, 257921944, 250221977, 237347603, 212256908, 186323395, 169059753, 159004688, 158262968, 165647278, 182176590, 203335533, 225851784, 247014046, 261023750]
1499B61023750J2845993J6936798J7430535K1459579R346237k9310455l3230057n758781
1507B70743599N205879J2595406J2579918k86808l92437J3694534J0635376j2276421
1515C12499046j2877464Q595696J0924587l18279o207963j5829086j1767616J2321949
1523B97340870J3642788p376671r656677J767654N957108R171257P311096j242638
1531C16914787n916824j3798237p112751K2023926K4297256M865876p590294k7457238
1539C06226501k5874633J932144Q001098k647171k134323O328125P707348M225254
1547C03764343K025605k141953j420498N918503O103268k844811P58667K5246620J5602570
1556C53012314l6156407m3083667j5131951N61486K2552242K3753414n96542m365921
$$ y = [261023750, 273869743, 290806541, 308237076, 329696655, 339042892, 309732437, 276502380, 270743599, 275949478, 288544884, 301124802, 300837994, 300445557, 314140091, 324775467, 312499046, 299621582, 308217278, 319141865, 318823586, 312615623, 296786537, 285018921, 297340870, 310983658, 303606987, 293950310, 295717964, 301675072, 310846329, 318157425, 316914787, 310997963, 297199726, 290086975, 312110901, 336408157, 341274033, 333683739, 306226501, 280351868, 282284012, 290285110, 287637939, 285503616, 291831741, 299539089, 303764343, 305789948, 303647995, 302227497, 308146000, 314249268, 311404457, 312163124, 337409744, 353012314, 316855907, 273772240, 258640289, 259201775, 281754017, 305507431, 304910889, 300544968]
1564C00544968Q201847P945308r75608o040345j4539947r833832J3284683J7345200
1572C15932274R015312r05266k4620285k4115810K833118R312878K878895K21977m603615
1581B85949478m508018R77268K885570L076554L076553K410431J449585m57306j076698
1590B93783417j90964r05762l127556m124889m149189m926929o484280o990891p236728
1599B55646229n894184k990246K54631N180111P645149Q719902Q264084N474319L702393
1608B86002388J156101J650105N630245P495174J2268067N455246k0069123k1311035
1616B78277168m18911Q204212J5355359J2249240o416091j0648251n023251j231899
1624B90347576P246971O018391q074513q010387M521847R256363J2576103R213428
$$ y = [300544968, 308746815, 316692123, 315716515, 309676170, 295136223, 285302391, 298587074, 315932274, 324947586, 324042320, 299422035, 275306225, 278139343, 287452221, 290331116, 290553093, 285949478, 281441460, 282418728, 285304298, 288380852, 291457405, 293867836, 295317421, 294860115, 293783417, 293592453, 292686691, 289559135, 285434246, 281285057, 276358128, 269873848, 262882957, 255646229, 249752045, 246761799, 247016430, 252196541, 259841690, 268561592, 276825676, 282299995, 286002388, 287158489, 288808594, 294438839, 301934013, 314202080, 319657326, 299588203, 278277168, 277858257, 286062469, 301417828, 313667068, 307250977, 296602726, 291579475, 290347576, 297594547, 303612938, 295538425, 287528038, 292049885, 301306248, 313882351, 323095779]
1632C23095779k277107j0847587k5805474k0968895R574890J5993119K825241J746177
1640B93336143P860432R071350J0820141L437538k0748634k1383991j746655J0919571
1648B91565895L4594078K4602165k9966354m0798912k0522347o944427J6570320K1285057
1656B90385475P000923L250122O124497J722107j2515068j2456169J248817P067452
1664B91828156J2266387R309311m873047j0468006j4614811q569717J6536217J6481170
1672C07895660r445419j4180908n222798L55473R994278J1002312J415481J778832
1680C03592911J7297516O604690m1832695m0518761J1745682K2667885M766464K59171
1688B84582863j988659L43571J1962165J1720181J288166m869213j4702797j0874500
$$ y = [323095779, 320818672, 309971085, 284165611, 263196716, 272771606, 288764725, 291589966, 293336143, 301196575, 310267925, 321088066, 324525604, 303776970, 282392979, 280646324, 291565895, 326159973, 350762138, 320795784, 279996872, 259474525, 252530098, 269100418, 290385475, 297386398, 300636520, 306761017, 308483124, 295968056, 283511887, 284760704, 291828156, 304094543, 313403854, 308530807, 298062801, 283447990, 274878273, 291414490, 307895660, 298450241, 284269333, 279046535, 279402008, 289396286, 300398598, 301814079, 303592911, 320890427, 327495117, 285662422, 245143661, 256889343, 279557228, 284323692, 284582863, 282594204, 282937775, 294899940, 306620121, 307908287, 303039074, 288336277, 277461777]
1696B77461777J5950908J1093617l2490006l1945724J1701832J9696712L010273l488788
1704B70990601j0406247j0189056l44753J602649k160072k858162j774082k552986
1712B42307892l976822p276039j3846893j6874066j9957065j5513192P46727M080773
1720A69691315l387451n412560o230602n146027p93695O69479k94208O20842L019332
1729A52736425M175425O410122L162861j1344910p438183J8272400K2554398R465465
1737A97994003O003838O007442P124901J2207508J2201081O857147O221542J0355225
1745B64972687Q965721K663860p02152l967743l642082M68483M098663J1760216R669800
1754B94287453n455017o705056M928360O498337J870155j470813q947125o357193R575844
$$ y = [277461777, 293412685, 304506302, 272016296, 240070572, 251772404, 271469116, 274479389, 270990601, 260584354, 250395298, 250050545, 251653194, 249493122, 246634960, 244860878, 242307892, 238331070, 231055031, 217208138, 200334072, 180377007, 164863815, 165610542, 169691315, 166303864, 160891304, 154660702, 149514675, 148720980, 149390459, 149096251, 149717093, 152736425, 156911850, 163321972, 166484833, 155139923, 147701740, 165974140, 188528538, 197994003, 203997841, 210005283, 217130184, 229337692, 241538773, 248395920, 254617462, 264972687, 273938408, 276602268, 275900116, 271932373, 268290291, 268758774, 272857437, 284617653, 294287453, 288832436, 282127380, 287055740, 293554077, 295424232, 293953419, 285006294, 278649101, 288224945]
1763B88224945J1543026J327038q94776J434784J908799M182319M1962j5183678j4597893
1772B77986526K027512O883144M662762M398098M630089K161732n531063n155564M749050
1781B96812286N043984l786316m540920N21660L234157P007103O363411J842251l239384
1790C09258232j4383316j2901802L180046P272949L368607K087593J045723q42819
1798B98085213m725685m927636j651764K35558K554169K891063R41754L33786P71751
1807B94508209j92871l180275l262977p68204O84509K747536K430687j017819j601925
1816B90346870j83353O87122J685868K656688N233288L033867o710758o544361M225025
1825B94430256N373478n31922l536224q293152o144027N531311P590522J836777J98593
$$ y = [288224945, 299767971, 301095009, 300200233, 301635017, 303543816, 307726135, 307768097, 292584419, 277986526, 280014038, 286897182, 291559944, 295958042, 300588131, 302749863, 297218800, 292063236, 296812286, 301856270, 298069954, 293529034, 294050694, 297284851, 304291954, 310655365, 312497616, 309258232, 294874916, 281973114, 285153160, 292426109, 295794716, 297882309, 298928032, 298085213, 293359528, 288431892, 286780128, 287015686, 289569855, 292460918, 293402672, 293736458, 294508209, 294315338, 291135063, 287872086, 287103882, 287788391, 290535927, 292966614, 291948795, 290346870, 290163517, 290850639, 292536507, 295193195, 300426483, 303460350, 296749592, 290205231, 294430256, 299803734, 299271812, 295735588, 287442436, 281298409, 286829720, 294420242, 296257019, 296455612]
1834B96455612K35329k22435j694927O6280P141113O959439Q75225l957501j3273945
1843B92584190j1287689M897118P908573L04470p75108K056846K111435K47460k81334
1852B97765961j1444n3635j10397k61765n92480o84261p20978l87420K17189J173973
1862B96334743L436795L107071R59167k207527r416580r373417k128601J224041L901253
1871B85836945M126548R74655p7972r5596k97547l01857m20322p73430n69591L57627
1881B88759460N48363k43645M26045L610134K652645l163338m317035k503891m65622
1890B85303116M518738M306564j853943k816200J90964R36279O43501O45867O42051
1899B92516937N02129N3406J15394P30744R09328J060009N36919j082650j464843j103649
$$ y = [296455612, 296690941, 296468506, 294773579, 294839859, 301980972, 308940411, 309815636, 305858135, 292584190, 281296501, 286193619, 294102192, 294406662, 293631554, 295688400, 297799835, 298047295, 297765961, 297754517, 297700882, 297590485, 297328720, 296736240, 296051979, 295331001, 294943581, 295160770, 296334743, 299771538, 302878609, 303837776, 301630249, 292213669, 282840252, 280711651, 281935692, 285836945, 289963493, 290938148, 290860176, 290764580, 290467033, 290165176, 289744854, 288971424, 288401833, 288759460, 289307823, 289064178, 289490223, 293100357, 295753002, 292589664, 288272629, 285768738, 285303116, 289821854, 294128418, 292274475, 289458275, 289649239, 290585518, 291229019, 291874886, 292516937, 293019066, 293072472, 293187866, 293918610, 294827938, 295887947, 296424866, 295342216, 293877373, 292773724]
1909B92773724l60241J334190K062302K547035J810551n23091j973629m164448l083000
1918B90423393L045559L108978l028621l712197l08742R94434J940499J744499j88332
1927B94019470o96430j18732k63939j002312j046181n44300j90258J89057N92002J329899
1937B92268276J157761M94480j090527n269527m923821M62761J703511r9659j69754
1946B84533501R10282O92844r83467j026649M99496P55081N3864j9779L68366K95391
1956B86078930l00408k51064L88146O69021P66030R26017J543770P91550j998196k327442
1966B86286354o33240L33786J678238J730194K93732j78108j97163j69277R5844K42481
1976B89482841M20323L85532J07765m9133k91824j57585N33580N96047m4117R2049
$$ y = [292773724, 292413483, 293747673, 295809975, 298357010, 300167561, 299644470, 297670841, 293506393, 290423393, 293468952, 296577930, 293549309, 289837112, 289528370, 290522804, 292463303, 294207802, 294019470, 293323040, 293204308, 292940369, 291938057, 290891876, 290347576, 290157318, 290346375, 290938377, 292268276, 293426037, 293920517, 292829990, 287560463, 282636642, 283099403, 284802914, 284703255, 284533501, 285443783, 286136627, 285153160, 284126511, 284626007, 285381088, 285434952, 285415173, 285783539, 286078930, 285778522, 285527458, 285915604, 286584625, 287350655, 288276672, 289820442, 290611992, 288613796, 286286354, 285653114, 285986900, 287665138, 289395332, 289689064, 289510956, 289313793, 289144516, 289240360, 289482841, 289903164, 290288696, 290396461, 290347328, 290055504, 289897919, 290431499, 291027546, 290983429, 291075478]
1986B91075478J214981J003971l92666j247654k641430j980553J450310K195816Q41141
1995B91519394M98066N92480L05881m56562m99020K90623K64664n83420n79834K98500
2005B91650772K84672o45161o31332K10991M79469M17938M51088P59373J94302j710167
2015B91461945j941204p82013j13736Q07534Q86192Q831k75364l43094k38647K37694
2025B89708138L31153Q2264Q2016L02315K61555j0033j52340l36170k41280J50452
2035B90178070M45595J019249P64122n01633r45091r82514p83462p0076K14329K21500
2045B89560089K87514L78151K93236p2709r8457K71301J90735l79314m39644k2183
2055B89968719k28l56446k87513K22206L03974J38035j30158q46157p74383J72615
$$ y = [291075478, 292290459, 293294430, 292901764, 291654110, 289012680, 287032127, 288482437, 290678253, 291519394, 292017460, 292609940, 292915821, 292459259, 291960239, 292250862, 292515526, 291932106, 291352272, 291650772, 291935444, 291290283, 290658951, 290869942, 291349411, 291767349, 292218437, 292977810, 293172112, 291461945, 289520741, 288738728, 288624992, 289432526, 290318718, 290327549, 290052185, 289709091, 289470444, 289708138, 290039291, 290121555, 290203571, 290505886, 290767441, 290757408, 290605068, 290268898, 290027618, 290178070, 290623665, 291642914, 292407036, 291905403, 290960312, 289977798, 289194336, 289124260, 289338589, 289560089, 289847603, 290225754, 290518990, 290446281, 290347824, 290619125, 290809860, 290430546, 289990902, 289968719, 289968491, 289612045, 289324532, 289546738, 289850712, 289988747, 289858589, 289012432, 288238049, 288410664]
2065B88410664M09374K44846K7657n43843o13441k49138l6487K37216L03994K00271
2075B88391113M4594l41663l63102m6730J20163K78930L50724L36418L10173K80609
2085B89361229J39236j72844l13987l96500l15895J4057J40896J79539J20411r6569
2095B88659573k25068l50475l78837l43323k06719J33038K30541Q5125J42098M65870
2105B88211823L51676k52265m35105m06990k40784K95639L43075j11103j57127J09443
2115B87708282J59989J00136L3378j36146j30177J00384P9384k11487k24819j0739
2125B87468185Q2016K31514P4158n90572n98660N3406J87149r54j19934l93371l20206
2136B86072731J77612K85397R3708N1727J05381J8597j73092l78609p83920p37190
$$ y = [288410664, 288820038, 289064884, 289092541, 288548698, 287935257, 287686119, 287649632, 287886848, 288190842, 288391113, 288435707, 288094044, 287730942, 287684212, 287804375, 288083305, 288434029, 288770447, 289080620, 289361229, 289500465, 289327621, 289013634, 288617134, 288301239, 288315296, 288456192, 288635731, 288756142, 288659573, 288434505, 288084030, 287705193, 287361870, 287155151, 287288189, 287518730, 287603855, 287745953, 288211823, 288563499, 288311234, 287876129, 287469139, 287228355, 287523994, 287867069, 287755966, 287598839, 287708282, 287868271, 287968407, 288001785, 287865639, 287735462, 287835846, 287915230, 287703743, 287478924, 287468185, 287550201, 287781715, 287855873, 287265301, 286666641, 286720047, 286907196, 286906242, 286786308, 286392937, 286072731, 286250343, 286535740, 286629448, 286681175, 286786556, 286805153, 286632061, 286253452, 285469532, 284732342]
2146B84732342k46296O5574M17939N55763M89960M28905L35694J49021k89212k87532
2156B86352158K19574K76813L9101j59741n50499n43842j09425M0512Q9417J3828l64055
2167B85303841l10898K25773L01113K8381j02043k29111k88009k85645k60811k00767
2177B84181824j18008N2700N9586o5804k00977m95205m76341j65940M6234K73247M51546
2188B83542862P36732N70298j44501m63238o84986n59807J52836K40574k42729l00160
2198B82847881j12533M5528L71704L47615p9403j81656n8422m2916k8362j08967l70731
2209B82629738l75996j40190m0054j8120P0572L35445J91231m02222p02629r82036
2219B80565739q97160k02179k26021q46157j225719j491299j975765k526531l424645
$$ y = [284732342, 284486046, 284551620, 284969559, 285525322, 286015282, 286444187, 286779881, 286928902, 286639690, 286352158, 286571732, 286848545, 286887646, 286727905, 286177406, 285633564, 285524139, 285564651, 285654068, 285667896, 285303841, 284992943, 285218716, 285519829, 285548210, 285446167, 285217056, 284929047, 284643402, 284382591, 284181824, 284063816, 284116516, 284176102, 284110298, 283909321, 283414116, 282937775, 282771835, 282818069, 283091316, 283542862, 284279594, 284849892, 284705391, 284242153, 283557167, 282997360, 283150196, 283390770, 283148041, 282847881, 282735348, 282780876, 283152580, 283500195, 283420792, 283239136, 283180714, 283137798, 283109436, 283000469, 282629738, 282253742, 282113552, 282073498, 282055378, 282125950, 282461395, 282652626, 282250404, 281547775, 280565739, 279668579, 279466400, 279240379, 278394222, 277168503, 275677204, 273701439, 271174908, 267750263]
2228B67750263m846096n806198o932754o701222n107403l696212j920453m26540Q72860
2237B33186245K273560L998756M856815N007038N003224M660110M161835L339767K682229
2246B69169579K045383J515636R64165Q17299J205673J180172R13868O60172K69661
2255B78741608Q5106J6937P9613M17957M37984K24343L2653l58810l20663K55813L02792
2266B79915333j50204j53313K90642K40555l21388l83129j4305N0544m6253j39465
2276B79289017l72181l38307j58081K42462J147042J345634R67503P04765L24249O3649
2286B83215752j27545k88257m46072m53949k93255j88827m1733k5253k30084j22070
2296B80998707L20682M76113L37124N52883J226425J295090Q18500O18229M74682M44660
$$ y = [267750263, 262904167, 257097969, 250165215, 243463993, 238356590, 234660378, 232739925, 232313385, 233186245, 235459805, 239458561, 244315376, 249322414, 254325638, 258985748, 263147583, 266487350, 269169579, 271214962, 272730598, 273694763, 274512062, 275717735, 276897907, 277811775, 278471947, 278741608, 278826714, 278843651, 278923264, 279341221, 279779205, 280003548, 280036201, 279677391, 279356728, 279612541, 279915333, 279765129, 279611816, 279902458, 280143013, 279821625, 279438496, 279424191, 279474735, 279428482, 279289017, 278916836, 278578529, 278420448, 278662910, 279809952, 281155586, 282123089, 282827854, 283152103, 283215752, 283088207, 282799950, 282353878, 281899929, 281606674, 281417847, 281376114, 281350861, 281120777, 280998707, 281319389, 281795502, 282132626, 282685509, 283911934, 285207024, 286025524, 286643753, 287118435, 287563095]
2306B87563095R14078K80380j889686k263794j402379l96480J552086K340088K575149
2315B89272537J928330k07177j077175q95977j563549l527393l100891j00842J050949
2324B81778812J336346J247635Q75702o37283n115281m406433K234688L670921J402398
2333B82387505N63125r2506p18117j075745j965522l196717m734268o847381q496285
2342B55824089j2655029q468857M597187J3546944K5352955K5119056J2290249L982544
2350C19589138o350517r639035n403747m633904m706153n125752p091770o304016k153626
2359B68180618j376877l212451l969193n072346m512558j607666j097679l126144k378922
2368B41826782J089554K181301J814594J411438K36283j92871l94593J87397K075901
$$ y = [287563095, 288477173, 288757553, 286867867, 284604073, 283201694, 282805214, 284357300, 286697388, 289272537, 291200867, 290993690, 289916515, 289020538, 287456989, 283929596, 280828705, 280727863, 281778812, 283115158, 284362793, 285238495, 284601212, 279485931, 275079498, 277314186, 280985107, 282387505, 282950630, 282858124, 282140007, 281064262, 279098740, 275902023, 271167755, 264320374, 255824089, 243169060, 234700203, 239297390, 252844334, 278197289, 303316345, 315606594, 319589138, 313238621, 303599586, 298195839, 293561935, 288855782, 283730030, 276638260, 270334244, 268180618, 266803741, 263591290, 259622097, 254549751, 250037193, 248429527, 247331848, 244205704, 241826782, 242916336, 245097637, 246912231, 248323669, 248559952, 248367081, 247972488, 248159885, 250235786]
2377B50235786K622605J958141K207050L236275L451843L201714K686272J544704J018524
2386B72162914R32694P42435O80695L57132m99001m17480Q41865Q46634k76108o04381
2396B74767399n72205l68824K93236M52042J93843J33038J75953Q2722k29588j90735
2406B74736881K07901L58334M59919L19729k22702l34492m5071p1983l35693m39892
2416B74632931n30949m21295m1485J40438K80609K20070j45683k40555j76678q2969
2426B73634434J89304J73092j49021k43416k72980j23024M06971L97930j62849l07312
2436B73543129k51541j02043L55491L70026p3433j64528J202m769j18503j68076k42710
2447B73144245j59263J48067K31495J88351P3661j98116l42617m80881m12712o0310
$$ y = [250235786, 252858391, 254816532, 257023582, 260259857, 263711700, 266913414, 269599686, 271144390, 272162914, 273095608, 273838043, 274518738, 274875870, 274376869, 273959389, 274801254, 275647888, 275371780, 274767399, 274195194, 273826370, 274119606, 274571648, 274765491, 274898529, 275074482, 275157204, 274927616, 274736881, 274944782, 275303116, 275763035, 276082764, 275860062, 275525570, 275480499, 275408516, 275072823, 274632931, 274101982, 273680687, 273639202, 273779640, 274060249, 274280319, 274134636, 273894081, 273717403, 273634434, 273823738, 273996830, 273847809, 273604393, 273331413, 273208389, 273615360, 274013290, 273850441, 273543129, 273291588, 273189545, 273545036, 273915062, 273841629, 273677101, 273678303, 273673534, 273555031, 273386955, 273144245, 272984982, 273133049, 273364544, 273552895, 273626556, 273428440, 273085823, 272604942, 272192230, 272131920]
2457B72131920O4850J07765j679m36286m34647L2425Q5602k85645j62353N53360N49316
2468B72204628j02749l78132o32763m69913L49502M70658l2425j04675J71432P0324
2478B71545887m00791n45006n32875l79086O4373K19117J87378J36375l3836r2755
2488B70168781j21364k7161L17574L06835j9322k15759m64210m85650k65121j42098
2498B69052505J5488J8120k25296j61648K64168K76318j07766j83811k8610m1485j64757
2509B68713226k31495l59535k48203K11258K82516L0518o9847j24932j87873l07084
2519B67708549k39143Q9169J40438J8348j55448o48022n14984L88851N35259M3869
2529B67366886l9348K01950N4588n50022o26316k97318n8651L30677M01745J28746
$$ y = [272131920, 272196770, 272304535, 272302856, 271866570, 271431923, 271464348, 271549950, 271264305, 271101952, 271655312, 272204628, 272101879, 271723747, 271090984, 270621071, 270970573, 271441231, 271408806, 271304131, 271475563, 271545887, 271145096, 270600090, 270067215, 269688129, 269752502, 269971619, 270158997, 270295372, 270261536, 270168781, 270047417, 270020256, 270337830, 270644665, 270625343, 270409584, 269945374, 269459724, 269194603, 269052505, 269067993, 269086113, 268860817, 268699169, 268963337, 269239655, 269131889, 268948078, 268919468, 268877983, 268713226, 268481731, 268122196, 267873993, 268085251, 268367767, 268398285, 268328438, 268203506, 268015633, 267708549, 267469406, 267558575, 267699013, 267717361, 267561913, 266913891, 266398907, 266787758, 267323017, 267366886, 267327538, 267529488, 267584076, 267034054, 266407738, 266110420, 266051769, 266382446, 266784191, 266912937]
2539B66912937Q2970J96457J67598N0545o9618k78473l20663j75953j81675l98865
2549B65985260k48909L52612M86373K89669J32332j17530l03765n67894n00927q4877
2559B65422344J98612O68526N29041m52289n53360J42097K45323L4104k17209q50182
2569B65167007p74631J0242M08669Q11806P49817Q5601j64261k11257k26727j01566
2579B65754700j01567k46296j91688Q1310J52340P9403M7684J8596m0779j78089j70708
2590B65204906k8858O2943K16732J67599j49479k11716l6488p9612l84827l24001J51386
2601B64588585K16484k613j85490o19163m78993L91712N40028Q1310L319J65939J39962
2612B64841080n7450o6528J13010J19210R784q7738k27699l20206m72297l48568J59015
$$ y = [266912937, 266995907, 267192364, 267359962, 267410507, 267340889, 267062416, 266741753, 266565800, 266384125, 265985260, 265736351, 266088963, 266575336, 266865005, 266997337, 266879807, 266576042, 266008148, 265507221, 265422344, 265620956, 266289482, 266818523, 266366234, 265812874, 265954971, 266200294, 266234398, 266017189, 265167007, 264392376, 264402618, 264811287, 265623093, 266372910, 266458511, 266294250, 266082993, 265856266, 265754700, 265653133, 265406837, 265215149, 265296459, 265448799, 265528202, 265575886, 265594482, 265553703, 265375614, 265204906, 265176048, 265238991, 265455723, 265623322, 265473843, 265262127, 265225639, 265146027, 264761200, 264437199, 264588585, 264805069, 264802456, 264616966, 263997803, 263518810, 263910522, 264450550, 264531860, 264535179, 264701118, 264841080, 264783630, 264717102, 264830112, 264949322, 264959106, 264871368, 264643669, 264323463, 263851166, 263502598, 263661613]
2623B63661613K83242J27334M3145p4387j56632k16484k73246l61901l24497j44958
2633B62563229m5300K3613Q4877J50185J46866P7743J183j79768j37577J50681K65121
2644B63100853L31879K63710L5038j67141m68254n55039n15213l12328K06470L92685
2654B62312660L60489K98729J17302j3123k19097j65233K38666K94934J04408m0760
2664B63288975k51293l77655n56717l93372K66533M11034J86462J7872l20187l52630
2674B61919022l8376j9074k28653k89688l17802k28157O675J89782M65622M49905J20869
2685B62030125n2700k32926k41508n6992N5084J92871K27929K39372L6468n39531o63281
2696B60994911n13305k04087N85060O85234J29700m6730q3923n8899K06947P5817n85556
$$ y = [263661613, 263944855, 264072189, 264115334, 264040947, 263884315, 263667831, 263394585, 263032684, 262708187, 262563229, 262517929, 262541542, 262626419, 262776604, 262923470, 263001213, 263002396, 262822628, 262685051, 262835732, 263100853, 263432732, 263696442, 263731480, 263564339, 263096085, 262541046, 262025833, 261713505, 261919975, 262312660, 262673149, 262971878, 263089180, 263076057, 262856960, 262691727, 262930393, 263225327, 263329735, 263288975, 263037682, 262660027, 262103310, 261709938, 261976471, 262387505, 262573967, 262591839, 262271652, 261919022, 261880646, 261861572, 261632919, 261343231, 261025429, 260797272, 260803947, 260993729, 261459351, 261909256, 262030125, 261977425, 261744499, 261502991, 261445999, 261501083, 261693954, 261921883, 262161255, 262197723, 261658192, 260994911, 260481606, 260277519, 260862579, 261547813, 261677513, 261630783, 261546860, 261487961, 261694908, 261770725, 261185169]
2707B61185169o06289l6964J53541J86196J45683q3694j27297l6735J7662J52092P1525
2718B61020889l35693l30677P5817J84536J91212J1673n44777o32286l75023j22318
2728B59143353L46431M95186M08897K81563m7455j30405J0014J4534o0311q2016j6212
2739B60363579j33038n34534n42164k25067J1444L90758M23680J20163p1049l12328
2749B59491444m03157m08668k69165J03226K94933N02586L51906l47843m60625j18751
2759B58735886P0114L56903L45230N3177j95751p04289n88188K85149M98542L09468
2769B59166241J03244l60984n07107m69914k87551K59170L28789j5259j86920l80764
2779B57648945m07467k46277j71432q1520j09215l57857k82288J89057K24609j05629
$$ y = [261185169, 260578880, 260541916, 260695457, 260881653, 261027336, 260943642, 260816345, 260779610, 260797272, 260949364, 261020889, 260685196, 260354519, 260430336, 260614872, 260806084, 260817757, 260272980, 259640694, 259265671, 259143353, 259489784, 259984970, 260393867, 260675430, 260627975, 260497570, 260507584, 260522118, 260461807, 260379791, 260363579, 260230541, 259696007, 259153843, 258928776, 258940220, 259330978, 259754658, 259874821, 259803772, 259491444, 259088287, 258679619, 258410454, 258513680, 258808613, 259311199, 259663105, 259315262, 258854637, 258735886, 258806000, 259162903, 259508133, 259561310, 259365559, 258661270, 258073082, 258358231, 258856773, 259166241, 259269485, 258908501, 258401394, 257931480, 257643929, 257903099, 258231888, 258216629, 258029709, 257648945, 257241478, 256995201, 256823769, 256742249, 256633034, 256275177, 255992889, 256181946, 256406555, 256300926]
2789B56300926k51770l89824l66211j00841p0572k75612k38895q812J29928L57151
2799B55085468K37713l03993n33829o38466o07986l95279k00996J86920J20163m79927
2809B52469788o53515n64328n18093m04834l61920l68118l71456l50228m46090o69003
2819B47762203q40664j040687j131306j102924j132489j078853j329651j986733k257595
2828B35861301k289772k289066k038956k202491k806206l082733l249893l205777k890339
2837B11806068k646217k295017k208462k451439k395382k112636j944542j872063j632442
2846A92247868j244793q96454m47502k70367m68731k55814L30430O53038R20524R32236
2856A91500435M98772N75523J157532J306762J135369J129608J250763J164436Q56152
$$ y = [256300926, 256049156, 255659332, 255293121, 255192280, 255121708, 254846096, 254607201, 254598389, 254728317, 255085468, 255323181, 255019188, 254485359, 253846893, 253238907, 252843628, 252642632, 252829552, 252949715, 252469788, 251816273, 251251945, 250733852, 250329018, 249967098, 249598980, 249227524, 248877296, 248431206, 247762203, 246921539, 245880852, 244749546, 243646622, 242514133, 241435280, 240105629, 238118896, 235861301, 233571529, 231282463, 229243507, 227041016, 224234810, 221152077, 217902184, 214696407, 211806068, 209159851, 206864834, 204656372, 202204933, 199809551, 197696915, 195752373, 193880310, 192247868, 191003075, 190106621, 189659119, 189388752, 188920021, 188664207, 188994637, 189647675, 190568199, 191500435, 191999207, 192574730, 193732262, 195039024, 196174393, 197304001, 198554764, 199719200, 200575352]
2865B00575352P15255P47433N39074J0243j06564J18256K31266M07447L98179L48320
2875B03984261p5818j108646j480102j338006j361122j288662j488208k052784k243996
2884A91546917k193451k114296j837025j827945k175579k062550j406918j354675j775989
2893A74798489k045632k425670k495537k178421k204666k553215k579213k326727k267360
2902A53722048k301693k356291k495050k537728k468586k531767k804756k733707k259016
2911A31233454k175331k404213k465248k569676k355814j708984j450300j499653j357317
2920A13246918j146794q76665n13077j83820K47240L61681J06811J08719K32220L88861
2930A11972094O21318Q44717J134158J273155J249313J327038J366377J659870K340555
$$ y = [200575352, 201290607, 202038040, 202577114, 202587357, 202480793, 202599049, 202830315, 203237762, 203635941, 203984261, 203908443, 202799797, 201319695, 199981689, 198620567, 197331905, 195843697, 193790913, 191546917, 189353466, 187239170, 185402145, 183574200, 181398621, 179336071, 177929153, 176574478, 174798489, 172752857, 170327187, 167831650, 165653229, 163448563, 160895348, 158316135, 155989408, 153722048, 151420355, 149064064, 146569014, 144031286, 141562700, 139030933, 136226177, 133492470, 131233454, 129058123, 126653910, 124188662, 121618986, 119263172, 117554188, 116103888, 114604235, 113246918, 112100124, 111223459, 110710382, 110526562, 110773802, 111135483, 111242294, 111351013, 111583233, 111972094, 112593412, 113438129, 114572287, 115845442, 117094755, 118421793, 119788170, 121448040, 123788595]
2939A23788595K580881K498627K446890K271891K235174K255916K393484K697230K909183
2948A46077871L221512L122568K472401K340078K578974K704620K965680K851982K193908
2957A70529594K179642K766361K936364K985477K746105J975308J809578K185821K217293
2966A92331543K264976J770516M12941L4084M14372N88894R98249Q43048K1229k59648
2976A99420204k58903j48545K23160M18663N90325N63144K69890J50929Q1291J17302
2986B01427460L41892L64780K84424R5139k48909n59578q98819j209984j503220j795768
2996A96297417k210617k240906j997223j546631p72247p5093P30763J299858J724472
3005A91209793J978150K134571J923809J234760P79629L41644P2727J82858l22094
$$ y = [123788595, 126369476, 128868103, 131314993, 133586884, 135822058, 138077974, 140471458, 143168688, 146077871, 149299383, 152421951, 154894352, 157234430, 159813404, 162518024, 165483704, 168335686, 170529594, 172709236, 175475597, 178411961, 181397438, 184143543, 186118851, 187928429, 190114250, 192331543, 194596519, 196367035, 196779976, 196814060, 197228432, 197817326, 198815575, 199658623, 199679852, 199420204, 199161301, 199012756, 199235916, 199654579, 200244904, 200808048, 201077938, 201228867, 201310158, 201427460, 201769352, 202134132, 202418556, 202513695, 202264786, 201705208, 200806389, 199596405, 198093185, 196297417, 194086800, 191845894, 189848671, 188302040, 187529793, 187454700, 188185463, 189485321, 191209793, 193187943, 195322514, 197246323, 198481083, 199260712, 199602356, 199675083, 199857941, 199535847]
3014A99535847j348248k279777l355027m235973n161037n516301n412578n022278m363060
3023A62841568l191719j407623L41177K483835L951321N083789N589257N274772N201817
3032A86168194N090713M997731M939308M793415M823932M094353K294064J599788J828194
3041B20629692J534462R58920N81493L55968j4553m98771r26247j445541j633149j354713
3051B18187561j571655k233734k583733k970943k757779j852760j262665q38508j70479
3060B01945305P44095J483917K253075K656211K713204K738476K682933K428761J893044
3069B21539021J522769J231442R16481O46343K46544l36418p15733r36031j207581
3078B22906837j686344j539478q03223j67122N78633J282444K038498K619495L135929
$$ y = [199535847, 198187599, 195907822, 192552795, 188316822, 183155785, 177639484, 172226906, 167204628, 162841568, 159649849, 158242226, 158583403, 161067238, 165018559, 170102348, 175691605, 180966377, 186168194, 191258907, 196256638, 201195946, 205989361, 210813293, 214907646, 217201710, 218801498, 220629692, 222164154, 223123074, 223704567, 224060535, 224045982, 223547211, 222620964, 221175423, 219542274, 218187561, 216615906, 214382172, 211798439, 208827496, 206069717, 204216957, 202954292, 202115784, 201945305, 202689400, 204173317, 206426392, 209082603, 211795807, 214534283, 217217216, 219645977, 221539021, 223061790, 224293232, 225209713, 225856056, 226102600, 225766182, 225050449, 224114418, 222906837, 221220493, 219681015, 218877792, 218710670, 219289303, 220571747, 222610245, 225229740, 228365669]
3087B28365669L371945L510475L034839J745224R56536J90487M3869Q32081O96907
3096B42748032l03994n44319k67982j25885M1256K45094N81036O53495M32969M31785
3106B43891487N31654O91910R97772J148224J263142J161823P91779N40733K76089
3115B51294613J40438J27792J17302J33972J96953L89099L56675N4817J4553J61648
3125B52987862K58445M59671L82195k1935j78585k07901k04334p6046r7275l05423
3135B52996674k78931k7657O2943R2964M6501k39372r7504O20117O51360Q5831j72844
3146B53740082m01993l96729o6986K0981p5569j9569K04582J97410l7441j16348r2754
3157B52955666j36834k44636k64874k96344r8954M80652N87464L43093J12992l66211
$$ y = [228365669, 231737614, 235248089, 238282928, 240028152, 240984688, 241175175, 241219044, 242051125, 242748032, 242444038, 241899719, 241631737, 241505852, 241547108, 241792202, 242373238, 243026733, 243459702, 243891487, 244423141, 245115051, 246112823, 247261047, 248524189, 249686012, 250477791, 251018524, 251294613, 251435051, 251562843, 251680145, 251814117, 252011070, 252400169, 252756844, 252811661, 252826214, 252987862, 253246307, 253705978, 254088173, 254066238, 253887653, 253679752, 253475418, 253399372, 253302097, 252996674, 252717743, 252690086, 252753029, 252845993, 252892494, 252653122, 252555618, 253175735, 253827095, 253912926, 253740082, 253338089, 252941360, 252874374, 252895355, 252819786, 252800217, 253004799, 253202209, 253164768, 253048420, 252955666, 252818832, 252574196, 252309322, 252012978, 251914024, 252394676, 252982140, 253325233, 253438225, 253072014]
3167B53072014m07677k8381J51634L54042L10440j0490k17934n50499m44889K01931
3177B52430191M11758M04129K77024j98116k05517L35216K86350l35941m62055l02544
3187B52640495q7509M75159M47044k46773l71933j17530L7670L21865L00636l2177
3197B53366947k20547m36534m49887k98996o0787N55992M61102n11647o09874J2626
3207B51808395K16027K47707K57969J48296J58787L61214K27432l05405m58488l32108
3217B52329826l03497k68707k67754m58946j71185Q36125R29832K65618j47114p42436
3227B52001762p93933k36760n7926r2754j6442J15624J98612K87533K64893P6046N6972
3238B51803627K42481J54972k49633l18032j76925K5520N99384M49887o26317p21683
$$ y = [253072014, 252664337, 252635956, 252787590, 253141632, 253452072, 253441582, 253223648, 252673149, 252228260, 252430191, 252841949, 253246078, 253523102, 253324986, 253119469, 253454685, 253741035, 253405094, 252943039, 252640495, 252552986, 253028145, 253475189, 253228416, 252856483, 252738953, 252776623, 253098488, 253399124, 253366947, 253146400, 252709866, 252259979, 251960983, 251900196, 252456188, 252917290, 252405643, 251795769, 251808395, 252024422, 252272129, 252530098, 252678394, 252837181, 253198395, 253425827, 253120422, 252661934, 252329826, 252026329, 251757622, 251489868, 251030922, 250859737, 251695862, 252625694, 252891312, 252744198, 252001762, 251207829, 250971069, 250913143, 250820389, 250803947, 250919571, 251118183, 251405716, 251670609, 251746655, 251803627, 252046108, 252201080, 251951447, 251633415, 251456490, 251482010, 252081394, 252531281, 251904964, 251183281]
3248B51183281l586K88010N06401M75159J23271r0599l12099m17709m37966l76701
3258B50937462j46141r4662k26726j75724o3897K30313J013031R35096n6037m03634
3268B51949081m23202m12464k34127j40667j02520J4305L40690K15779m77314o13442
3278B50116119l15666k19345k50111p0095L84560N19753M57534L00179p4635k79903
3288B50568390m29382m55857l43818k22664k6474J07994K18162K89193L81965K65122
3298B50352631j73340k55585j00365Q7738N86014M89483k70595n15709n08786l77903
3308B49313583J00384J60694j46141k59170l38078l07083k10056M9591P46021O85692
3318B49795437k79427l64780L51429L96728r536k73228p37419o27060J97658M00544
$$ y = [251183281, 251179695, 251467705, 251974106, 252449265, 252572536, 252481937, 252169838, 251752129, 251314163, 250937462, 250791321, 250696659, 250469933, 250294209, 250230312, 250460625, 251473656, 252408752, 252352715, 251949081, 251525879, 251113415, 250879288, 250738621, 250636101, 250650406, 250991096, 251206875, 250729561, 250116119, 249800453, 249581108, 249330997, 249260902, 249645462, 250165215, 250622749, 250922928, 250848293, 250568390, 250139008, 249683151, 249339333, 249116669, 249090195, 249198189, 249416351, 249705544, 250087509, 250352631, 250179291, 249923706, 249823341, 249911079, 250497093, 250986576, 250715981, 250200272, 249691486, 249313583, 249413967, 249574661, 249428520, 249169350, 248831272, 248524189, 248314133, 248363724, 249109745, 249795437, 249516010, 249151230, 249502659, 249899387, 249889851, 249616623, 248879204, 248252144, 248449802, 248850346]
3328B48850346K08854M6978l28560l70979n4111l0270k37713k72751j99566j68304
3338B47443924j84307p7000J78795L08285L90053L84330K76566J61648l586j44005
3348B48734703k59857m28200p46975p49836n40733j72615N71747Q75702R93003P22428
3358B48999367k28176m90666j74045k10514n43137m68960Q2016J25885l32355l29495
3368B46429920j3828K42004P13101O69727L1700j52111k5272o5079j79062k63443l67412
3379B47020245m00544m13894k96345P0076R9430k67982k08149L14960L31402j47591
3389B46101608j99318R1553J40190M7226o218n8174j39236l10173k98272r4413r995
3400B45264778K1210M2438O199N8651K42233K39125L8643r54L9806J22071L79314L15437
$$ y = [248850346, 249059200, 249106178, 248777618, 248406639, 248352528, 248322258, 248084545, 247811794, 247612228, 247443924, 247259617, 247182617, 247361412, 247669697, 248059750, 248444080, 248720646, 248882294, 248878708, 248734703, 248474846, 248046646, 247299671, 246549835, 246009102, 245836487, 246408234, 247283936, 248276939, 248999367, 248771191, 248280525, 248106480, 247895966, 247352829, 246883869, 246965885, 247091770, 246759415, 246429920, 246416092, 246658096, 247371197, 248040924, 248072624, 247920513, 247895241, 247830162, 247651100, 247387657, 247020245, 246619701, 246205807, 245909462, 245979538, 246078968, 245810986, 245602837, 245917797, 246249199, 246101608, 245902290, 245993843, 246134033, 246181259, 246175041, 246116867, 245977631, 245667458, 245369186, 245274773, 245264778, 245285988, 245328426, 245334625, 245393276, 245635509, 245874634, 245913277, 245912323, 245952129, 246074200, 246453514, 246768951]
3412B46768951j43528k07424L02086j19209j804123j917839o98815k9563P05490R24110
3422B43780136N85079M32492L00178J06316j96915l35941l97930l07789O199J78814
3432B44150639L33786L41167K01225M2458l05176k90413N4131L04451P86552O19660
3442B46238480k01722p75089j770725j412163P61032J127720o9370j83106M64669N14259
3452B44693985J36375O218P1526j34010o91872q10623p42207k73704J061439J181355
3462B44498482K52971l10897j243840j024246P10735R86805J46161k05288n79110n35240
3472B42696533q6784L75500J367321J214275j39942p97768j425972j257419p3681M84008
3482B42356071R44844Q30650r9888m06990m05083k78701J72138L28541L89576J77383
$$ y = [246768951, 246625423, 246417999, 246720085, 246600876, 244796753, 242878914, 242180099, 242150536, 242856026, 243780136, 244365215, 244797707, 245097885, 245204201, 245007286, 244671345, 244273415, 243965626, 243971825, 244150639, 244484425, 244825592, 245026817, 245069275, 244764099, 244473686, 244527817, 244832268, 245618820, 246238480, 246036758, 245261669, 243490944, 242078781, 242839813, 243967533, 243898163, 243715057, 244179726, 244693985, 244830360, 244836578, 244908104, 244774094, 244082222, 243271599, 242529392, 242255688, 243317127, 244498482, 244751453, 244440556, 243196716, 242172470, 242883205, 243870010, 244016171, 243810883, 243231773, 242696533, 242609749, 242985249, 244352570, 245566845, 245426903, 244629135, 243203163, 241945744, 241872063, 242356071, 243300915, 244131565, 244031677, 243624687, 243219604, 242940903, 243113041, 243441582, 243831158, 244008541]
3492B44008541o63509n36690N80788R99221J386147P60078j342048k086869k313613
3501B40792046j499672J270790J811027O94981j86672j953621k021065l72887L40462
3510B38875389P68890R60846Q55446O47049O6300n017M12464N19524P35283J78795
3520B44014969j607895j911621p71771p45296j829624j480351L00408R73243J085740
3529B38027802R85641M70867m77q05130q97407n98202L30448K656212L067970K191086
3539B45428810Q34694j832008l295174m736671l943215k45323J462936K744904K240906
3548B38659859j098404j717568m84466N15232K543449K636433O35624J38531J97410
3557B42026100J004219L443947L781796L634204K67983q607617j1096477r964714o045094
$$ y = [244008541, 243345032, 242808342, 243389130, 244388351, 245774498, 246534576, 245192528, 243105659, 240792046, 239292374, 240563164, 242374191, 243069172, 242882500, 240928879, 238907814, 238534927, 238875389, 239644279, 240605125, 241460571, 242107620, 242173920, 242168903, 242581367, 243100891, 243836174, 244014969, 242407074, 240495453, 239723682, 238978386, 237148762, 235668411, 235968819, 236942062, 238027802, 239013443, 239484310, 239483833, 238678703, 237781296, 237183094, 237513542, 240169754, 243237724, 245428810, 246263504, 244431496, 241136322, 236399651, 232456436, 232211113, 233674049, 236418953, 238659859, 237561455, 235843887, 235359421, 235874653, 238418102, 241054535, 241690159, 241828690, 242026100, 243030319, 246474266, 250256062, 253890266, 254158249, 245550632, 234454155, 224489441, 218444347]
3566B18444347M216671P435074N578766M156838Q10375n34058n53837m68750L85533
3575B39470959N70049k38171O91662L645897M746895N942345L316173m383087q234730
3584B45527992j2120971r435883K265434O595612P570038N510807k819310m796733
3592B38296986k043724o96431J588593J574039j337051j521587J0967J673946N315781
3601B42861519N129566J587620j393070o613255o788025j632194M27246J477241J594544
3610B36651192m21772J52111M561195L099442m623413p342110q654595n437622M466553
3619B22450981R302845J2791157J1804352O683101q09917j5671482j9679318j6782264
3627B10089455r410153R999275J3624192K703190J00860J458397J343956J039276Q48293
$$ y = [218444347, 222661018, 230096092, 235674858, 239831696, 240642071, 240108013, 239554176, 239085426, 239470959, 240041008, 239802837, 240494499, 244140396, 248887291, 254829636, 258145809, 253762722, 245527992, 233407021, 223971138, 226236572, 232832184, 240402222, 245913029, 243093719, 238296986, 236253262, 235556831, 237145424, 238719463, 237382412, 235860825, 235871792, 237545738, 242861519, 247991085, 249578705, 248185635, 241572380, 234784355, 233152161, 233579407, 235056648, 236651192, 236229420, 236381531, 240942726, 244042168, 239418755, 232076645, 223422050, 217984428, 222450981, 231753826, 244544983, 256349335, 263032436, 262222519, 246551037, 226871719, 210089455, 200679302, 210678577, 224302769, 227005959, 227106819, 228565216, 229909172, 230948448, 231796741]
3636B31796741Q9894J183014M349708O282807Q790970P943649N362739j509437j7264118
3645B47025967k0981789j6268024r620667M580994J0349502J1828423Q430004m672051
3653B30672359p587680l081074J2646N842666O645699J874428J478195L878135N439988
3662B45175362Q944988O901035j063595n972862j3025989j0402451N830994Q120308
3670B44507790R33418o047497k2318840j9579639N134811J1664867N357743M982471
3678B24635124O538620P258663Q330346P767925P267704K027511j0725975j5097370
3686B38002548j4835605j0840893O13441N518914O525764P040977N717755M536381
3694B42279282L003368J110783j314392l572464p878304o072769K833614O722202R151459
$$ y = [231796741, 231886635, 233069649, 237419357, 243702164, 252493134, 260436783, 265799522, 264290085, 247025967, 226044178, 209776154, 200155487, 204736481, 215085983, 226914406, 235344410, 230672359, 223084679, 220003605, 220016251, 225858917, 232504616, 234379044, 235857239, 239735374, 245175362, 254120350, 261021385, 259957790, 253984928, 240958939, 230556488, 236387482, 244507790, 245441208, 239393711, 217074871, 197495232, 202630043, 214294910, 219652653, 224635124, 231173744, 238432407, 246762753, 254530678, 261798382, 263825893, 253099918, 238002548, 223166943, 212326050, 212939491, 218458405, 224984169, 232025146, 237742901, 242279282, 245282650, 246393433, 245079041, 241506577, 233628273, 227555504, 230389118, 237111320, 246262779]
3703B46262779Q006096K725144k335320j0261307j3066044j3222694q827457L195057
3711B12476254Q638858J1118164J0378609M383316J532803K17914j525879l709793
3719B43510246m326095l463993k775898k369881j62849M338035P077217J1084786Q292427
3728B61203995k889385q035908j0246983j1548519j3151894q185386N631218J2302170
3736B25079308J6818504J5211353O593228j518479j5941391j6925812n092849K291431
3744B26515293J5216351J0988960j5968094k0653953q975277k306939O550541J0170708
3752B21537590J0491142P187844l473778o233921l507137q97408M946480O221771L924370
3761B40196953J870155k138634l128509o54221j472244o288528n522499M01744L597012
$$ y = [246262779, 254268875, 256994019, 254658699, 244397392, 231331348, 218108654, 209281197, 212476254, 221115112, 232233276, 242611885, 246995201, 248528004, 248745918, 247220039, 243510246, 239184151, 235720158, 232944260, 230574379, 230411530, 234749565, 241826782, 252911568, 261203995, 258314610, 250278702, 240031719, 228483200, 215331306, 207145920, 212777138, 225079308, 241897812, 257109165, 263702393, 262183914, 246242523, 229316711, 224223862, 226515293, 241731644, 252720604, 236752510, 216098557, 207123280, 204816341, 211366882, 221537590, 232028732, 239216576, 235742798, 229508877, 226001740, 225104332, 230050812, 236272583, 240196953, 242067108, 239928474, 236799965, 236145744, 234673500, 228384972, 222862473, 223264217, 226861229]
3770B26861229O787796O961327M079361J304626l263969n185585n953560m037133K888184
3779B30442276L990421k5997j149635j383324p29561J703759K348899J302224J746177
3788B38245239L844757L757477J768570N79128r74407r40819J739998Q74977k881508
3797B46013412n954513j2445450r523392O262303Q278141j162300m681816q698006
3805B18088379m918327J0281562J4111290J0279885O740799R5615m018307q573532
3813B42087364p316818K867699L262272m598866q137703j3121357r059429P942924
3821B13926086J1816025N463829L337631J522522J224518L344307L072510L41415K30542
3830B44279385L307590K222290k441883n669594j0352382r942761l989220q47568J936417
$$ y = [226861229, 233649025, 240610352, 244689713, 245994339, 242730370, 237544785, 231591225, 227554092, 230442276, 234432697, 234406700, 233257065, 231873741, 231144180, 232847939, 235196838, 236499062, 238245239, 242089996, 245847473, 247616043, 248195171, 247220764, 246279945, 248019943, 248894920, 246013412, 240058899, 227613449, 218090057, 224352360, 232630501, 231468201, 226786385, 218088379, 213170052, 223451614, 237562904, 247842789, 254583588, 254679203, 250660896, 242087364, 234770546, 237638245, 240900517, 236301651, 228163948, 215042591, 205983162, 213926086, 225742111, 231205940, 234543571, 236066093, 237290611, 240634918, 243707428, 244048843, 244279385, 247586975, 249809265, 247367382, 241697788, 231345406, 221402645, 217413425, 216565857, 218502274]
3839B18502274K899169O80466K182713O879806R970913J4214745J3376236R550571
3847B78256893N91526j8370399k5712014k8425941k0166397O246109J5747070J4478913
3855B22645760J2933731O901741K727508j894722m089584m748573l184815K592583
3863B33883629L931045L026009k51770r735603r964219j125812K067566K379169L466149
3872B27676163M720192M914779N150299K248307o323109p259617j054516R60102J918335
3881B32950935O16074o019592m493008O997356P746926n23339l994941p755280n274277
3890B20250854N858422R470691R069443O797791M88033l333321o813049p891178n948315
3899B27949371n522480o593952m704933K49863L391266O763210P065773L655681K404442
$$ y = [218502274, 221401443, 222081909, 224264622, 231144428, 241115341, 255330086, 268706322, 278256893, 278848419, 260478020, 234766006, 206340065, 186173668, 192419777, 208166847, 222645760, 235579491, 242481232, 245208740, 243314018, 239224434, 234475861, 231291046, 233883629, 237814674, 240840683, 240588913, 230853310, 220889091, 219763279, 221830845, 224210014, 227676163, 232396355, 237311134, 242461433, 244709740, 238386631, 231127014, 230072498, 231032600, 232950935, 233567009, 227547417, 223054409, 230051765, 237798691, 237275352, 233280411, 225525131, 220250854, 226109276, 235579967, 244649410, 251447201, 251935234, 248601913, 241788864, 233897686, 227949371, 222426891, 215832939, 211128006, 211377869, 214769135, 221532345, 228598118, 232253799, 234658241]
3908B34658241K094040J723290K139549R53674k175083l497372m244308l241310N37395
3917B28948116J811505J659393J047859j121521j421699m03881P07378L446827K897510
3926B37571487j094589k996216m841308m028816K35805K172222L315220L304730J555900
3935B35194435P66049N39779k41756j887799k045383r11484n1727J713505J230945
3944B34306564k117157k708435j370182m17461J079063J716385J902809J407624m57764
3953B33341446p08332N96046P06921M9591l29266q54492q74519m04835l7670N69820
3963B32054710O37532P5817K1457M53244L16124m00296o00566m47522l86943k54879
3973B31468678k65122n75542l43552N72205P62443L45726K54135L45478K55585m2210
$$ y = [234658241, 236752281, 238475571, 240615120, 241568794, 239393711, 235896339, 231652031, 228410721, 228948116, 230759621, 232419014, 233466873, 232345352, 230923653, 230519772, 231227150, 234673977, 237571487, 236476898, 233480682, 228639374, 224610558, 224846363, 227018585, 230333805, 233638535, 235194435, 235960484, 236500263, 236258507, 234370708, 232325325, 231413841, 231362114, 233075619, 234306564, 232189407, 229480972, 228110790, 227693329, 228772392, 230488777, 232391586, 233799210, 233341446, 232633114, 233229160, 233936081, 233985672, 233656406, 232801914, 231927395, 231522560, 231484890, 232054710, 232692242, 232768059, 232789516, 233242760, 233558884, 233158588, 232558022, 232110500, 231723557, 231468678, 231203556, 230628014, 230284462, 230856667, 231619110, 231964836, 232218971, 232564449, 232820034, 232777824]
3983B32777824p8907K32449P5111p44819o38008M91371O69250K03858j67141r29585
3993B31891403q79535%M34398R01699P61032k53925m38442
4000B32416630
$$ y = [232777824, 232698917, 232931366, 233006477, 232261658, 231623650, 232115021, 232784271, 232988129, 232820988, 231891403, 231011868, 231011868, 231446266, 232347965, 233108997, 232855072, 232416630]
##END=$$ End of the data block
