##TITLE=2-Me2N JA $$ Begin of the data block
##JCAMP-DX=5.00 $$ ACD/SpecManager v 10.08
##SPECTROMETER/DATA SYSTEM=Alpha
##DATE=25 Nov 2015 09:11:28
##DATA TYPE=INFRARED SPECTRUM
##DATA CLASS=XYDATA
##ORIGIN=
##OWNER=
##NPOINTS=1667
##FIRSTX=599.64648438
##LASTX=3997.64306641
##MAXX=3997.64306641
##MINX=599.64648438
##MAXY=1.07868791
##MINY=0.10516895
##XFACTOR=1.0000000000
##YFACTOR=0.000000010000000
##FIRSTY=0.81736875
##DELTAX=2.03961372
##XUNITS=1/CM
##YUNITS=ARBITRARY UNITS
##XYDATA=(X++(Y..Y))
599.6H1736875M818266K832628J489049Q91256P03484O58542O26880O02293N83124
618I4942397M96310L07751J25819K4039j83994q04251j463563r13560P00235J366484
638.4I4597667O53756j83087n78893n52380j12253O26117J225060J305646R80031N90289
658.8I8551953L09813J19018j35922m73833k33984L31676K24346j4979q1110o4999
679.2I8531979m4524m4275q1217j23513j14888j02019j25599j33031q6892o7616j25694
701.6I7482711j94824k35569k88409l92240n31513p18921r82058j238668j489032k414703
722H8996774m998106p639384n270588K363830P368702O088883K936917J165629N04887
740.4I1517544K40671O4415j33627l45374n18006o36518o84774n94252l20607O7144
$$ plain form
599.6 81736875 86555141 89387769 90876818 91768074 92471558 93130100 93756980 94359273 94942397
618 94942397 95438707 95746458 95872277 95896316 95712322 94908071 93444508 92530948 93231183 94597667
638.4 94597667 95251423 95068336 94489443 93937063 93824810 94450927 95675987 96981633 97961664 98551953
658.8 98551953 98861766 98980784 98844862 98371029 98137045 98468721 98693067 98678088 98596978 98531979
679.2 98531979 98487455 98443180 98361963 98238450 98123562 98021543 97895944 97762913 97676021 97608405 97482711
701.6 97482711 97287887 97052318 96763909 96371669 95840156 95121235 94139177 92900509 91411477 88996774
722 88996774 83998668 76359284 71088696 73452526 80821228 86910111 89847028 91012657 91517544
740.4 91517544 91758215 91822630 91689003 91343629 90825623 90189105 89504331 88910079 88589472 88656616
760.8H8656616L95167M94713L66664J71285K3079j08593k83492m79627n61219l55321
781.2H8319272J11437N32895O19823L55851j24162o98382j252746j665765j874650
799.5H4323573j951682k075977k420824l172422m386180n482460n428260l783208j105601
817.9E4516959J622105L607660M510641M427141L689695K728396K037973J932388K222216
836.2H1295174K360469K020079J378858Q51322O78903P68315Q40289P34532N34618
854.6I1462559L88199L53872M05884M70454M90790M61507M31728M74650N91046O83766
875I6214455O67388N61130M33325L29858K58512J97023J42527J02180N5283k956m0865
897.4I8917860n5742p7773r2572p3242l8510j5784k9236q5300j78718l10308m60321
$$ plain form
760.8 88656616 89051783 89546496 89913160 90084445 90107524 89998931 89715439 89235812 88674593 88319272
781.2 88319272 88430709 88963604 89583427 89939278 89815116 89116734 87863988 86198223 84323573
799.5 84323573 82371891 80295914 77875090 74702668 70316488 64834028 59405768 55622560 54516959
817.9 54516959 56139064 59746724 64257365 68684506 72374201 75102597 77140570 79072958 81295174
836.2 81295174 83655643 85675722 87054580 87905902 88584805 89353120 90193409 90927941 91462559
854.6 91462559 91850758 92204630 92610514 93080968 93571758 94033265 94464993 94939643 95530689 96214455
875 96214455 96881843 97442973 97876298 98206156 98464668 98661691 98804218 98906398 98961681 98958725 98917860
897.4 98917860 98862118 98784345 98691773 98618531 98580021 98564237 98535001 98449701 98270983 97960675 97500354
919.9I7500354n78576o20580o09875o24233p27737r58371j402510k197861l379119
938.2H6401492m548829m653454k770204N61542L540313M830521M491020L376054K242416
956.6I3470871J405031Q61472N24908L26765J92433N8729p9221j72293j69200q1950
977I6337545J0604L1960k4045j39177l16864n61273r18675j543414k418548k727515
997.4H7730598j531136L30455J034933M41038k77686n26017m73564l99435l82650l76821
1017.8H5569715l79455m73696p00622j017875j381665j737923j992666k066470j903200
1036.1G3916143j400465m70090P75993J968921K675604K679402K077413J122754M6587
1054.5H3392262r61077j684177j902747j490795n35816N68229J309478J413643R71377
$$ plain form
919.9 97500354 96921778 96301198 95691323 95067090 94339353 93380982 91978472 89780611 86401492
938.2 86401492 81852663 77199209 74429005 74990547 78530860 83361381 87852401 91228455 93470871
956.6 93470871 94875902 95737374 96262282 96589047 96781480 96840209 96760988 96588695 96419495 96337545
977 96337545 96348149 96380109 96356064 96216887 95900023 95338750 94420075 92876661 90458113 87730598
997.4 87730598 86199462 86529917 87564850 88005888 87728202 87202185 86728621 86329186 85946536 85569715
1017.8 85569715 85190260 84716564 84015942 82998067 81616402 79878479 77885813 75819343 73916143
1036.1 73916143 72515678 72045588 72821581 74790502 77466106 80145508 82222921 83345675 83392262
1054.5 83392262 82431185 80747008 78844261 77353466 76817650 77385879 78695357 80109000 81080377
1072.8H1080377K40463n86939j415306k206290k922779l481543l803814l874260l688365
1091.2E9341544l175902k263165j063651R2328R18978J392079J628542J648849J374787
1109.6E9894389Q39198K52056k43217o92684j075702j117206n59038L86369J120246
1127.9E8804411J295852J067293P02995L03245j73700p94661j528532k232044k734256
1146.3E4710603k970046l070763l305203l890216m818600n767498o104736n281856
1162.6A9501685l422586j222080P42928K241753L054847K935613J992885Q53163K38683
1180.9B6916891L45388O88491O77293L66715M36452J371622K953106M552627N542850
1199.3D3851435N496875M436096K865136J430642N55039K52628K21616J38307j49101
$$ plain form
1072.8 81080377 81320840 80733901 79318595 77112305 74189526 70707983 66904169 63029909 59341544
1091.2 59341544 56165642 53902477 52838826 52931154 53850132 55242211 56870753 58519602 59894389
1109.6 59894389 60733587 60985643 60742426 60049742 58974040 57856834 57297796 57684165 58804411
1127.9 58804411 60100263 61167556 61870551 62173796 62000096 61205435 59676903 57444859 54710603
1146.3 54710603 51740557 48669794 45364591 41474375 36655775 30888277 24783541 19501685
1162.6 19501685 16079099 14857019 15599947 17841700 20896547 23832160 25825045 26678208 26916891
1180.9 26916891 27262279 27950770 28628063 28994778 29431230 30802852 33755958 38308585 43851435
1199.3 43851435 49348310 53784406 56649542 58080184 58635223 58887851 59109467 59247774 59098673
1217.7E9098673o42985j280588j922798k313567k176016j459715m87482J91667K23914
1236D9231103k50682p27558p09904p2830Q32131J499781J672316J406300R30667M67711
1256.4E4279035J33986m1205q2326n9295l2329k3824j4770P2878K93863O64121J170754
1278.8E6360888J706738K102732K227885K068502J671278J076371L77309k78109p93761
1297.2F6519833j200414j651329k309412l236854m261064m897797m688597l471783
1313.5D0802583j482740O49381K279186K877936K495542J792416J427117J616347K034586
1331.9E4492354K195418J938749J477885J047939N34975j91229r48954j562619k029496
1350.2E6955022k421874k801228l098777l288209l620848m119900m056284l393328
$$ plain form
1217.7 59098673 58455688 57175100 55252302 52938735 50762719 49303004 48815522 49007189 49231103
1236 49231103 48980421 48252863 47542959 47470129 48302260 49802041 51474357 52880657 53811324 54279035
1256.4 54279035 54413021 54371816 54289490 54230195 54197866 54174042 54159272 54232150 54526013 55190134 56360888
1278.8 56360888 58067626 60170358 62398243 64466745 66138023 67214394 67591703 67313594 66519833
1297.2 66519833 65319419 63668090 61358678 58121824 53860760 48962963 44274366 40802583
1313.5 40802583 39319843 39969224 42248410 45126346 47621888 49414304 50841421 52457768 54492354
1331.9 54492354 56687772 58626521 60104406 61152345 61687320 61496091 60547137 58984518 56955022
1350.2 56955022 54533148 51731920 48633143 45344934 41724086 37604186 33547902 30154574
1366.6C0154574k584824j391858L1602J680592L416783M889166N873758N892548N074301
1384.9E3036642M199618L350318K347177J680869J542794J513654J357806J018095
1401.2G0046973M17626p6288l39180p48849j194417j190442p40260j06818N82695N50199
1421.6F7201239k30366r47118j605236k450473k946204l053265l320206k503544p79700
1440D9365127j5250L63857J011273J852721K145994J593005P37733N9730K25377N23370
1460.4E7862937P2986l52299j17487N3466m92823j177669r73171l64369p057L50249
1480.8E4854763Q74346J422286J921457K674788L323907K723533J641673J088726R50438
1499.1G1475917N95188j94955j590556k799898k040064k378434l983683n790144o869545
$$ plain form
1366.6 30154574 27569750 26177892 26209494 27890086 31306869 36196035 42069793 47962341 53036642
1384.9 53036642 57236260 60586578 62933755 64614624 66157418 67671072 69028878 70046973
1401.2 70046973 70464599 70388311 70049131 69300282 68105865 66915423 66175163 66068345 66651040 67201239
1421.6 67201239 66970873 66023755 64418519 61968046 59021842 55968577 52648371 50144827 49365127
1440 49365127 49349877 49713734 50725007 52577728 54723722 56316727 57054460 57114190 57339567 57862937
1460.4 57862937 57935923 57583624 57466137 57519603 57026780 55849111 54875940 54511571 54504514 54854763
1480.8 54854763 55729109 57151395 59072852 61747640 65071547 67795080 69436753 70525479 71475917
1499.1 71475917 72071105 71876150 70285594 67485696 65445632 63067198 59083515 53293371 46423826
1517.5D6423826o147960n045694k918035q56903J5273N33221R21270J656720K065253
1535.8C6646971J877201K243414K429810J098642p41899k684125m176659l834757k041036
1554.2C0817562p5498K422044M374319K684644J303098N89647j03670n19347n48020
1572.6D0944779j057586j972670k073285k394407l468329m357806m617927m177178
1588.9A6825591l111783j880596r61149l55168K55973J200231K457102L549309L943467
1607.2B1922977L666725L289774L402888M739851O767613O019336M302674L510720
1623.5E7622558K499694J425647P42948J60814o00231j248998r74029j024902j824653
1641.9E6778848k715158l926516l891426k193243k132496k203998k33951M07454L69162
$$ plain form
1517.5 46423826 40275866 35230172 32312137 31455234 31470507 32003728 32924998 34581718 36646971
1535.8 36646971 38524172 40767586 43197396 44296038 43554139 40870014 36693355 32858598 30817562
1554.2 30817562 30742064 33164108 37538427 40223071 41526169 42115816 42012146 41492799 40944779
1572.6 40944779 39887193 37914523 35841238 33446831 29978502 25620696 21002769 16825591
1588.9 16825591 13713808 11833212 10872063 10516895 10772868 11973099 14430201 17979510 21922977
1607.2 21922977 25589702 28879476 32282364 37022215 43789828 49809164 54111838 57622558
1623.5 57622558 60122252 61547899 62290847 62451661 61851430 60602432 59628403 58603501 56778848
1641.9 56778848 54063690 50137174 46245748 44052505 41920009 39716011 39482060 39889514 40258676
1660.3D0258676O24168J084080J067647O53488L34239O4677n26792q91814o97448o13764
1680.7D1357157o59505k00111P19816J002276J055753R00847M12401j25050q36903
1699D3626681j588404j316899j175273j018375l38924J26192M12271P89597J742494
1717.4D1259360K721626K681368K410102K019912J345683O67524J15990k45392N6714
1735.7E3032887L36415K85184N55575J077682J691258K596688M213923N632466N357105
1754.1G4779183M752916M209912L243190K711093K225107J439631Q63355N94581Q54790
1772.4I5673758J311582J112884O46317M48382M73553M75419M09365R4270k57885O3848
1792.8A00451493N55074L97027Q5461J36995M11737M06433J51479k3031J02090L04854
$$ plain form
1660.3 40258676 40882844 41966924 43034571 43688059 44022298 44086975 43560183 42668369 41970921 41357157
1680.7 41357157 40697652 40497541 41217357 42219633 43275386 44176233 44588634 44463584 43626681
1699 43626681 42038277 40721378 39546105 38527730 38188806 38314998 38727269 39516866 41259360
1717.4 41259360 43980986 46662354 49072456 51092368 52438051 53105575 53221565 52976173 53032887
1735.7 53032887 53369302 53654486 54210061 55287743 56979001 59575689 63789612 69422078 74779183
1754.1 74779183 79532099 83742011 86985201 89696294 91921401 93361032 94224387 94818968 95673758
1772.4 95673758 96985340 98098224 98744541 99192923 99666476 100141895 100551260 100645530 100387645 100451493
1792.8 100451493 101006567 101403594 101489055 101626050 102037787 102444220 102595699 102572668 102674758 102979612
1813.2A02979612K54464J27876J01245j7023k05446j68919r0862j5139L49307M26888
1833.6A03742003J51325N0580o521k75921l40093J41037M23896L07501J41084L3569
1854A04368460j1623m3761m0281m6230j92248m58301m01365J52838L94463J73498j6427
1876.5A03879023o4052o2859n4824o1059j28269j71626P403J22357N0675Q0228J18065
1898.9A03715062P0882M6659L6597m018L6741J82867K07114K3079q1718O3300J22070
1921.3A04418635J37961K48575K00713P3648K6285J6725J6392q703j25861j94394J78
1943.8A04810154J87397J47474N2488r990l4022j8680j1396l4917n7578r8419j03092
1966.2A04829419L7896J59371J33383R2495Q5604P2265N3870L1865j5390q2791j56366
$$ plain form
1813.2 102979612 103234076 103361952 103463197 103446174 103240728 103071809 102980947 102965808 103315115 103742003
1833.6 103742003 103893328 103943908 103937387 103661466 103321373 103462410 103886306 104193807 104334891 104368460
1854 104368460 104356837 104313076 104272795 104226565 104034317 103576016 103174651 103327489 103721952 103895450 103879023
1876.5 103879023 103814971 103752112 103697288 103636229 103507960 103336334 103343737 103466094 103516769 103596997 103715062
1898.9 103715062 103785944 103832603 103869200 103865182 103901923 104084790 104291904 104314983 104233265 104296565 104418635
1921.3 104418635 104556596 104805171 105005884 105079532 105105817 105122542 105138934 105130231 105004370 104809976 104810154
1943.8 104810154 104997551 105145025 105197513 105187523 105153501 105134821 105123425 105088508 105030930 104932511 104829419
1966.2 104829419 104867315 105026686 105160069 105252564 105338168 105410433 105464303 105496168 105480778 105397987 105241621
1988.7A05241621k12360j50502l7014l4964m2260J9419P9954J10877J15335J19364
2009A05209470J27661J02270M1699M6718J23835J31464P4363M0519L4106K9623K3103
2031.5A05984831J9562J2624o210k6465j1778K7037L3677J1968%M8l934j9956l8159
2058A05983245m5776n7268o5053l1149J597j3697l1054k0969o604p617r013r060k1803
2084.5A05665779l9947n0187l9256k2900k3257k5392j1134J7881M7660O5398P4673
2106.9A05659318P9620P5018N9080M4752L9172L0112K1327J8429J9181K7788M0054
2129.4A06113851M1461L2103K9802L5382L3223K1577J4282J3744J2625R596N877j19
2153.9A06363404j2386k7323l9482m0758k8002j3089P51J3864J8036J6845K0861K5201
$$ plain form
1988.7 105241621 105029261 104878759 104841745 104806781 104764521 104783940 104863894 104974771 105090106 105209470
2009 105209470 105337131 105439401 105481100 105527818 105651653 105783117 105857480 105897999 105932105 105961728 105984831
2031.5 105984831 106004393 106017017 106010807 105984342 105972564 105999601 106033278 106045246 106045246 106045294 106041360 106021404 105983245
2058 105983245 105937469 105880201 105815148 105783999 105785596 105771899 105740845 105719876 105713272 105705655 105696642 105687582 105665779
2084.5 105665779 105625832 105575645 105536389 105513489 105490232 105464840 105453706 105471587 105519247 105584645 105659318
2106.9 105659318 105738938 105813956 105873036 105917788 105956960 105987072 106008399 106026828 106046009 106073797 106113851
2129.4 106113851 106155312 106187415 106217217 106252599 106285822 106307399 106321681 106335425 106348050 106357646 106363523 106363404
2153.9 106363404 106351018 106323695 106284213 106243455 106215453 106202364 106203115 106216979 106235015 106251860 106272721 106297922
2178.3A06297922J9002J2100K0826L6764M5669M2069L0088K7180L8922M3571K9063
2200.8A06643176J5879J3733J0132K277n149r597o032m327j9431l2294k8634k4319
2225.2A06555414k4092k4796l3295m3404m3630l8648l2651l1305l9160m9663n5098
2247.7A06139672o0070o7723p0583o0296l3439o20L1937O0367P3123P5352P7784P0620
2272.2A06236124N4002M4870M1676L5929K1148j299k1398l0732l4380m4167n3561n3775
2296.6A06194437n8091p8595j00100j18470j44661j66213j63317j43575j35172j54996
2317A04931247j85692j84095j43933j08671j08195j22404q6427K027L4332m840l9458
2339.5A03983891n0271n936J52981K22266K5892k49362l86333l26610j91736p3505
$$ plain form
2178.3 106297922 106316924 106329024 106349850 106386614 106432283 106474352 106504440 106531620 106570542 106614113 106643176
2200.8 106643176 106659055 106672788 106682920 106685197 106680048 106670451 106664419 106660092 106640661 106608367 106579733 106555414
2225.2 106555414 106531322 106506526 106473231 106429827 106386197 106347549 106314898 106283593 106244433 106194770 106139672
2247.7 106139672 106079602 106011879 105941296 105881000 105847561 105846941 105878878 105939245 106012368 106087720 106165504 106236124
2272.2 106236124 106290126 106334996 106376672 106412601 106433749 106432450 106411052 106380320 106345940 106301773 106248212 106194437
2296.6 106194437 106136346 106057751 105957651 105839181 105694520 105528307 105364990 105221415 105086243 104931247
2317 104931247 104745555 104561460 104417527 104308856 104200661 104078257 103991830 103993857 104028189 104023349 103983891
2339.5 103983891 103933620 103927684 104080665 104302931 104328823 104079461 103693128 103366518 103174782 103101277
2359.9A03101277K5583R8407J46449J84857K36464K71833K84636L07810L28994L25608
2380.2A05311918K77698J95444J04856K8134j7333l0112k3854j9968k2173j7833j4592
2402.7A05772185j7285o807O449Q059J1313J7071R489o283j4996k7728m5371n4264
2427.2A05651832n2345l9756k2936j3018q559o592j3638k8610l4464l1674l2842l4094
2451.6A05333304l9911m0769l0053k5225k3949k0671j8751k3258l3319l6133k8264
2474.1A05013001j8048j0407m494P069K6488L8862L3105K3794K6035L0744L0959K3424
2498.5A05220532J0324J907o914j4150j2517j3518k6787m7493p0858q6999r2542r9623
2523A04761362j08135j15895j16086j03962q9264o8939m2200k4450j4293j526O509
$$ plain form
2359.9 103101277 103126860 103225267 103371716 103556573 103793037 104064870 104349506 104657316 104986310 105311918
2380.2 105311918 105589616 105785060 105889916 105918050 105900717 105870605 105846751 105826783 105804610 105786777 105772185
2402.7 105772185 105754900 105748093 105754542 105762601 105773914 105790985 105800474 105794191 105779195 105751467 105706096 105651832
2427.2 105651832 105599487 105559731 105536795 105523777 105515218 105508626 105494988 105466378 105431914 105400240 105367398 105333304
2451.6 105333304 105293393 105252624 105222571 105197346 105173397 105152726 105133975 105110717 105077398 105041265 105013001
2474.1 105013001 104994953 104984546 104980052 104987121 105013609 105052471 105085576 105109370 105135405 105166149 105197108 105220532
2498.5 105220532 105230856 105232763 105225849 105211699 105199182 105185664 105158877 105111384 105040526 104953527 104860985 104761362
2523 104761362 104653227 104537332 104421246 104317284 104228020 104159081 104116881 104092431 104078138 104076612 104083121
2545.5A04083121j323k4856m3809m3118l1495j7858q249j323J2588L6121O1345P2658
2569.9A04093802O5255N3299M7707M2212K8360J5283J4054J3483N937J1027K7155L4035
2594.4A04451609L5083K7418J2612M733l302j8978l2020l6573m9317p7307r4557q9598
2618.9A04129803r1195j10090j21581j26314j38760j46556j50907j60432j58918j36137
2639.3A02788913j12390j07765j07086j01972r9265r9862j04761j14119j23656j18482
2659.7A01699555r9707p7367m9543j5187J6522L9399M9257L4738N412k0254n6040j30689
2684.1A01396096k37394l41034m11748m31383l89046l00264j91450q5241k2775j5872
2704.5I8969889o5029j64670k67982l60948m36479m60189m55726m56142m56149m70864
$$ plain form
2545.5 104083121 104081798 104056942 104013133 103970015 103938520 103920662 103912413 103911090 103923678 103959799 104021144 104093802
2569.9 104093802 104159057 104212356 104260063 104302275 104330635 104345918 104359972 104373455 104379392 104390419 104417574 104451609
2594.4 104451609 104486692 104514110 104526722 104531455 104528153 104509175 104477155 104440582 104391265 104313958 104219401 104129803
2618.9 104129803 104038608 103928518 103806937 103680623 103541863 103395307 103244400 103083968 102925050 102788913
2639.3 102788913 102676523 102568758 102461672 102359700 102260435 102160573 102055812 101941693 101818037 101699555
2659.7 101699555 101599848 101522481 101472938 101457751 101474273 101513672 101562929 101597667 101603079 101582825 101526785 101396096
2684.1 101396096 101158702 100817668 100405920 99974537 99585491 99285227 99093777 99008536 98985761 98969889
2704.5 98969889 98904860 98740190 98472208 98111260 97674781 97214592 96758866 96302724 95846575 95375711
2724.9I5375711m76539m61901m69017m52023l60030k08152l1537J07581J90580K38561
2745.3I3453234K90400L71534M29970M15271L60132L30400L14123K76202K27844J63538
2765.7I6632648P7044k3752j40494k40254k79999l20959m28528n63973p02387q70872
2786.1I3138474j052356j186955j282662j361239j365184j222855r68999p21681n25200
2804.5H3451343l84367l12841k59065j87719j17207k9612R1362K30927L81744N20026
2824.9H3384591O00195O06716N56183M56792L18724J77681R3341L8415q0430k22510
2845.3H5929698k95985l09002l28052l79765m27711m45134m06963l17770k54732k45530
2865.7H2519054k39169k52122k81137k04063p7325j06883k70211m29416n50425o37269
$$ plain form
2724.9 95375711 94899172 94437271 93968254 93516231 93156201 92948049 92916512 93024093 93214673 93453234
2745.3 93453234 93743634 94115168 94545138 94960409 95320541 95650941 95965064 96241266 96469110 96632648
2765.7 96632648 96709692 96685940 96545446 96305192 96025193 95704234 95275706 94711733 94009346 93138474
2786.1 93138474 92086118 90899163 89616501 88255262 86890078 85667223 84698224 83976543 83451343
2804.5 83451343 83066976 82754135 82495070 82307351 82190144 82160532 82251894 82482821 82864565 83384591
2824.9 83384591 83984786 84591502 85147685 85604477 85923201 86100882 86194223 86232638 86152208 85929698
2845.3 85929698 85633713 85324711 84996659 84616894 84189183 83744049 83337086 83019316 82764584 82519054
2865.7 82519054 82279885 82027763 81746626 81542563 81465238 81358355 81088144 80658728 80108303 79471034
2886.1G9471034o94311p26050p47186p50107o88701n95421n27191m25923k45571m1312
2906.5G4029261R7161J26476J05017J09279J32316J32037J01781N0693K4m2599m6754
2928.9G4794692K7668J12760J62751K37018L43740M20826M53949M55565M08959K91395
2949.3G7709323J39022O6608P1067M7552J371k8699p8672k07341m28784p14982j020389
2971.7G5556076j237792j271486j133889q37166m02945L6693L69203N97525P35473
2990.1G2411692Q20834Q97723R25666R22120R42725R57215R56380R51421R12917Q54963
3010.5H1553656Q44985Q84944Q90911Q23557P28154O27840N52583N06174M05372K77793
3030.9H8095969K25955K75576L15881K01541P7516J37097K77507L19731K44463J98173
$$ plain form
2886.1 79471034 78776723 78050673 77303487 76553380 75864679 75269258 74742067 74316144 74070573 74029261
2906.5 74029261 74126422 74252898 74357915 74467194 74599510 74731547 74833328 74884021 74884045 74841446 74794692
2928.9 74794692 74822360 74935120 75097871 75334889 75678629 76099455 76553404 77008969 77417928 77709323
2949.3 77709323 77848345 77914953 77986020 78033572 78034943 78006244 77927572 77720231 77291447 76576465 75556076
2971.7 75556076 74318284 73046798 71912909 71075743 70672798 70709491 71078694 71676219 72411692
2990.1 72411692 73232526 74130249 75055915 75978035 76920760 77877975 78834355 79785776 80698693 81553656
3010.5 81553656 82398641 83283585 84174496 84998053 85726207 86354047 86906630 87412804 87818176 88095969
3030.9 88095969 88321924 88597500 88913381 89114922 89192438 89329535 89607042 89926773 90171236 90369409
3051.3I0369409K07848J71518J32549Q7225n6696k29573l14301k68322j79941k05368
3071.7H9714348l38077m73660n06497l89373k59489k17348k08193k37698k70343k21544
3092.1H6592126j75959j97744k13349j42318l499M7374l0262m5353N3758L5238j18303
3114.5H5801709j51384m4346P1973J25294N9587p9494j70660j72419j55902k02167
3134.9H5082191k97224l07232k06948j76608k56330l38584m30394m78780l64953k16925
3155.3H2008213k06369k67911k94841k78532k45935k13504j82467j63550j53446j26737
3175.7G9874921q2165l1012N644K8592O0267Q3291J07718J59430K11483K44064K68751
3198.1H0930984K94530L05945K86853K60985K60198K62112K33471K13003K05130J78176
$$ plain form
3051.3 90369409 90577257 90748775 90881324 90968549 90911853 90682280 90367979 90099657 89919716 89714348
3071.7 89714348 89376271 88902611 88396114 88006741 87747252 87529904 87321711 87084013 86813670 86592126
3092.1 86592126 86416167 86218423 86005074 85862756 85859257 85906631 85876369 85831016 85884774 85920012 85801709
3114.5 85801709 85650325 85605979 85677952 85803246 85862833 85783339 85612679 85440260 85284358 85082191
3134.9 85082191 84784967 84477735 84270787 84094179 83837849 83499265 83068871 82590091 82225138 82008213
3155.3 82008213 81801844 81533933 81239092 80960560 80714625 80501121 80318654 80155104 80001658 79874921
3175.7 79874921 79792756 79761744 79767388 79795980 79856247 79939538 80047256 80206686 80418169 80662233 80930984
3198.1 80930984 81225514 81531459 81818312 82079297 82339495 82601607 82835078 83048081 83253211 83431387
3218.5H3431387J90467K19112J90151J45328Q8668j526k8342R2685K11650J77342Q8519
3240.9H4805441K0373l2801R78R9850J14947M0662Q065M4054O6775N1170M0806M0430
3265.4H5300750n717p4362l3582Q2636J41251J44047J14965Q0830O8850O8903N8531
3287.8H5947102J8186J1342P9072J70571K45708K20078N8675o8963n078J83427L20161
3310.3H7180281L11845K17998J50961J21647Q8602L4297L2347J88101L81583M41247
3330.7H9148909M05246L27790K58135L17616M29707M56775M53096L80570K43437K82789
3351.1I2704070M42004M36973L02047K11000K19399K18177J07479N9253K12371M08292
3371.5I5321065M10861K57283J74505J84554K00081J93309J58930O1918p4983k9004
$$ plain form
3218.5 83431387 83621854 83840966 84031117 84176445 84265113 84263587 84235245 84327930 84539580 84716922 84805441
3240.9 84805441 84825814 84793013 84793991 84893841 85008788 85049450 85057515 85101569 85168344 85219514 85260320 85300750
3265.4 85300750 85295033 85220671 85187089 85269725 85410976 85555023 85669988 85750818 85819668 85888571 85947102
3287.8 85947102 85965288 85976630 86055702 86226273 86471981 86692059 86750734 86681771 86676693 86860120 87180281
3310.3 87180281 87492126 87710124 87861085 87982732 88071334 88105631 88137978 88326079 88707662 89148909
3330.7 89148909 89554155 89881945 90140080 90457696 90887403 91344178 91797274 92177844 92421281 92704070
3351.1 92704070 93146074 93583047 93885094 94096094 94315493 94533670 94641149 94700402 94912773 95321065
3371.5 95321065 95731926 95989209 96163714 96348268 96548349 96741658 96900588 96962506 96887523 96858519
3391.9I6858519J86390K18797K9701m5979J61445L64035K67297P9388N0389J08970
3412.3I8278952J90037K11913J00618N2929J39284J48857M7034j6624K9534O8623M5443
3434.7I9296600J25950K77561K79576J49560K8860M1044J83213K30014J48046Q2111
3455.1A00842535J9265k9850K0230N1438n3954r6118P2908K35415J86383M2749o5470
3477.5A01225531r1791L0708J20378M1091J9741J03724Q2183m5681r1719l8135p9942
3500A01276088j47760K7144J90258Q3613o878L5381P0775N8794j2875j41406k12288
3522.4A01220846j06776M3929J24240J81568J25360j8918k7597N0044l3522k23970
3542.8A01335204k31541N5373K58374J33729O8331J69695J19066n4872j70934l15238
$$ plain form
3391.9 96858519 97044909 97263706 97293407 97247428 97408873 97772908 98040205 98119593 98169982 98278952
3412.3 98278952 98468989 98680902 98781520 98834449 98973733 99122590 99169624 99153000 99182534 99251157 99296600
3434.7 99296600 99422550 99700111 99979687 100129247 100158107 100199151 100382364 100612378 100760424 100842535
3455.1 100842535 100861800 100831950 100852180 100903618 100849664 100753546 100826454 101061869 101248252 101291001 101225531
3477.5 101225531 101133740 101164448 101284826 101325917 101345658 101449382 101531565 101485884 101394165 101356030 101276088
3500 101276088 101128328 101155472 101345730 101429343 101422465 101457846 101528621 101587415 101574540 101433134 101220846
3522.4 101220846 101114070 101157999 101282239 101463807 101589167 101570249 101542652 101592696 101559174 101335204
3542.8 101335204 101103663 101159036 101417410 101551139 101619470 101789165 101908231 101853359 101682425 101367187
3563.2A01367187m77039j52886N23102O05762K69640M3654j2672j1265n4944k70843
3583.6A01829696n05305k03418L96967L24475k7215l1853Q9800J19901J77884Q7035
3604A02257967k07853k91610r2375p570J7893L183l0005K99537N44846J76871m41289
3626.4A02229595n29873L34406P30645M99630L22461K00463Q6009p1180m54998r26673
3646.8A02420485o41060O54233J085639N96559L51429M46093L88026K07269p6020m68397
3667.2A04964256n69868j62065j04499p8594O67345R39179O28590K23243k73585o77824
3687.6A05556178l30400N71346P65014M07123N2142j71089j00362J59299K8038m42207
3708A06495082o16049n973O15514M40478j9550k86675k69926q5520J34623J21999l12579
$$ plain form
3563.2 101367187 100890148 100737262 101260364 101866126 102135766 102179420 102166748 102155483 102100539 101829696
3583.6 101829696 101324391 101120973 101517940 101842415 101815200 101783347 101873147 101993048 102170932 102257967
3604 102257967 102050114 101758504 101666129 101658559 101676452 101679635 101649630 101949167 102494013 102670884 102229595
3626.4 102229595 101699722 102034128 102764773 103264403 103586864 103787327 103873336 103802156 103347158 102420485
3646.8 102420485 101779425 102433658 103519297 104115856 104467285 104913378 105301404 105508673 105432653 104964256
3667.2 104964256 104394388 104232323 104127824 104049230 104716575 105655754 106284344 106507587 106234002 105556178
3687.6 105556178 105225778 105797124 106562138 106969261 107021403 106850314 106749952 106909251 106937289 106495082
3708 106495082 105879033 105873060 106488574 106929052 106909502 106622827 106352901 106267381 106402004 106524003 106211424
3730.4A06211424q24762o57522K86114P24912K69198l43525m06659j7714j14680n4002
3750.8A05072784O10185O54829K02500Q1957K96366K00248r6703j47736J6153K97701
3771.2A07188284L76964P7403k46799j97006J01889J48177J11901J77610J30368l7420
3791.6A07831371k73311m43745m03130l72624j56475K67053K82812L27230M08149N9700
3812A07527030m34423n84280l87121k26843K49982N57577L11363Q2374j12593k99347
3832.4A06683719l90088m36521j95849K81620N04840M90057K63047k41458q26144q45647
3852.8A05287576K82895Q30913M20511j00100l37196j32262m1402j94812O402L44455
3873.2A06366980L97992J27745k84529k61593p701J03844K37596Q3267n4192J66678
$$ plain form
3730.4 106211424 105386662 104729140 105015254 105740166 106009364 105665839 105259180 105241466 105126786 105072784
3750.8 105072784 105682969 106337798 106540298 106622255 106918621 107118869 107022166 106874430 106890583 107188284
3771.2 107188284 107565248 107642651 107395852 107198846 107300735 107448912 107560813 107738423 107868791 107831371
3791.6 107831371 107558060 107114315 106711185 106338561 106182086 106449139 106731951 107059181 107467330 107527030
3812 107527030 107092607 106508327 106121206 105894363 106144345 106701922 107013285 107095659 106983066 106683719
3832.4 106683719 106293631 105857110 105661261 105942881 106447721 106937778 107200825 106959367 106133223 105287576
3852.8 105287576 105570471 106401384 106821895 106721795 106384599 106252337 106210935 106016123 106022525 106366980
3873.2 106366980 106764972 106892717 106608188 106346595 106338894 106442738 106680334 106763601 106709409 106876087
3893.6A06876087Q8155l49676n45502k83253J78003N76091O08194L17895K5666j93405
3914A07298255l20900j74355O3288N9843M423P1430O235j53506m0484K14541K12884
3936.4A07241654J1540j62566j46890P081J0956l5477P1621J39546Q0836J6308k8324
3958.9A07206285m6623J4055O3765R859n0366m5252j6093O592J4400N699o438j2541
3983.3A07143342p009j5438l3688k5690j3673j490J9204
3997.6A07065558
$$ plain form
3893.6 106876087 106964242 106614566 106069064 105785811 105963814 106539905 107148099 107465994 107491660 107298255
3914 107298255 106977355 106803000 106866288 106926131 106930554 107001984 107008219 106854713 106814229 107028770 107241654
3936.4 107241654 107253194 107090628 106943738 106950819 106961775 106926298 106997919 107137465 107218301 107234609 107206285
3958.9 107206285 107159662 107173717 107237482 107247341 107196975 107151723 107135630 107142222 107156622 107162321 107155883 107143342
3983.3 107143342 107136333 107120895 107087207 107061517 107047844 107046354 107065558
3997.6 107065558
##END=$$ End of the data block
