##TITLE=2-5M-15 $$ Begin of the data block
##JCAMP-DX=5.00 $$ ACD/SpecManager v 10.08
##SPECTROMETER/DATA SYSTEM=Alpha
##DATE=02 Jun 2015 08:56:44
##DATA TYPE=INFRARED SPECTRUM
##DATA CLASS=XYDATA
##ORIGIN=
##OWNER=
##NPOINTS=1765
##FIRSTX=399.76428223
##LASTX=3997.64306641
##MAXX=3997.64306641
##MINX=399.76428223
##MAXY=1.00222981
##MINY=0.67146641
##XFACTOR=1.0000000000
##YFACTOR=0.000000010000000
##FIRSTY=1.00000000
##DELTAX=2.03961372
##XUNITS=1/CM
##YUNITS=ARBITRARY UNITS
##XYDATA=(X++(Y..Y))
$$ plain form
399.8 100000000 100000000 99921918 99926817 99958503 99871486 99778384 99685562 99543393 99383092 99253964 99246889 99275297
424.2 99275297 99224961 99169433 99120742 99016148 98942959 98928648 98887140 98837113 98760724 98667848 98657614 98656577
448.7 98656577 98626769 98651767 98647666 98590767 98594922 98609453 98623443 98648059 98609537 98571855 98551339 98494196
473.2 98494196 98486263 98509151 98508650 98538238 98525065 98456663 98451030 98444426 98411638 98419338 98403215 98389071 98406440
499.7 98406440 98357087 98301971 98274535 98199433 98149246 98107749 98000574 97919923 97869110 97805840 97783393 97746170
524.2 97746170 97675151 97646922 97603267 97542953 97520024 97457427 97382045 97348458 97292054 97247273 97217363 97138602
548.7 97138602 97086143 97054225 96973556 96918553 96871156 96787971 96752548 96730477 96673810 96643096 96610671 96559095
573.1 96559095 96532911 96489918 96436554 96429592 96421224 96402878 96397859 96368873 96358240 96381110 96375638 96386981 96420825
$$ packed form
399.8A00000000Tp8082M899L1686q7017r3102r2822j42169j60301j29128p075K8408
424.2I9275297n0336n5528m8691j04594p3189j4311m1508n0027p6389r2876j0234j037
448.7I8656577k9808K4998m101n6899M155J4531J3990K4616l8522l7682k0516n7143
473.2I8494196p933K2888n01K9588j3173o8402n633o604l2788P700j6123j4144J7369
499.7I8406440m9353n5116k7436p5102n0187m1497j07175q0651n0813o3270k2447l7223
524.2I7746170p1019k8229m3655o0314k2929o2597p5382l3587n6404m4781k9910p8761
548.7I7138602n2459l1918q0669n5003m7397q3185l5423k2071n6667l0714l2425n1576
573.1I6559095k6184m2993n3364o962q368j8346n019k8986j0633K2870n472J1343L3844
$$ plain form
599.6 96420825 96429616 96464008 96505320 96509093 96532178 96559489 96557188 96557271 96557838 96601403 96709388 96793336 96866632
626.2 96866632 96983296 97081643 97159362 97247458 97313124 97375119 97444439 97492963 97562599 97650552 97704411 97765732
650.6 97765732 97844422 97909313 97984153 98050696 98098564 98175108 98242348 98231113 98235530 98348099 98477697 98586160
675.1 98586160 98648739 98696285 98761547 98808157 98850852 98902994 98926979 98940355 98951167 98937744 98924381 98924565
699.6 98924565 98936045 98972750 99018973 99066782 99133277 99195194 99232924 99261582 99277914 99292874 99325746 99358356
724.1 99358356 99384499 99402738 99408579 99416435 99422133 99417996 99413747 99404621 99394226 99394041 99395829 99403709 99418640 99428463
752.6 99428463 99438554 99448711 99458468 99481153 99504787 99519056 99536568 99549150 99556619 99567068 99569362 99577290 99597949
779.1 99597949 99614841 99642068 99672574 99680579 99688423 99713105 99744642 99777007 99801075 99826181 99866343 99898505
$$ packed form
599.6I6420825Q791L4392M1312L773K3085K7311k301Q3N67M3565J07985Q3948P3296
626.2I6866632J16664R8347P7719Q8096O5666O1995O9320M8524O9636Q7953N3859O1321
650.6I7765732P8690O4891P4840O6543M7868P6544O7240j1235M417J12569J29598J08463
675.1I8586160O2579M7546O5262M6610M2695N2142K3985J3376J0812j3423j3363J84
699.6I8924565J1480L6705M6223M7809O6495O1917L7730K8658J6332J4960L2872L2610
724.1I9358356K6143J8239N841P856N698m137m249r126j0395j85J788P880J4931R823
752.6I9428463J0091J0157R757K2685K3634J4269J7512J2582P469J0449K294P928K0659
779.1I9597949J6892K7227L0506Q005P844K4682L1537L2365K4068K5106M0162L2162
$$ plain form
803.6 99898505 99920613 99955416 99984986 100006235 100038481 100069904 100096941 100117385 100118911 100121474 100131261 100129998 100125349
830.1 100125349 100114787 100092244 100080037 100074661 100062132 100054312 100045681 100033247 100029063 100022388 100010800 100000000 100006402
856.6 100006402 100003028 100000000 100011313 100027430 100037277 100035954 100040710 100043702 100037169 100041914 100058436 100072801 100082278
883.2 100082278 100088167 100094080 100094962 100085497 100074995 100067353 100061285 100058258 100056052 100053775 100045586 100025785 99999845 99969804
911.7 99969804 99936527 99907613 99879521 99850458 99836463 99836856 99842536 99856687 99871254 99884921 99905425 99918616
936.2 99918616 99921447 99927050 99926120 99916929 99906349 99883682 99856865 99829310 99782825 99733233 99690574 99638438 99587661
962.7 99587661 99538684 99476075 99413729 99351138 99274486 99197870 99121606 99035633 98952979 98877883 98810714 98756659
987.2 98756659 98700774 98639309 98582423 98518997 98449528 98384672 98307782 98213649 98114675 98008078 97902191
$$ packed form
803.6I9898505K2108L4803K9570K1249L2246L1423K7037K0444J526K563R787j263m649
830.1A00125349j0562k2543j2207n376j2529p820q631j2434m184o675j1588j0800O402
856.6A00006402l374l028J1313J6117R847j323M756K992o533M745J6522J4365R477
883.2A00082278N889N913Q82r465j0502p642o068l027k206k277q189j9801k5940l0041
911.7I9969804l3277k8914k8092k9063j3995L93N680J4151J4567J3667K0504J3191
936.2I9918616K831N603r30r191j0580k2667k6817k7555m6485m9592m2659n2136n0777
962.7I9587661m8977o2609o2346o2591p6652p6616p6264q5973q2654p5096o7169n4055
987.2I8756659n5885o1465n6886o3426o9469o4856p6890r4133r8974j06597j05887
$$ plain form
1009.6 97902191 97808540 97720832 97655421 97631574 97634858 97657305 97694492 97724026 97740328 97748911 97741473 97721654
1034.1 97721654 97700661 97679621 97667384 97660983 97642505 97618741 97603106 97591335 97585970 97585434 97574973 97560000
1058.6 97560000 97550613 97549504 97568011 97598290 97620386 97632766 97629005 97609609 97599596 97602051 97611308 97636282 97659159
1085.1 97659159 97665262 97672552 97675776 97664142 97651815 97633612 97605234 97576332 97534311 97482836 97438616 97387010
1109.6 97387010 97336578 97311348 97295296 97286636 97294474 97297245 97290838 97268140 97239888 97304040 97467387 97612721
1134 97612721 97719324 97812194 97878039 97934127 97986525 98026460 98073453 98114085 98128355 98143345 98158610 98160779
1158.5 98160779 98167884 98176271 98187542 98224425 98276216 98340613 98428792 98513955 98588383 98668909 98743540 98812354
1183 98812354 98881888 98933351 98972839 99012834 99037838 99054933 99075067 99082959 99086010 99096423 99105936 99122781 99147785
$$ packed form
1009.6I7902191r3651q7708o5411k3847L284K2447L7187K9534J6302Q583p438j9819
1034.1I7721654k0993k1040j2237o401j8478k3764j5635j1771n365n36j0461j4973
1058.6I7560000r387j109J8507L0279K2096J2380l761j9396j0013K455R257K4974K2877
1085.1I7659159O103P290L224j1634j2327j8203k8378k8902m2021n1475m4220n1606
1109.6I7387010n0432k5230j6052q660P838K771o407k2698k8252O4152J63347J45334
1134I7612721J06603R2870O5845N6088N2398L9935M6993M0632J4270J4990J5265K169
1158.5I8160779P105Q387J1271L6883N1791O4397Q8179Q5163P4428Q0526P4631O8814
1183I8812354O9534N1463L9488L9995K5004J7095K0134P892L051J0413R513J6845K5004
$$ plain form
1209.5 99147785 99164814 99181110 99198985 99208134 99216807 99221265 99210453 99197024 99179977 99150097 99121076 99096847
1234 99096847 99074197 99062532 99055201 99041545 99031490 99027252 99025017 99031806 99040395 99041402 99043471 99046904 99054193 99076229
1262.5 99076229 99097723 99105841 99111396 99114865 99122894 99148887 99175495 99191564 99208415 99216497 99209547 99198735 99184573
1289 99184573 99177676 99192530 99222583 99269921 99337316 99402016 99455547 99502581 99535048 99558860 99578041 99585468
1313.5 99585468 99595517 99615324 99640381 99684232 99735880 99768716 99793720 99815279 99819797 99817067 99798495 99752951
1338 99752951 99733424 99760723 99783009 99785513 99774009 99748147 99726510 99707371 99684381 99661201 99606329 99524075
1362.5 99524075 99478692 99449891 99396735 99336505 99245733 99136460 99065661 98983222 98830473 98673755 98646712
1384.9 98646712 98796088 99008071 99132204 99141389 99110109 99095070 99107242 99148846 99165839 99155790 99163914
$$ packed form
1209.5I9147785J7029J6296J7875R149Q673M458j0812j3429j7047k9880k9021k4229
1234I9096847k2650j1665p331j3656j0055m238k235O789Q589J007K069L433P289K2036
1262.5I9076229K1494Q118N555L469Q029K5993K6608J6069J6851Q082o950j0812j4162
1289I9184573o897J4854L0053M7338O7395O4700N3531M7034L2467K3812J9181P427
1313.5I9585468J0049J9807K5057M3851N1648L2836K5004K1559M518k730j8572m5544
1338I9752951j9527K7299K2286K504j1504k5862k1637j9139k2990k3180n4872q2254
1362.5I9524075m5383k8801n3156o0230r0772j09273p0799q2439j52749j56718k7043
1384.9I8646712J49376K11983J24133R185l1280j5039J2172M1604J6993j0049Q124
$$ plain form
1407.3 99163914 99160445 99138463 99116230 99061716 98954421 98860455 98846406 98867327 98887223 98887777 98873079 98874289
1431.8 98874289 98855853 98788697 98765391 98818612 98864102 98864090 98825169 98790812 98780614 98760051 98681915 98496288
1456.3 98496288 98379380 98455232 98518801 98529154 98611420 98742795 98818922 98867643 98977131 99133396 99268109
1478.7 99268109 99340171 99379778 99398172 99352765 99281567 99280763 99327093 99330473 99300444 99330175 99422711 99468398
1503.2 99468398 99352175 99210501 99277163 99392015 99440050 99414206 99359202 99308449 99248314 99242687 99279314
1525.6 99279314 99303979 99320960 99285156 99214548 99195331 99124712 98927599 98843586 98912805 98976541 98987955
1548.1 98987955 98954213 98895103 98812968 98681301 98450404 98360234 98468238 98500764 98434716 98309445 98177534
1570.5 98177534 98100621 97960806 97734308 97600377 97501707 97332829 97121274 96877074 96592975 96279222
$$ packed form
1407.3I9163914l469k1982k2233n4514j07295r3966j4049K0921J9896N54j4698J210
1431.8I8874289j8436o7156k3306N3221M5490j2l8921l4357j0198k0563p8136j85627
1456.3I8496288j16908P5852O3569J0353Q2266J31375P6127M8721J09488J56265J34713
1478.7I9268109P2062L9607J8394m5407p1198q04M6330L380l0029K9731R2536M5687
1503.2I9468398j16223j41674O6662J14852M8035k5844n5004n0753o0135n627L6627
1525.6I9279314K4665J6981l5804p0608j9217p0619j97113q4013O9219O3736J1414
1548.1I8987955l3742n9110q2135j31667k30897r0170J08004L2526o6048j25271j31911
1570.5I8177534p6913j39815k26498j33931r8670j68878k11555k44200k84099l13753
$$ plain form
1590.9 96279222 95934862 95557469 95164603 94755238 94324398 93888545 93446612 92982519 92500943 92019790
1611.3 92019790 91538757 90997279 90462154 90131807 89874971 89570946 89308327 89096236 88925195 88844323
1631.7 88844323 88828206 88900363 89143592 89466250 89786345 90088212 90420890 90870190 91314644 91698551
1652.1 91698551 92236143 92853284 93371487 93810862 94237453 94686985 95080835 95403314 95748836 96104944
1672.5 96104944 96427029 96763557 97089446 97332120 97471607 97637367 97919816 98172182 98359466 98481023
1692.9 98481023 98494166 98472095 98483026 98555583 98703229 98808187 98867053 98926330 98955709 98927659 98843354
1715.3 98843354 98767930 98810482 98912984 98970288 98995578 99018085 99035490 99022406 98995614 99086243 99229038
1737.8 99229038 99320346 99408835 99513769 99601895 99653536 99684864 99760979 99856865 99902081 99921656 99932486
$$ packed form
1590.9I6279222l44360l77393l92866m09365m30840m35853m41933m64093m81576m81153
1611.3I2019790m81033n41478n35125l30347k56836l04025k62619k12091j71041q0872
1631.7H8844323j6117P2157K43229L22658L20095L01867L32678M49300M44454L83907
1652.1I1698551N37592O17141N18203M39375M26591M49532L93850L22479L45522L56108
1672.5I6104944L22085L36528L25889K42674J39487J65760K82449K52366J87284J21557
1692.9I8481023J3143k2071J0931P2557J47646J04958N8866N9277K9379k8050q4305
1715.3I8843354p5424M2552J02502N7304K5290K2507J7405j3084k6792R0629J42795
1737.8I9229038R1308Q8489J04934Q8126N1641L1328P6115R5886M5216J9575J0830
$$ plain form
1760.2 99932486 99938852 99974442 99990851 99964654 99923617 99891686 99929780 99999130 100024509 100024152 100030839 100034308 100040960
1786.7 100040960 100034583 99978215 99934876 99966222 100000000 99994224 99982005 100001836 100033057 100045335 100037205 100031233
1811.2 100031233 100043046 100052977 100052392 100055218 100052261 100026798 100000775 99988830 99972981 99982423 100015652 100027478 100024557
1837.7 100024557 100024354 99997604 99939311 99929142 99968189 99993575 100000000 100005782 100007463 100005233 100001156 99998194 99991751
1864.2 99991751 99960911 99917215 99919903 99961317 99985105 99986649 99983817 99980158 99973750 99964333 99949831 99926656 99917412
1890.7 99917412 99926811 99929607 99927676 99927843 99925250 99918187 99907118 99892503 99877715 99872333 99875557 99863476 99830961
1917.3 99830961 99813384 99811870 99806523 99811053 99819905 99815995 99803740 99789709 99778539 99770135 99752134 99719930 99699748
1943.8 99699748 99701875 99705535 99701881 99693114 99681336 99667972 99653465 99639904 99629945 99616915 99595660 99579173 99573433
$$ packed form
1760.2I9932486O366L5590J6409k6197m1037l1931L8094O9350K5379l57O687L469O652
1786.7A00040960o377n6368m3339L1346L3778n776j2219J9831L1221J2278q130n972
1811.2A00031233J1813R931n85K826k957k5463k6023j1945j5849R442L3229J1826k921
1837.7A00024557k03k6750n8293j0169L9047K5386O425N782J681k230m077k962o443
1864.2I9991751l0840m3696K688M1414K3788J544k832l659o408r417j4502k3175r244
1890.7I9917412R399K796j931J67k593p063j1069j4615j4788n382L224j2081l2515
1917.3I9830961j7577j514n347M530Q852l910j2255j4031j1170q404j8001l2204k0182
1943.8I9699748K127L660l654q767j1778j3364j4507j3561r959j3030k1255j6487n740
$$ plain form
1970.3 99573433 99566543 99556428 99547547 99536699 99522066 99505371 99489748 99477065 99461442 99436879 99418116 99415511
1994.8 99415511 99415213 99412620 99406934 99393821 99379122 99370331 99367273 99365276 99360240 99349129 99332166 99307442 99268508
2021.3 99268508 99202305 99141145 99164790 99249339 99302977 99319303 99328065 99333072 99333608 99335271 99338681 99339747 99338239
2047.8 99338239 99334085 99330103 99329394 99331200 99334687 99336910 99334854 99332935 99333858 99335200 99337089 99338001 99337828 99340856 99347460
2078.4 99347460 99355286 99363637 99370390 99373728 99374741 99374592 99376059 99381447 99388444 99396950 99407995 99418914 99429226 99438161
2106.9 99438161 99442714 99445945 99451804 99457192 99461269 99464607 99464846 99465287 99470133 99476230 99481940 99489421 99498159 99505985 99513930
2137.5 99513930 99523926 99533021 99536496 99535221 99535149 99535191 99530554 99522036 99507850 99484038 99454731 99424475 99395585 99374425
2166.1 99374425 99367756 99390888 99450707 99524164 99590021 99648046 99701333 99747485 99783874 99809206 99828380 99850303
$$ packed form
1970.3I9573433o890j0115q881j0848j4633j6695j5623j2683j5623k4563j8763k605
1994.8I9415511k98k593n686j3113j4699q791l058j997n036j1111j6963k4724l8934
2021.3I9268508o6203o1160K3645Q4549N3638J6326Q762N007N36J663L410J066j508
2047.8I9338239m154l982p09J806L487K223k056j919R23J342J889R12j73L028O604
2078.4I9347460P826Q351O753L338J013j49J467N388O997Q506J1045J0919J0312Q935
2106.9I9438161M553L231N859N388M077L338K39M41M846O097N710P481Q738P826P945
2137.5I9513930R996R095L475j275p2M2m637q518j4186k3812k9307l0256k8890k1160
2166.1I9374425o669K3132N9819P3457O5857N8025N3287M6152L6389K5332J9174K1923
$$ plain form
2190.6 99850303 99873680 99892920 99909955 99924809 99935299 99943161 99948323 99951738 99957788 99965209 99970090 99973094 99973464
2217.1 99973464 99972248 99976134 99983168 99989027 99995106 99995857 99992353 99995124 100000000 100000000 99998951 99999267 100001895 100007296 100011730 100014448
2249.7 100014448 100014508 100010061 100008953 100011957 100011432 100014007 100020647 100018489 100012946 100014043 100015986 100016057 100015819 100017869 100023782 100025010
2282.3 100025010 100020361 100017452 100012398 100004590 100000000 99994498 99987775 99985331 99978638 99961907 99942976 99925661 99910247
2308.9 99910247 99893361 99872398 99852765 99830168 99799025 99766630 99738753 99715167 99690962 99662030 99636447 99617708
2333.3 99617708 99588883 99543178 99500304 99474549 99473852 99527049 99622226 99688601 99682140 99612623 99524909 99455976
2357.8 99455976 99417073 99409586 99435008 99477720 99525809 99575102 99621600 99676913 99745733 99812156 99870557 99920636
2382.3 99920636 99955153 99977374 99993420 100001776 100004756 100005102 100002456 99999732 99998528 99997139 99995768 99993730 99989063 99985349
$$ packed form
2190.6I9850303K3377J9240J7035J4854J0490P862N162L415O050P421M881L004L70
2217.1I9973464j216L886P034N859O079P51l504K771M876%j049L16K628N401M434K718
2249.7A00014448O0m447j108L004n25K575O640k158n543J097J943P1k38K050N913J228
2282.3A00025010m649k909n054p808m590n502o723k444o693j6731j8931j7315j5414
2308.9I9910247j6886k0963j9633k2597l1143l2395k7877k3586k4205k8932k5583j8739
2333.3I9617708k8825m5705m2874k5755o97N3197R5177O6375o461o9517q7714o8933
2357.8I9455976l8903p487K5422M2712M8089M9293M6498N5313O8820O6423N8401N0079
2382.3I9920636L4517K2221J6046Q356K980L46k646k724j204j389j371k038m667l714
$$ plain form
2410.8 99985349 99984026 99981219 99977726 99973357 99966484 99961662 99961209 99963129 99964857 99963903 99962926 99962646 99957955 99950510 99946547
2441.4 99946547 99945414 99943769 99937797 99928916 99925506 99925935 99923849 99920774 99915516 99906963 99902064 99901223 99898356 99894065 99889332
2472 99889332 99885631 99886864 99888206 99883264 99876320 99872053 99869788 99868047 99863350 99854314 99845445 99839652 99837500 99839431 99839729
2502.6 99839729 99833286 99824202 99818671 99820429 99823856 99818683 99810821 99808592 99805498 99800909 99796951 99789268 99780333 99775273
2531.2 99775273 99773860 99773848 99770755 99762887 99755019 99747843 99743259 99745476 99744940 99737853 99735045 99733132 99728256 99727517 99725789 99719948
2563.8 99719948 99715185 99708682 99700683 99694604 99688065 99681699 99676394 99669725 99665868 99667019 99664730 99657512 99650884 99645698
2592.4 99645698 99641228 99634552 99625641 99619651 99615401 99610204 99607134 99603593 99594849 99584937 99576980 99573183 99574596 99571204
2620.9 99571204 99561054 99555302 99551815 99544436 99539280 99538773 99536133 99526370 99510747 99496680 99488586 99481475 99472773 99463767
$$ packed form
2410.8I9985349j323k807l493m369o873m822m53J920J728r54r77k80m691p445l963
2441.4I9946547j133j645n972q881l410M29k086l075n258q553m899q41k867m291m733
2472I9889332l701J233J342m942o944m267k265j741m697r036q869n793k152J931K98
2502.6I9839729o443r084n531J758L427n173p862k229l094m589l958p683q935n060
2531.2I9775273j413j2l093p868Tp176m584K217n36p087k808j913m876p39j728n841
2563.8I9719948m763o503p999o079o539o366n305o669l857J151k289p218o628n186
2592.4I9645698m470o676q911n990m250n197l070l541q744r912p957l797J413l392
2620.9I9571204j0150n752l487p379n156n07k640r763j5623j4067q094p111q702r006
$$ plain form
2649.5 99463767 99454767 99447566 99442023 99436873 99432427 99426460 99417293 99409074 99402928 99398041 99397701 99397850 99391317 99384129 99381232
2680.1 99381232 99375516 99365467 99355268 99347562 99340171 99327320 99314308 99308062 99303138 99295580 99288213 99281406 99274880
2706.6 99274880 99266082 99250168 99233526 99225318 99222267 99220943 99221832 99220580 99214327 99203092 99187666 99173588 99162734
2733.1 99162734 99154198 99147838 99139953 99130803 99124944 99125636 99129009 99122578 99104756 99089831 99083000 99073267 99056756 99041224
2761.6 99041224 99032098 99026132 99016148 99003464 98995942 98996764 98992944 98974681 98954457 98938459 98923862 98918247 98922467
2788.2 98922467 98917103 98894054 98870486 98858541 98848617 98826319 98793620 98761588 98737633 98719084 98696232 98665231
2812.6 98665231 98630023 98599684 98577160 98555303 98529977 98500186 98469025 98441648 98413324 98376524 98336363 98297143
2837.1 98297143 98231238 98117238 97979856 97844625 97710931 97577792 97469264 97414511 97411442 97442812 97488719
$$ packed form
2649.5I9463767r000p201n543n150m446n967r167q219o146m887l40J49o533p188k897
2680.1I9381232n716j0049j0199p706p391j2851j3012o246m924p558p367o807o526
2706.6I9274880q798j5914j6642q208l051j324Q89j252o253j1235j5426j4078j0854
2733.1I9162734q536o360p885r150n859O92L373o431j7822j4925o831r733j6511j5532
2761.6I9041224r126n966r984j2684p522Q22l820j8263k0224j5998j4597n615M220
2788.2I8922467n364k3049k3568j1945r924k2298l2699l2032k3955j8549k2852l1001
2812.6I8665231l5208l0339k2524k1857k5326k9791l1161k7377k8324l6800m0161l9220
2837.1I8297143o5905j14000j37382j35231j33694j33139j08528n4753l069L1370M5907
$$ plain form
2859.5 97488719 97520798 97532105 97534567 97527474 97522646 97536880 97543943 97519231 97487330 97469991 97461075 97450036 97427654
2886.1 97427654 97395247 97356385 97315770 97283685 97243267 97176653 97107959 97053730 97000128 96938211 96870607 96803755
2910.5 96803755 96727502 96611530 96460527 96316493 96202791 96131474 96112233 96146810 96222883 96300137 96361661
2933 96361661 96432441 96521586 96616149 96713966 96808380 96870619 96880466 96856529 96835071 96813500 96776539 96746916
2957.4 96746916 96748900 96781170 96830249 96888828 96956360 97030783 97116446 97205168 97277474 97342211 97406125 97445333
2981.9 97445333 97455710 97461647 97482246 97523332 97563440 97577542 97578931 97572428 97554207 97546101 97543788 97537291 97551495
3008.4 97551495 97590148 97619045 97608745 97564620 97513133 97466332 97431445 97409338 97381496 97351104 97338903 97343969
3032.9 97343969 97336233 97301650 97280473 97287852 97279769 97232521 97173047 97134745 97105914 97061819 97013193 96964067
$$ packed form
2859.5I7488719L2079J1307K462p093m828J4234P063k4712l1901j7339q916j1039k2382
2886.1I7427654l2407l8862m0615l2085m0418o6614o8694n4229n3602o1917o7604o6852
2910.5I6803755p6253j15972j51003j44034j13702p1317j9241L4577P6073P7254O1524
2933I6361661P0780Q9145R4563R7817R4414O2239R847k3937k1458k1571l6961k9623
2957.4I6746916J984L2270M9079N8579O7532P4423Q5663Q8722P2306O4737O3914L9208
2981.9I7445333J0377N937K0599M1086M0108J4102J389o503j8221q106k313o497J4204
3008.4I7551495L8653K8897j0300m4125n1487m6801l4887k2107k7842l0392j2201N066
3032.9I7343969p736l4583k1177P379q083m7248n9474l8302k8831m4095m8626m9126
$$ plain form
3057.4 96964067 96913427 96879786 96865946 96863800 96852142 96806687 96747983 96709991 96701491 96705824 96688896 96644795
3081.9 96644795 96592492 96532178 96471727 96422881 96367192 96300411 96249431 96218258 96177942 96117753 96060759 96028733
3106.3 96028733 96007621 95963800 95913923 95895147 95883852 95842057 95759624 95648211 95545954 95477396 95428121
3128.8 95428121 95368415 95294708 95232868 95192647 95148468 95069975 94970584 94882107 94807935 94751245 94711339 94646770
3153.2 94646770 94536585 94419211 94317931 94224292 94132042 94037861 93939763 93838233 93734419 93628037
3173.6 93628037 93518978 93407786 93296230 93185544 93073028 92952496 92827415 92703873 92575932 92440307
3194 92440307 92300767 92159653 92020661 91884482 91747844 91614282 91482830 91347313 91209245 91073418
3214.4 91073418 90941960 90807354 90662289 90511739 90360910 90211177 90069014 89945650 89830375 89685100
$$ packed form
3057.4I6964067n0640l3641j3840k146j1658m5455n8704l7992q500M333j6928m4101
3081.9I6644795n2303o0314o0451m8846n5689o6781n0980l1173m0316o0189n6994l2026
3106.3I6028733k1112m3821m9877j8776j1295m1795q2433j11413j02257o8558m9275
3128.8I5428121n9706p3707o1840m0221m4179p8493r9391q8477p4172n6690l9906o4569
3153.2I4646770j10185j17374j01280r3639r2250r4181r8098j01530j03814j06382
3173.6I3628037j09059j11192j11556j10686j12516j20532j25081j23542j27941j35625
3194I2440307j39540j41114j38992j36179j36638j33562j31452j35517j38068j35827
3214.4I1073418j31458j34606j45065j50550j50829j49733j42163j23364j15275j45275
$$ plain form
3234.8 89685100 89511234 89347887 89200467 89063048 88941634 88819814 88678521 88539898 88426036 88321537
3255.2 88321537 88208181 88086009 87968981 87866068 87772453 87690258 87618816 87527114 87402290 87264943
3275.6 87264943 87122160 86982417 86855292 86730850 86598074 86465156 86349797 86234760 86083168 85899979
3296 85899979 85705405 85510707 85344136 85211420 85054749 84819245 84524965 84230208 83965796 83715922
3316.4 83715922 83453923 83176476 82899046 82626206 82326359 81989032 81649303 81323063 81007957 80703443
3336.8 80703443 80377430 80005211 79610765 79210591 78819883 78456926 78076190 77634263 77172911 76742065
3357.2 76742065 76337153 75924551 75498790 75099897 74734187 74338776 73877305 73410404 73000348 72629046
3377.6 72629046 72268373 71913230 71573085 71266562 71003723 70786422 70560730 70272106 69980597 69769055
$$ packed form
3234.8H9685100j73866j63347j47420j37419j21414j21820j41293j38623j13862j04499
3255.2H8321537j13356j22172j17028j02913r3615q2195p1442r1702j24824j37347
3275.6H7264943j42783j39743j27125j24442j32776j32918j15359j15037j51592j83189
3296H5899979j94574j94698j66571j32716j56671k35504k94280k94757k64412k49874
3316.4H3715922k61999k77447k77430k72840k99847l37327l39729l26240l15106l04514
3336.8H0703443l26013l72219l94446m00174l90708l62957l80736m41927m61352m30846
3357.2G6742065m04912m12602m25761l98893l65710l95411m61471m66901m10056l71302
3377.6G2629046l60673l55143l40145l06523k62839k17301k25692k88624k91509k11542
$$ plain form
3398 69769055 69602740 69371545 69070876 68806666 68611562 68435836 68250388 68053389 67859262 67697507
3418.4 67697507 67566139 67445880 67347753 67284644 67246550 67209715 67187214 67200631 67205715 67173648 67146641
3440.8 67146641 67163748 67223173 67303687 67396188 67504406 67628604 67768860 67925686 68096542 68265009
3461.2 68265009 68438965 68657780 68903768 69105446 69244665 69383299 69570822 69798779 70026314 70219278
3481.6 70219278 70404303 70619124 70837969 71047598 71276748 71521854 71762246 71991843 72222948 72466427
3502 72466427 72698039 72906953 73121667 73365974 73641360 73917234 74166781 74404752 74660158 74940228
3522.4 74940228 75208539 75448298 75699383 75986195 76293987 76605326 76903987 77188212 77490926 77824891
3542.8 77824891 78147876 78428298 78706217 79012656 79331893 79653752 79978770 80318373 80673480 81004268
$$ packed form
3398F9769055j66315k31195l00669k64210j95104j75726j85448j96999j94127j61755
3418.4F7697507j31368j20259r8127o3109l8094l6835k2501J3417N084l2067k7007
3440.8F7146641J7107N9425Q0514R2501J08218J24198J40256J56826J70856J68467
3461.2F8265009J73956K18815K45988K01678J39219J38634J87523K27957K27535J92964
3481.6G0219278J85025K14821K18845K09629K29150K45106K40392K29597K31105K43479
3502G2466427K31612K08914K14714K44307K75386K75874K49547K37971K55406K80070
3522.4G4940228K68311K39759K51085K86812L07792L11339K98661K84225L02714L33965
3542.8G7824891L22985K80422K77919L06439L19237L21859L25018L39603L55107L30788
$$ plain form
3563.2 81004268 81293684 81627357 82061577 82509124 82916874 83315730 83721203 84142262 84592104 85040653
3583.6 85040653 85440677 85823405 86273313 86752009 87198317 87648880 88128024 88601875 89061928 89504802
3604 89504802 89905167 90294558 90715122 91148818 91583514 91994399 92372835 92789376 93239063 93627805
3624.4 93627805 93897992 94115925 94457054 94871271 95233256 95545554 95828736 96092278 96330762 96509999
3644.8 96509999 96614069 96723032 96950454 97223407 97422498 97600454 97823966 98009622 98122007 98206252
3665.2 98206252 98242301 98219204 98237538 98271662 98255467 98334539 98510164 98664415 98784417 98857045 98857927
3687.6 98857927 98850805 98938930 99078286 99177110 99225730 99244940 99261099 99319017 99385864 99380565 99304539 99276268
3712.1 99276268 99369693 99482286 99526370 99515873 99496514 99484867 99494845 99529803 99528664 99468058 99412429 99436504
$$ packed form
3563.2H1004268K89416L33673M34220M47547M07750L98856M05473M21059M49842M48549
3583.6H5040653M00024L82728M49908M78696M46308M50563M79144M73851M60053M42874
3604H9504802M00365L89391M20564M33696M34696M10885L78436M16541M49687L88742
3624.4I3627805K70187K17933L41129M14217L61985L12298K83182K63542K38484J79237
3644.8I6509999J04070J08963K27422K72953J99091J77956K23512J85656J12385Q4245
3665.2I8206252L6049k3097J8334L4124j6195P9072J75625J54251J20002P2628Q82
3687.6I8857927p122Q8125J39356R8824M8620J9210J6159N7918O6847n299p6026k8271
3712.1I9276268R3425J12593M4084j0497j9359j1647R978L4958j139o0606n5629K4075
$$ plain form
3736.5 99436504 99543202 99613541 99523956 99383920 99409008 99443358 99394763 99449784 99587351 99658126 99667966
3759 99667966 99702656 99741554 99730837 99700254 99677557 99693495 99757898 99812198 99819046 99799907 99797207 99802274 99802893
3785.5 99802893 99819314 99843049 99852169 99829382 99786335 99760294 99713337 99661148 99688631 99707335 99708134 99775428
3810 99775428 99836564 99798530 99707687 99666244 99624538 99623227 99717844 99782252 99788839 99774009 99763381 99767017 99716818
3836.5 99716818 99633259 99634850 99700940 99777490 99851269 99871093 99753255 99509430 99449003 99634707 99788195
3858.9 99788195 99814159 99758410 99720848 99721652 99691880 99684203 99741006 99800086 99824345 99787593 99759883 99775618
3883.4 99775618 99779814 99811459 99833906 99803555 99817234 99868250 99853843 99775994 99710244 99704003 99777645 99882698
3907.9 99882698 99943775 99960023 99945885 99901539 99868524 99878949 99904042 99918878 99941629 99960124 99948472 99939430
$$ packed form
3736.5I9436504J06698P0339q9585j40036K5088L4350m8595N5021J37567P0775R840
3759I9667966L4690L8898j0717l0583k2697J5938O4403N4300O848j9139k700N067O19
3785.5I9802893J6421K3735R120k2787m3047k6041m6957n2189K7483J8704P99O7294
3810I9775428O1136l8034r0843m1443m1706j311R4617O4408O587j4830j0628L636n0199
3836.5I9716818q3559J591O6090P6550P3779J9824j17838k43825o0427J85704J53488
3858.9I9788195K5964n5749l7562Q04k9772p677N6803N9080K4259l6752k7710J5735
3883.4I9775618M196L1645K2447l0351J3679N1016j4407p7849o5750o241P3642J05053
3907.9I9882698O1077J6248j4138m4346l3015J0425K5093J4836K2751J8495j1652r042
$$ plain form
3932.3 99939430 99962950 99992836 100005126 99999964 99990124 100000000 100012803 100007474 100010324 100030351 100047362 100053501 100059164
3958.9 100059164 100065994 100075352 100090599 100097597 100094283 100093246 100097954 100113583 100137603 100153553 100163484 100178826 100189364
3985.4 100189364 100187790 100192177 100210822 100222981 100219834 100222194
3997.6 100222194
$$ packed form
3932.3I9939430K3520K9886J2290n162r840R876J2803n329K850K0027J7011O139N663
3958.9A00059164O830R358J5247O998l314j037M708J5629K4020J5950R931J5342J0538
3985.4A00189364j574M387J8645J2159l147K360
3997.6A00222194
##END=$$ End of the data block
