##TITLE=2 meg-mac $$ Begin of the data block
##JCAMP-DX=5.00 $$ ACD/SpecManager v 10.08
##SPECTROMETER/DATA SYSTEM=Alpha
##DATE=16 Oct 2013 11:49:50
##DATA TYPE=INFRARED SPECTRUM
##DATA CLASS=XYDATA
##ORIGIN=
##OWNER=
##NPOINTS=1765
##FIRSTX=399.75695801
##LASTX=3997.56933594
##MAXX=3997.56933594
##MINX=399.75695801
##MAXY=0.83517843
##MINY=0.31478351
##XFACTOR=1.0000000000
##YFACTOR=1.000000000000000e-9
##FIRSTY=0.56749272
##DELTAX=2.03957629
##XUNITS=1/CM
##YUNITS=ARBITRARY UNITS
##XYDATA=(X++(Y..Y))
399.8E67492723l160953k954602k266228n06819J243174J819790J509309J162648M71949
418.1E64810991r67979j619220j955271k675533k739370k259910j894593j604974j132131
436.5E47962010j18911J454651K998173L753543L437042K430797J451612R17136N03302
454.8E64789355l07679j307190j878202k322078k591192k640963k967775l376364l322125
473.2E44075787k728343j972377j248658p42376o43015o10351k29180P4565k12550
491.5E35763502r14633j590669j880169j703322j550615j966059k855241l420413l165007
509.9E16717374k838373l037333l664494m180849l819108k695947j428396m36276K42084
528.3D94858682Q84772J805186L110409M471302N257427N008400L857851K362489J003445
$$ y = [567492723, 564331770, 561377168, 559110940, 558604121, 559847295, 561667085, 563176394, 564339042, 564810991, 563843012, 562223792, 560268521, 557592988, 554853618, 552593708, 550699115, 549094141, 547962010, 547843099, 549297750, 552295923, 556049466, 559486508, 561917305, 563368917, 564286053, 564789355, 564481676, 563174486, 561296284, 558974206, 556383014, 553742051, 550774276, 547397912, 544075787, 541347444, 539375067, 538126409, 537384033, 536741018, 536130667, 535901487, 535976052, 535763502, 534848869, 533258200, 531378031, 529674709, 528124094, 526158035, 523302794, 519882381, 516717374, 513879001, 510841668, 507177174, 502996325, 499177217, 496481270, 495052874, 494616598, 494858682, 495743454, 497548640, 500659049, 505130351, 510387778, 515396178, 519254029, 521616518, 522619963]
546.6E22619963j96457j263440k012133k446592k684415k988636l784955m868090n534261
565D96840984n800337n602628m592866k941489p12633J837522M097402N690634O409288
583.3D95225877O248205N445064M222095K869904J660645P29322p272n22375o10053
601.7E15261412k82824K01165N14686N77391O46174J153171K102673L002703L347754
620E26524305L248752L241598L393829L473520L135324K280056J462937J265704J562715
638.4E49588740J821637J607060J041294P32004R20832J357496J565218J135111M00960
656.7E60170352J55867N36084J038790J284897J326501O93083L04520J059711J738668
675.1E68308473J688957J122653Q05080J114846J496136J339853N69105l38197q19027
$$ y = [522619963, 522423506, 521160066, 519147933, 516701341, 514016926, 511028290, 507243335, 502375245, 496840984, 491040647, 485438019, 480845153, 477903664, 477191031, 479028553, 483125955, 488816589, 495225877, 501474082, 506919146, 511141241, 514011145, 515671790, 516401112, 516393840, 515871465, 515261412, 514978588, 515179753, 515694439, 516271830, 516918004, 518071175, 520173848, 523176551, 526524305, 529773057, 533014655, 536408484, 539882004, 543017328, 545297384, 546760321, 548026025, 549588740, 551410377, 553017437, 554058731, 554790735, 555711567, 557069063, 558634281, 559769392, 560170352, 560326219, 560862303, 561901093, 563185990, 564512491, 565205574, 565510094, 566569805, 568308473, 569997430, 571120083, 571925163, 573040009, 574536145, 575875998, 576445103, 576106906, 575287879]
693.5E75287879q77679j085460j782715k565682k741695k020895o40035P83026J712680
711.8E66069424K265215L003836M142344N284786N754411N427599M838109M448891
728.1F01234615M430711M323542L642142K512038J351178P93159P28070K36392j128792
746.5F18123055k876044m011214m102766l773153l707230l861547l645479k476692
762.8E89668930k52605K399325M410565N429745O154537P126987P854641P494330O071925
781.2F36358380M519165L767252L959775M343808M032850L125608K624869L251553
797.5F65983260M458844M895151L932834K298951J295090J403629J900554J786888
813.8F87955201Q16404k74658n31614j21653k04324j381278l083408m274369m400849
$$ y = [575287879, 574410200, 573324740, 571542025, 568976343, 566234648, 564213753, 563573718, 564356744, 566069424, 568334639, 571338475, 575480819, 580765605, 586520016, 591947615, 596785724, 601234615, 605665326, 609988868, 613631010, 616143048, 617494226, 618287385, 619015455, 619251847, 618123055, 615247011, 611235797, 607133031, 603359878, 599652648, 595791101, 592145622, 589668930, 589416325, 591815650, 596226215, 601655960, 607810497, 614937484, 622792125, 630286455, 636358380, 640877545, 644644797, 648604572, 652948380, 656981230, 660106838, 662731707, 665983260, 670442104, 675337255, 679270089, 681569040, 682864130, 684267759, 686168313, 687955201, 688771605, 688496947, 687965333, 687843680, 687639356, 686258078, 683174670, 678900301, 674499452]
832.1F74499452l968835m000604m651904n136848m817247l780723k698838k323747
848.5F43120706k722084l302038l418267k817452j799166k93732K237857N537331Q608818
866.8F45151973J0517061J0624110R070337O690383M237711K010405j51455k450585
883.1F85699940m727900o360174o770253o247580n631685n351782n355298n399287
899.4F39855981n295694n287409n862415p095039q445024r310961r453952r016931
915.8E80088556q294642p301986n798519l786385j761198k97845M31300O75261R62853
934.1E54917395J749933K952397L964066L947735K221704j076162m968643q561314
950.4E55147111j1545240j3867081j5475154j6328752j6565710j6640902j6957998
$$ y = [674499452, 670530617, 666530013, 661878109, 656741261, 651924014, 648143291, 645444453, 643120706, 640398622, 637096584, 633678317, 630860865, 629061699, 628767967, 631005824, 636543155, 645151973, 655669034, 666293144, 675363481, 682053864, 686291575, 688301980, 688150525, 685699940, 680972040, 674611866, 667841613, 661594033, 655962348, 650610566, 645255268, 639855981, 634560287, 629272878, 623410463, 616315424, 607870400, 598559439, 589105487, 580088556, 571793914, 564491928, 558693409, 554907024, 553145826, 552847981, 553279281, 553954542, 554917395, 556667328, 559619725, 563583791, 567531526, 569753230, 568677068, 563708425, 555147111, 543601871, 529734790, 514259636, 497930884, 481365174, 464724272, 447766274]
964.7D47766274j7480105j7772675j7461866j6637683j5532910j4097363j2183666
979C36600006r697646o755263l863364j500219J57445J204998J896262K358496K570271
997.3C22970986K496481K117813J574218J050770N98938K48849L904p8469J24722O28621
1017.7C31736833J292139J927197K409727K730935K937019L033459K964110K647340
1034.1C51678759K102703J466632R62138P84427R35137J201659J426399J721323K308368
1052.4C64587545L280133M458458N595952O677300P747680Q309334P237643L536165
1068.7D11430210k225995p351339r163559p475584m195005j142532J009763K384931
1085C83270890L308326M048436M661173M876554M381657L247738K028316J204163Q66145
$$ y = [447766274, 430286169, 412513494, 395051628, 378413945, 362881035, 348783672, 336600006, 326902360, 320147097, 316283733, 314783514, 314940959, 316145957, 318042219, 320400715, 322970986, 325467467, 327585280, 329159498, 330210268, 330809206, 331058055, 331061959, 330983490, 331108212, 331736833, 333028972, 334956169, 337365896, 340096831, 343033850, 346067309, 349031419, 351678759, 353781462, 355248094, 356210232, 356994659, 357929796, 359131455, 360557854, 362279177, 364587545, 367867678, 372326136, 377922088, 384599388, 392347068, 400656402, 407894045, 411430210, 409204215, 401852876, 392689317, 385213733, 381018728, 379876196, 380885959, 383270890, 386579216, 390627652, 395288825, 400165379, 404547036, 407794774, 409823090, 411027253, 411893398]
1103.4D11893398R42736J326889J928598K643794L294915L604531L363699K748489
1119.7D31747049K239436K192557K655715L399074L980696L897309K931625J239329
1136D54282790r81271l454417n634636o955415p200300o573439n529135m467219l502399
1154.4D09984559k506167j322746J7524J344889K607554L948748N527616P373094R274483
1172.7D36249554J0858506J1831433J2226134J2330115J2259603J1860519J0936678
1187E18552542R444296P625043N911112M528582L333688K179682J312674J125872J656472
1205.4E55669963K590061L488004L989100M096806M055381L916741L480851K534926
1221.7E83821833J157761j76668r72391j207828j266122j402438j527428j423061r36926
$$ y = [411893398, 412836134, 414163023, 416091621, 418735415, 422030330, 425634861, 428998560, 431747049, 433986485, 436179042, 438834757, 442233831, 446214527, 450111836, 453043461, 454282790, 453301519, 449847102, 444212466, 437257051, 430056751, 423483312, 417954177, 413486958, 409984559, 407478392, 406155646, 406173170, 407518059, 410125613, 414074361, 419601977, 426975071, 436249554, 447108060, 458939493, 471165627, 483495742, 495755345, 507615864, 518552542, 527996838, 535621881, 541532993, 546061575, 549395263, 551574945, 552887619, 554013491, 555669963, 558260024, 561748028, 565737128, 569833934, 573889315, 577806056, 581286907, 583821833, 584979594, 584802926, 583830535, 582622707, 581356585, 579954147, 578426719, 577003658, 576066732]
1240.1E76066732j63853N09799Q65936J101553J469136J946985K247632K148688J775265
1258.4E87967873J477778J515746J835107K119065K085030J743495J341403J051724
1274.7F01137221Q15153M48942m3452l81350l89636k35736k46584n74351j094699j530707
1295.1E97904801j632690j396477j053393q00669o81997o71863p23839q24988r96709
1313.5E89122176j260996j599550j908421k129317k419054k907753l422618l681839
1329.8E69792628l546178l035903k362728j800418j398861j024604o89686n14328n44429
1348.1E54875493p69257j104713j430094j591981j527726j435459j524389j554847
1364.5E43937027j330971j016677n90741k00928k9981K8253R7573J39057L83616J181185
$$ y = [576066732, 575902879, 576412678, 577278614, 578380167, 579849303, 581796288, 584043920, 586192608, 587967873, 589445651, 590961397, 592796504, 594915569, 597000599, 598744094, 600085497, 601137221, 601952374, 602401316, 602357864, 601976514, 601586878, 601351142, 601104558, 600530207, 599435508, 597904801, 596272111, 594875634, 593822241, 593021572, 592339575, 591667712, 590943873, 590118885, 589122176, 587861180, 586261630, 584353209, 582223892, 579804838, 576897085, 573474467, 569792628, 566246450, 563210547, 560847819, 559047401, 557648540, 556623936, 555934250, 555419922, 554875493, 554106236, 553001523, 551571429, 549979448, 548451722, 547016263, 545491874, 543937027, 542606056, 541589379, 540998638, 540797710, 540767729, 540795982, 540893555, 541032612, 541416228, 542597413]
1384.9E42597413K122521K326131J848758J273870O21796j0491m65691o34610o56367
1403.2E49023330p69377q79883r84848j087069j004756p13587n14149m00007p1347
1421.6E42598307K17974L69847N19872N95927O44982O80327O45340O87539Q29399R29058
1442E48718572Q66949N79655N0962n01513q88646j140594j595319j607716m35173O13391
1462.4E44660568J690507L170073M599810O157338Q156419Q731365P928908P346392
1478.7E92441380O973267O579160N950094N489945N219698M715145L828644L277302
1495F34474635L145397K838731K447366K055943J659930J289129R10819O24776N17189
1513.4F49963915N85258Q21054J028002J139998J135528R55463O91175M90069L53158
$$ y = [542597413, 544719934, 547046065, 548894823, 550168693, 550790489, 550779998, 550314307, 549679697, 549023330, 548253953, 547374070, 546389222, 545302153, 544297397, 543583810, 543069661, 542669654, 542598307, 542816281, 543186128, 543706000, 544301927, 544946909, 545627236, 546272576, 546960115, 547789514, 548718572, 549585521, 550165176, 550216138, 549714625, 548825979, 547685385, 546090066, 544482350, 544047177, 544660568, 546351075, 549521148, 554120958, 560278296, 568434715, 577166080, 585094988, 592441380, 599414647, 605993807, 611943901, 617433846, 622653544, 627368689, 631197333, 634474635, 637620032, 640458763, 642906129, 644962072, 646622002, 647911131, 648821950, 649446726, 649963915, 650549173, 651370227, 652398229, 653538227, 654673755, 655629218, 656320393, 656810462, 657163620]
1531.7F57163620K32875L22700K93732o0261k53498j20521o6042r0360k45393m41909
1552.1F56734943n79893p24137j405239j985848j358867j338303j635730j906932k083241
1570.5F43716753j647771j562238j981139j624167j143992j157462j177371j156151
1586.8F32266462j176000j236915j266838j340985j465022j630605j900851k186358
1603.1F20062888k387882k588570k910197l103256l127992l578603m092395l285707
1619.4E94988286k988815l773272m001796l955066l946305l415644l261566l804564
1635.7E65841258k985478j536608p56204k55882P5578O15955J057624J375437K273560
1654.1E65705240K664804K628684K956152L542364M029214L997863M275143M899502
$$ y = [657163620, 657396495, 657719195, 658012927, 657952666, 657699168, 657578647, 657512605, 657422245, 657176852, 656734943, 656155050, 655430913, 654025674, 652039826, 650680959, 649342656, 647706926, 645799994, 643716753, 642068982, 640506744, 638525605, 636901438, 635757446, 634599984, 633422613, 632266462, 631090462, 629853547, 628586709, 627245724, 625780702, 624150097, 622249246, 620062888, 617675006, 615086436, 612176239, 609072983, 605944991, 602366388, 598273993, 594988286, 591999471, 588226199, 584224403, 580269337, 576323032, 572907388, 569645822, 565841258, 562855780, 561319172, 560562968, 560307086, 560382664, 560998619, 562056243, 563431680, 565705240, 568370044, 570998728, 573954880, 577497244, 581526458, 585524321, 589799464, 594698966]
1670.4E94698966M833936N077183N606235N389928N107344N399346O453872O238997
1686.7F38805807N568206N789161N649030O020486O422222N970538O088554N122364
1703F85436368M105866L852069L371895L028690K847910K698601K751648K644777K185464
1721.4G12923288J800239J571775J333177J089633P30156L52204L37065M85658N89967
1739.7G21213162R67145J562357K275526L175736M162550M741907M489601M259705
1756.1G46847689M091382L668785L454566L053248K535045K218962J972199J944840
1772.4G69786716J895606J551986J296103J246214J277089J290798J207352J036048
1788.7G80587912Q71241R19819J070559J054823R15766Q14616Q19684R22799J018345
$$ y = [594698966, 599532902, 604610085, 610216320, 615606248, 620713592, 626112938, 632566810, 638805807, 644374013, 650163174, 655812204, 661832690, 668254912, 674225450, 680314004, 685436368, 689542234, 693394303, 696766198, 699794888, 702642798, 705341399, 708093047, 710737824, 712923288, 714723527, 716295302, 717628479, 718718112, 719448268, 719800472, 720137537, 720623195, 721213162, 722180307, 723742664, 726018190, 729193926, 733356476, 738098383, 742587984, 746847689, 750939071, 754607856, 758062422, 761115670, 763650715, 765869677, 767841876, 769786716, 771682322, 773234308, 774530411, 775776625, 777053714, 778344512, 779551864, 780587912, 781459153, 782378972, 783449531, 784504354, 785420120, 786234736, 787054420, 787977219, 788995564]
1807G88995564R33051P45475O40452P00236Q12888Q47161P58290O04093N27084N97894
1827.4G96162188O86169O66678N37812L92855L96132N06044N13017L93808K96592K45452
1847.8H00796747K81632L94821L96431K97129K18272K34723K98739L25918K90155K36094
1868.2H03770661K41459L02493L49462L56794L39269K94447K87414L62337M28497L84748
1888.6H07117581K98262K52903K35259K49803K77996K89619K29061J47044J33396J51455
1909H09382379J65224J88708J80960J22368J32502K13384K42055J95741J23442P1823
1929.4H11018586Q6606J45971J71543J46150J00076Q2672J27673J96874J91212J38640
1949.8H12406003J30475J54078J96457K41697K27749J52946J24752J55747J82986J75774
$$ y = [788995564, 789928615, 790674090, 791314542, 792014778, 792827666, 793674827, 794433117, 795037210, 795564294, 796162188, 796848357, 797515035, 798052847, 798445702, 798841834, 799347878, 799860895, 800254703, 800551295, 800796747, 801078379, 801473200, 801869631, 802166760, 802385032, 802619755, 802918494, 803244412, 803534567, 803770661, 804012120, 804314613, 804664075, 805020869, 805360138, 805654585, 805941999, 806304336, 806732833, 807117581, 807415843, 807668746, 807904005, 808153808, 808431804, 808721423, 808950484, 809097528, 809230924, 809382379, 809547603, 809736311, 809917271, 810039639, 810172141, 810385525, 810627580, 810823321, 810946763, 811018586, 811105192, 811251163, 811422706, 811568856, 811668932, 811751604, 811879277, 812076151, 812267363, 812406003, 812536478, 812690556, 812887013, 813128710, 813356459, 813509405, 813634157, 813789904, 813972890, 814148664]
1970.2H14148664J22905O3420O7293J36495J68145J08540K4616N663M9710R5368Q3744
1992.6H15074563K7657o378j907J0788r418o7174j58072k13027j84714j55449k02596
2015.1H14114273k78831l26931l34800k78651k49267l13461l79622l84629l51131k90334
2035.5H10926616k60114l10660l37303k51054j50860j54853j75714j23739m9830M530
2055.9H09117019L2306J6332r895J5557P2300Q7083L5643j9013r895N2333J00970R5010
2080.3H09585750M7505L219J1861R0063J59025J04129M530l517P7784J78874K00689
2102.8H10459912J00672L278J8776J05679J66893R6023m1425q0169M650R9182Q7023
2125.2H11020494j6332j07587q9645J7464R6917O1930m8042j00851l7849Q4996J37032
$$ y = [814148664, 814271569, 814334989, 814402282, 814538777, 814706922, 814815462, 814840078, 814845741, 814895451, 814990819, 815074563, 815102220, 815095842, 815093935, 815104723, 815095305, 815028131, 814870059, 814657032, 814472318, 814316869, 814114273, 813835442, 813508511, 813173711, 812895060, 812645793, 812332332, 811952710, 811568081, 811216950, 810926616, 810666502, 810355842, 810018539, 809767485, 809616625, 809461772, 809286058, 809162319, 809112489, 809117019, 809149325, 809165657, 809155762, 809171319, 809243619, 809330702, 809366345, 809347332, 809337437, 809389770, 809490740, 809585750, 809633255, 809636474, 809648335, 809738398, 809897423, 810001552, 810006082, 810002565, 810080349, 810259223, 810459912, 810560584, 810563862, 810582638, 810688317, 810855210, 810951233, 810909808, 810829639, 810834289, 810933471, 811020494, 811004162, 810896575, 810806930, 810824394, 810921311, 810983241, 810935199, 810834348, 810796499, 810881495, 811018527]
2147.7H11018527N5730m4882k2293J08004K27451K53320J90437J36852J92642L33667
2168H12449455M33922M20749L43561K92540L33250M32133M55201L59118K63333K76923
2188.4H16060185L75331M54366M01378K50697J97589K97129M11213M34697L74138K93136
2208.8H19549859K66075L03507L46303L47435K92420K10524K03609L07203L66688K84075
2229.2H22477698J61290Q4579J05024K21014K81513J91807P3254P4506J84238K76625
2249.6H24131548K47837J24931L2663P7427K22742L13759K44379Q4698K1398J25528
2270H25626910K62201K65777J35481q34q166J32203K72631K82825J89542J00911J44005
2292.5H27403486L09169L97325L10003J54794J45912L33011N15401N46873L98099J81497
$$ y = [811018527, 811074257, 811029375, 811007082, 811115086, 811342537, 811595857, 811786294, 811923146, 812115788, 812449455, 812883377, 813304126, 813647687, 813940227, 814273477, 814705610, 815160811, 815519929, 815783262, 816060185, 816435516, 816889882, 817291260, 817541957, 817739546, 818036675, 818447888, 818882585, 819256723, 819549859, 819815934, 820119441, 820465744, 820813179, 821105599, 821316123, 821519732, 821826935, 822193623, 822477698, 822638988, 822723567, 822828591, 823049605, 823331118, 823522925, 823596179, 823670685, 823854923, 824131548, 824379385, 824504316, 824536979, 824614406, 824837148, 825150907, 825395286, 825479984, 825501382, 825626910, 825889111, 826154888, 826290369, 826289535, 826281369, 826413572, 826686203, 826969028, 827158570, 827259481, 827403486, 827712655, 828109980, 828419983, 828574777, 828720689, 829053700, 829569101, 830115974, 830514073, 830695570]
2312.9H30695570J53899M03642O86169O94633M27782K10881K34127L27647K03490j17659
2333.3H33920181k56002j07348J07407J22071l10958j084625j162649k48789Q47280
2351.6H31826568J432776J250744O68347%m56691o88910r50873j228452j399279j409888
2372H29044342j232445j091123j163602j236558j113951q35538n21123l21627l14414
2390.4H21213961l67999l27588k13563j35660j84417l49760m73797m22180k97487k64346
2410.8H18177164l51966m78923n25475m65989l90827m21167n62668o62744o06715m72248
2431.2H13238442m27842n31852o69241o94514o09338n23031n18441n93603p01427p25806
2451.5H07243347n93662m77731n42879o62983o56724n48482m55677m38214n05507o21020
$$ y = [830695570, 830849469, 831253111, 831939280, 832633913, 833061695, 833272576, 833506703, 833834350, 834037840, 833920181, 833664179, 833556831, 833664238, 833786309, 833475351, 832390726, 831228077, 830979288, 831826568, 833259344, 834510088, 835178435, 835178435, 834721744, 834032834, 833081961, 831853509, 830454230, 829044342, 827811897, 826720774, 825557172, 824320614, 823206663, 822371125, 821850002, 821528375, 821213961, 820845962, 820518374, 820304811, 820169151, 819984734, 819634974, 819161177, 818738997, 818441510, 818177164, 817825198, 817346275, 816820800, 816354811, 815963984, 815542817, 814980149, 814317405, 813710690, 813238442, 812810600, 812278748, 811609507, 810914993, 810305655, 809782624, 809264183, 808670580, 807969153, 807243347, 806649685, 806171954, 805629075, 804966092, 804309368, 803760886, 803305209, 802866995, 802361488, 801740468]
2471.9H01740468o56367n54800m28855m01497n05448n89132n05388l75986l55363m16994
2492.3G96950638m98473n34714m44352l02613k87414m04656n01334m76420l51906k72214
2512.7G92876542l55542m99845n46813n00619m35770m12762n00858o42180o40094n17190
2533.1G87824869m93765n95033o96361p29144o94573o28590n90086o39200p09415o88374
2553.5G81360328o09338n68867n88238o40571o82473o55532n70238n25951n76675o54400
2573.9G75288045o83069o44147n52953n10036n60999o00040n68509m74513l95715m43399
2594.3G69854665n42760n76437n46991m91679m97818o02484p07030p43628p26223p13944
2614.7G63705671p79748r02474r81689r81748r57369r68099j057506j175701j213789
$$ y = [801740468, 801084101, 800529301, 800100446, 799698949, 799193501, 798604369, 798098981, 797722995, 797367632, 796950638, 796452165, 795917451, 795473099, 795170486, 794883072, 794478416, 793977082, 793500662, 793148756, 792876542, 792521000, 792021155, 791474342, 790973723, 790537953, 790125191, 789624333, 788982153, 788342059, 787824869, 787331104, 786736071, 786039710, 785310566, 784615993, 783987403, 783397317, 782758117, 782048702, 781360328, 780750990, 780182123, 779593885, 778953314, 778270841, 777615309, 777045071, 776519120, 775942445, 775288045, 774604976, 773960829, 773407876, 772897840, 772336841, 771736801, 771168292, 770693779, 770298064, 769854665, 769311905, 768735468, 768188477, 767696798, 767198980, 766596496, 765889466, 765145838, 764419615, 763705671, 762925923, 762023449, 761041760, 760060012, 759102643, 758134544, 757077038, 755901337, 754687548]
2633.1G54687548j156628j086653j119733j238465j284659j213372j125872j085818
2649.4G45376348j112878j183450j184881j101255j056135j098335j145720j147390
2665.7G36346304j101672r96530r13680r37343r92119r95099r39191q47041q08120
2684.1G27815509q64685r35375r26555q47041q11279q72016r36806r72569r92775r42111
2704.5G18714297r04799r72747j034260j011789r56953r30905r47475r70960r62079
2722.8G10022330r29117q80837q44300q47578q76308q85904q30054p73310p75278p74443
2743.2G01605201p41601p09415o86526o83546p06792p25269p15435o72638o15359o08384
2763.6F94740236o65069o94036o66678o58870o98030p73489q66831r13143r19521r57787
$$ y = [754687548, 753530920, 752444267, 751324534, 750086069, 748801410, 747588038, 746462166, 745376348, 744263470, 743080020, 741895139, 740793884, 739737749, 738639414, 737493694, 736346304, 735244632, 734248102, 733334422, 732397079, 731404960, 730409861, 729470670, 728623629, 727815509, 726950824, 726015449, 725088894, 724241853, 723430574, 722558558, 721621752, 720649183, 719656408, 718714297, 717809498, 716836751, 715802491, 714790702, 713833749, 712902844, 711955369, 710984409, 710022330, 709093213, 708212376, 707368076, 706520498, 705644190, 704758286, 703928232, 703154922, 702379644, 701605201, 700863600, 700154185, 699467659, 698784113, 698077321, 697352052, 696636617, 695963979, 695348620, 694740236, 694075167, 693381131, 692714453, 692055583, 691357553, 690584064, 689717233, 688804090, 687884569, 686926782]
2784F86926782j016319j062929j113952j178085j245976j302659j340747j402796j496970
2802.3F75766349j569987j611590j647055j721799j812697j864612j946270k063275
2818.7F61529064k119124k138674k189577k288878k437412k572179k654731k756000
2835F42372489k953887l283381l771008m359781m944623n407572n525052n091488m094899
2853.3F02940798k766013j527369q15094q21710j338481j998067k588630l018975l232837
2871.7E84833622l257871l188550l041089k799391k549291k339721k121806j877904
2888E63657999j617312j381398j249611j254141j338721j441180j588166j840830k250075
2906.4E49696565k811194l452480m104197m706561n101800n066574m535734l568173
$$ y = [686926782, 685910463, 684847534, 683733582, 682555497, 681309521, 680006862, 678666115, 677263319, 675766349, 674196362, 672584772, 670937717, 669215918, 667403221, 665538609, 663592339, 661529064, 659409940, 657271266, 655081689, 652792811, 650355399, 647783220, 645128489, 642372489, 639418602, 636135221, 632364213, 628004432, 623059809, 617652237, 612127185, 607035697, 602940798, 600174785, 598647416, 597832322, 597010612, 595672131, 593674064, 591085434, 588066459, 584833622, 581575751, 578387201, 575346112, 572546721, 569997430, 567657709, 565535903, 563657999, 562040687, 560659289, 559409678, 558155537, 556816816, 555375636, 553787470, 551946640, 549696565, 546885371, 543432891, 539328694, 534622133, 529520333, 524453759, 519918025, 516349852]
2922.7E16349852k278924q55148N17547J720906K792477L791869M615486N117952N321622
2941E37093639N310834N096257M727363M348993M038930L721357L469944L519296L834606
2959.4E75161219M141450M278898M301190M317999M325748M245638M027725L717899
2975.7F08517766L423750L154040K851665K510726K161682J836598J559377J276493
2992F27292097Q94069M56393l934m49538p80046j039445j207948j191855j092910j073242
3012.4F21803641j129090j162410j190067j301407j488746j682818j831412j900375
3028.7F10117316j913488j958370k124369k300441k280593k143920k138614k334178
3045.1E92923343k499282k447784k350390k359808k384245k403378k420009k351403
$$ y = [516349852, 514070928, 513215780, 513733327, 515454233, 518246710, 522038579, 526654065, 531772017, 537093639, 542404473, 547500730, 552228093, 556577086, 560616016, 564337373, 567807317, 571326613, 575161219, 579302669, 583581567, 587882757, 592200756, 596526504, 600772142, 604799867, 608517766, 611941516, 615095556, 617947221, 620457947, 622619629, 624456227, 626015604, 627292097, 628186166, 628642559, 628638625, 628189087, 627409041, 626369596, 625161648, 623969793, 622876883, 621803641, 620674551, 619512141, 618322074, 617020667, 615531921, 613849103, 612017691, 610117316, 608203828, 606245458, 604121089, 601820648, 599540055, 597396135, 595257521, 592923343, 590424061, 587976277, 585625887, 583266079, 580881834, 578478456, 576058447, 573707044]
3061.4E73707044k249479k196968k225041k290845k286434k224148k105176j982272
3077.7E56146681k044439k206326k247750k222300k145111k036512k102554k215862
3094E38925827k136827j968145j918435k029658k100050j998186j897216j943171j944721
3112.4E20989418j806915j782834j903355k020956k100706k069532j943231j852870
3128.7E05509019j862764j891435j815498j686960j668513j807749j891553j784623
3145D91099924j679599j633704j549721j586705j773149j805544j682937j605630j586318
3163.4D76196617j567096j539558j521587j489192j469404j477629j476258j445830
3179.7D64210063j396894j378387j388491j380443j358748j315862j253903j240819
$$ y = [573707044, 571457565, 569260597, 567035556, 564744711, 562458277, 560234129, 558128953, 556146681, 554102242, 551895916, 549648166, 547425866, 545280755, 543244243, 541141689, 538925827, 536789000, 534820855, 532902420, 530872762, 528772712, 526774526, 524877310, 522934139, 520989418, 519182503, 517399669, 515496314, 513475358, 511374652, 509305120, 507361889, 505509019, 503646255, 501754820, 499939322, 498252362, 496583849, 494776100, 492884547, 491099924, 489420325, 487786621, 486236900, 484650195, 482877046, 481071502, 479388565, 477782935, 476196617, 474629521, 473089963, 471568376, 470079184, 468609780, 467132151, 465655893, 464210063, 462813169, 461434782, 460046291, 458665848, 457307100, 455991238, 454737335, 453496516]
3196D53496516j264990j277893j259625j200885j149625j129925j076907j016944j056135
3214.3D43063587j101822j069516j036942j023858j024992j039386r98556q66115p79927
3232.7D34122473r17554j110554j084089r49621q75414q32200q36044r21905r64254
3251.1D25630838q75891p92980q20756q59678q14884p42197p24793p20918o78033p03603
3271.4D17897105p98255q33601q05258p48426o96123o79195o69747o23256n66692n73188
3291.8D10903364o20335o68883p30902p27862o12349n00530n50925p40946q91834r44615
3312.2D03914183r08225q41320q29220q22574p86125q06868r30280j014352r72479
3330.6C96002740r40472r24409q65638r23842j077145j101792j066089j026571r29057
$$ y = [453496516, 452231526, 450953633, 449694008, 448493123, 447343498, 446213573, 445136666, 444119722, 443063587, 441961765, 440892249, 439855307, 438831449, 437806457, 436767071, 435768515, 434902400, 434122473, 433204919, 432094365, 431010276, 430060655, 429185241, 428353041, 427516997, 426595092, 425630838, 424754947, 423961967, 423141211, 422281533, 421466649, 420724452, 419999659, 419278741, 418600708, 417897105, 417098850, 416265249, 415459991, 414711565, 414015442, 413336247, 412666500, 412043244, 411476552, 410903364, 410283029, 409614146, 408883244, 408155382, 407543033, 407042503, 406491578, 405750632, 404858798, 403914183, 403005958, 402164638, 401335418, 400512844, 399726719, 398919851, 397989571, 396975219, 396002740, 395062268, 394137859, 393272221, 392348379, 391271234, 390169442, 389103353, 388076782, 387147725]
3348.9C87147725r78589j202673j287669j144916j009464j018495j035660r37372q87126
3367.3C77645761j082003j361877j358807j094699r27359r23812r86755j006395q65847
3385.7C68038207o19620m24415n20110q45104q77470n10871l12776n97626r19908q30382
3406.1C61579925n79685m58896m41104n12690n36859l89308k67088k77728k34902p0691
3426.5C57810974O8814O2048J20491K59012Q9228k26915j75685J52916L59774L85314
3446.8C58905971L50148L49551M05699M87953O00487P25180O82414N90891P91162R97126
3467.2C64886582P72595M06415M15086O73890R01044R22948P06971O77079Q69184Q79735
3487.6C72111529P82371Q04245Q80778R56029R70572R55045R36270P76470O43402P54178
$$ y = [387147725, 386169136, 384966463, 383678794, 382533878, 381524414, 380505919, 379470259, 378532887, 377645761, 376563758, 375201881, 373843074, 372748375, 371821016, 370897204, 369910449, 368904054, 368038207, 367418587, 366994172, 366474062, 365628958, 364751488, 364240617, 363927841, 363330215, 362410307, 361579925, 361000240, 360541344, 360100240, 359587550, 359050691, 358661383, 358394295, 358116567, 357881665, 357810974, 357879788, 357941836, 358062327, 358321339, 358410567, 358183652, 358007967, 358160883, 358520657, 358905971, 359256119, 359605670, 360011369, 360499322, 361099809, 361824989, 362507403, 363098294, 363889456, 364886582, 365659177, 366065592, 366480678, 367154568, 368055612, 368978560, 369685531, 370362610, 371231794, 372111529, 372893900, 373698145, 374578923, 375534952, 376505524, 377460569, 378396839, 379173309, 379816711, 380570889]
3508C80570889R66906J139700J113356R08613Q48561R97216J198947J208335J024485
3526.4C89977008R54241J039207J173645J339257J357764J225739J345545J592339
3542.7D00004745J535832J304061J276135J392186J478821J593500J736194J847535
3559D12169009J857847J767040J738429J999587K326041K301365K167881K245962K428383
3577.4D31001544K611846K793878K838194K650589K521843K768248K946705K907127
3593.7D53039974K980888L204077L295958L264547L218800L057539L038824L288656
3610D78389263L492952L576695L463924L365308L639698L758073L514320L171980L157258
3628.4E09529471L681183L741205L541887L508746L484667L506601L525555L425121
$$ y = [380570889, 381537795, 382677495, 383790851, 384699464, 385548025, 386545241, 387744188, 388952523, 389977008, 390931249, 391970456, 393144101, 394483358, 395841122, 397066861, 398412406, 400004745, 401540577, 402844638, 404120773, 405512959, 406991780, 408585280, 410321474, 412169009, 414026856, 415793896, 417532325, 419531912, 421857953, 424159318, 426327199, 428573161, 431001544, 433613390, 436407268, 439245462, 441896051, 444417894, 447186142, 450132847, 453039974, 456020862, 459224939, 462520897, 465785444, 469004244, 472061783, 475100607, 478389263, 481882215, 485458910, 488922834, 492288142, 495927840, 499685913, 503200233, 506372213, 509529471, 513210654, 516951859, 520493746, 524002492, 527487159, 530993760, 534519315, 537944436]
3644.7E37944436L247619L309846L651321L548443L210008L384888L618777L338873
3661E65254211K997220K931416K860189K798974L033042K826869K448559K748490K885997
3679.4E90784967K693891K581656K419353K218604K078950K095104K167344K103746
3695.7F09143615J918852J731932J729191J883864J847506J579225J281082J318991
3712F22434258J715959J776635J544655J377940J343190J323641J299381J361013J323103
3730.3F35499775J211226J129747J122653J252055J115621N73039N26130J137555R79721
3748.7F44547522P02858J176775J447200J207054R78708J018942J043200R23515Q39352
3767.1F53885126P88570Q80658J003444R63867Q67903P63834P17759P06017P69854
$$ y = [537944436, 541192055, 544501901, 548153222, 551701665, 554911673, 558296561, 561915338, 565254211, 568251431, 571182847, 574043036, 576842010, 579875052, 582701921, 585150480, 587898970, 590784967, 593478858, 596060514, 598479867, 600698471, 602777421, 604872525, 607039869, 609143615, 611062467, 612794399, 614523590, 616407454, 618254960, 619834185, 621115267, 622434258, 624150217, 625926852, 627471507, 628849447, 630192637, 631516278, 632815659, 634176672, 635499775, 636711001, 637840748, 638963401, 640215456, 641331077, 641904116, 642430246, 643567801, 644547522, 645250380, 646427155, 647874355, 649081409, 650060117, 651079059, 652122259, 653045774, 653885126, 654673696, 655554354, 656557798, 657521665, 658389568, 659153402, 659871161, 660577178, 661347032]
3785.4F61347032Q80599Q50081P62761P14957P07746O91593M42743M16994Q07345P52449
3805.8F68374300O84023Q94785Q30829M72963L57270O00934M75168N01097Q19802P75754
3826.2F74786925O34432N37574N64218O62565M75526L17633N28991O06239N78046O32048
3846.6F80324197N56886J76311k35260L16799R92179P89880M80593L73304M60505M86434
3867F84721828K83122K89440M49061N62787N68688L20852K96414M06921L19779L84926
3887.4F88603818L89994L19957M33624M42565K90513J80661J62304K18570L91364M60804
3907.8F91894174L39746K94209K63750J20402R9539K15590K75731L24727L35991K17616
3928.2F94381475Q9467J41203K77281K66850J93119J61648J86920K97845L29494J90377
$$ y = [661347032, 662227631, 663077712, 663840473, 664555430, 665263176, 665954769, 666397512, 666814506, 667621851, 668374300, 669058323, 669953108, 670783937, 671256900, 671614170, 672215104, 672690272, 673191369, 674011171, 674786925, 675421357, 675958931, 676523149, 677185714, 677661240, 677978873, 678507864, 679114103, 679692149, 680324197, 680881083, 681057394, 680822134, 681138933, 682131112, 682920992, 683401585, 683774889, 684235394, 684721828, 685004950, 685294390, 685743451, 686306238, 686874926, 687195778, 687492192, 687899113, 688218892, 688603818, 688993812, 689313769, 689747393, 690189958, 690480471, 690661132, 690823436, 691042006, 691433370, 691894174, 692233920, 692528129, 692791879, 692912281, 693011820, 693227410, 693503141, 693827868, 694163859, 694381475, 694470942, 694612145, 694889426, 695156276, 695349395, 695511043, 695697963, 695995808, 696325302, 696515679]
3948.6F96515679N8353Q0467K13980K61605J80244J52112J85847K09212K37942K34246
3969F98329687J84715J31667R4652J11878J90675K41041K00927J29760J39534K19703
3989.4F99974239K18391J51038J28687J14620
3997.5G00586975
$$ y = [696515679, 696574032, 696654499, 696868479, 697130084, 697310328, 697462440, 697648287, 697857499, 698095441, 698329687, 698514402, 698646069, 698740721, 698852599, 699043274, 699284315, 699485242, 699615002, 699754536, 699974239, 700192630, 700343668, 700472355, 700586975]
##END=$$ End of the data block
