##TITLE=2 meg-mac $$ Begin of the data block
##JCAMP-DX=5.00 $$ ACD/SpecManager v 10.08
##SPECTROMETER/DATA SYSTEM=Alpha
##DATE=16 Oct 2013 11:49:50
##DATA TYPE=INFRARED SPECTRUM
##DATA CLASS=XYDATA
##ORIGIN=
##OWNER=
##NPOINTS=1765
##FIRSTX=399.75695801
##LASTX=3997.56933594
##MAXX=3997.56933594
##MINX=399.75695801
##MAXY=0.83516294
##MINY=0.31478688
##XFACTOR=1.0000000000
##YFACTOR=1.000000000000000e-9
##FIRSTY=0.56659997
##DELTAX=2.03957629
##XUNITS=1/CM
##YUNITS=ARBITRARY UNITS
##XYDATA=(X++(Y..Y))
399.8 566599965 563399792 560725212 558643401 558094203 559356689 561269879 562869549 563954592 564067006
418.1 564067006 563314974 562319338 560432851 557572603 554931223 553084910 551665425 550154924 548621416
436.5 548621416 548106909 549498796 552486598 556099474 559494078 562004685 563385248 564036429 564435184
454.8 564435184 564391911 563296080 561334968 559002042 556541324 553993285 551128626 547791958 544250309
473.2 544250309 541204572 539049327 537691355 536815464 536285341 536073387 535891831 535610080 535228014
491.5 535228014 534336388 532683671 530795455 529140592 527499497 525504589 522905946 519772530 516629517
509.9 516629517 513656437 510493577 506748557 502682805 499178976 496613264 495016932 494442105 494567335
528.3 494567335 495248675 497053176 500350118 504836082 509964705 514887571 518768132 521289527 522440910
546.6 522440910 522317886 521102190 519077182 516630530 513896585 510676682 506834030 502226114 496852607
565 496852607 491081953 485436440 480653018 477661729 477035165 478762835 482595563 488120466 494638652
583.3 494638652 501121402 506582975 510662913 513504982 515234351 516030192 516134322 515693903 515036464
601.7 515036464 514702141 514857829 515253842 515745580 516445339 517740190 519937396 522893488 526090205
620 526090205 529237330 532496214 535967648 539514184 542668700 544949055 546470940 547781527 549303353
638.4 549303353 551075399 552626789 553615689 554413021 555499613 556916773 558327794 559277415 559609056
656.7 559609056 559762359 560307026 561348140 562625885 563957512 564707279 565016031 566022992 567761958
675.1 567761958 569492459 570649326 571530461 572745979 574284136 575612724 576163352 575778663 574858129
693.5 574858129 573866546 572772026 571132362 568722248 566007555 563920975 563262045 564066291 565760672
711.8 565760672 567996681 570956707 575066447 580359161 586105943 591519594 596369624 600817859
728.1 600817859 605198979 609543562 613268077 615727484 617009223 617840528 618590415 618822753 617748260
746.5 617748260 614964426 610987127 606870770 603115439 599447489 595582128 591886222 589382172
762.8 589382172 589125395 591509163 595968008 601493120 607581615 614437699 622067511 629599392 635849178
781.2 635849178 640472174 644257188 648181558 652508855 656618476 659856677 662545919 665752292
797.5 665752292 670087516 674938500 678919911 681230426 682505131 683950484 685950220 687769473
813.8 687769473 688514352 688170791 687627733 687522531 687338591 685993910 682998359 678829908 674414575
832.1 674414575 670300603 666203380 661618650 656610191 651843488 648060262 645375371 643102825
848.5 643102825 640389621 637004554 633507431 630626678 628797770 628587663 630923808 636469901 645041049
866.8 645041049 655531049 666159749 675238490 681933641 686180711 688194990 688064814 685649037
883.1 685649037 680957377 674633324 667859197 661562085 655916512 650606155 645267129 639858723
899.4 639858723 634574592 629294157 623417675 616305292 607843995 598528922 589075029 580074549
915.8 580074549 571817279 564538181 558776736 555012703 553226233 552900851 553281784 553923607 554917991
934.1 554917991 556689799 559646964 563617647 567552567 569787502 568767309 563839614 555294514
950.4 555294514 543774724 529910624 514404058 498052418 481458634 464779228 447790295
964.7 447790295 430316597 412593365 395144135 378459573 362886250 348774463 336601704
979 336601704 326926708 320165366 316292077 314786881 314920396 316115409 318018198 320385218 322966665
997.3 322966665 325449288 327557385 329172164 330263913 330861062 331067502 331015974 330918401 331064820
1015.7 331064820 331723869 333037883 334973365 337370962 340086132 343005836 346020103 349014848
1032 349014848 351724356 353829473 355262935 356247574 357083589 358015716 359164953 360554039 362269968
1050.4 362269968 364581823 367861837 372305810 377885491 384555608 392287374 400600702 407890022
1066.7 407890022 411492527 409308583 401962250 392804801 385340720 381120980 379937708 380910426
1083 380910426 383233666 386491746 390571564 395304918 400203526 404559791 407794863 409823567 411045253
1101.4 411045253 411941469 412867099 414140373 416033924 418687105 422018081 425672501 429098338 431873590
1119.7 431873590 434086531 436252534 438900590 442269206 446225226 450158924 453156114 454430342
1136 454430342 453434646 449955165 444325715 437387884 430177897 423584819 418045074 413556844 410032332
1154.4 410032332 407508731 406160384 406162262 407529831 410168886 414097279 419564009 426898420 436184317
1172.7 436184317 447052807 458864212 471104771 483502626 495850176 507787108 518739700
1187 518739700 528153479 535758793 541661859 546184719 549517810 551707506 553041101 554169178 555812359
1205.4 555812359 558399737 561887264 565889418 570014656 574074328 577985704 581496239 584073365
1221.7 584073365 585223436 584993362 583993733 582805932 581576824 580190361 578640103 577187955 576235473
1240.1 576235473 576050997 576539338 577413380 578537583 580006301 581937194 584191322 586354017 588110268
1258.4 588110268 589572668 591112077 592985272 595126033 597213686 598954499 600288987 601329625
1274.7 601329625 602134466 602572083 602523625 602155030 601782441 601544321 601271272 600665033 599545598 598012269
1295.1 598012269 596404076 595021188 593950212 593130648 592442513 591752231 591021240 590241194 589272916
1313.5 589272916 587982237 586368024 584482551 582357526 579912782 576990426 573557913 569849789
1329.8 569849789 566288233 563263237 560927570 559139729 557722867 556683719 555996060 555484712 554953337
1348.1 554953337 554204047 553099871 551674247 550111115 548593879 547123909 545575261 544046164
1364.5 544046164 542726338 541685045 541067421 540831745 540779471 540835798 540969729 541102827 541455209 542625666
1384.9 542625666 544781804 547163963 549027026 550254583 550842285 550857842 550420821 549790442 549139857
1403.2 549139857 548378944 547502041 546508729 545390308 544352174 543602407 543042362 542650163 542640746 542915761
1423.6 542915761 543309927 543800235 544353604 544987261 545660079 546284020 546963215 547794521 548716724 549581766
1444 549581766 550158322 550201178 549701214 548792601 547584057 545909226 544343591 544033349 544683576 546334982
1464.4 546334982 549502850 554112375 560228765 568355739 577129900 585119903 592496753 599473834
1480.7 599473834 606046498 611973405 617430985 622650027 627422035 631314039 634602666 637713432
1497 637713432 640538156 642981589 644972980 646525741 647807777 648822486 649505556 650013268 650548697
1515.4 650548697 651327431 652358294 653520703 654661477 655613363 656337142 656862378 657202959 657429278
1533.7 657429278 657734096 657915473 657737195 657520592 657487869 657476306 657412589 657178938 656722307 656073332
1554.1 656073332 655221105 653705359 651821911 650628626 649341345 647670209 645729005 643679380
1570.5 643679380 642074943 640493512 638496399 636922479 635820627 634682953 633529544 632380605
1586.8 632380605 631185591 629910886 628603637 627259731 625806570 624150693 622223973 620057046
1603.1 620057046 617694259 615094006 612163126 609059155 605911970 602273643 598142087 594864666
1619.4 594864666 591888428 588129044 584127069 580161750 576241612 572844267 569537044 565718114
1635.7 565718114 562837243 561389148 560624480 560296655 560312331 560955405 562066197 563435853 565694571
1654.1 565694571 568409860 571078837 574008226 577491581 581510544 585521817 589797556 594727576
1670.4 594727576 599584222 604634166 610249519 615691364 620786250 626100779 632547379 638881266
1686.7 638881266 644499063 650298893 655937135 661900163 668270111 674241841 680366635 685510874
1703 685510874 689609826 693477631 696875453 699896574 702722490 705411851 708161354 710822523 713045597
1721.4 713045597 714891136 716502428 717832804 718883872 719570100 719887793 720231950 720731974 721330404
1739.7 721330404 722331703 723935366 726232290 729415953 733609021 738406301 742909968 747144222
1756.1 747144222 751227736 754916966 758403540 761471510 763972104 766124189 768032908 769954026
1772.4 769954026 771905959 773530543 774842143 776068032 777351379 778670609 779871464 780861259
1788.7 780861259 781687379 782607138 783715904 784791231 785704374 786530197 787365377 788278461 789277256
1807 789277256 790197849 790932834 791575313 792304814 793153405 794022977 794782817 795358539 795841455 796400428
1827.4 796400428 797087610 797790825 798332930 798697293 799079120 799591899 800105572 800491095 800813794 801117420
1847.8 801117420 801445365 801857591 802252710 802532554 802724183 802957892 803263903 803567767 803821683 804026842
1868.2 804026842 804266632 804599226 804987013 805366874 805709302 806003153 806289971 806643426 807056069 807433248
1888.6 807433248 807733774 807993054 808240771 808508217 808799088 809077382 809292972 809448361 809573948 809702635
1909 809702635 809889376 810125589 810298383 810363889 810456991 810652614 810895622 811120689 811268091 811340511
1929.4 811340511 811430216 811586976 811759710 811898351 811976194 812035322 812177598 812409759 812624395 812771976
1949.8 812771976 812891901 813031018 813230395 813485920 813717008 813842893 813933611 814092934 814298391 814467788
1970.2 814467788 814560056 814615071 814701676 814849555 815019667 815152526 815214634 815214694 815221965 815308392 815417051
1992.6 815417051 815442383 815408468 815391958 815405548 815403819 815329432 815155923 814949334 814792633 814660072 814474463
2015.1 814474463 814223170 813909769 813558877 813248336 812973320 812663376 812295139 811910748 811572433 811286092
2035.5 811286092 810997128 810688078 810374677 810106218 809944034 809815466 809659123 809517264 809416473 809373200
2055.9 809373200 809409976 809472024 809475780 809467316 809530318 809630871 809690714 809712470 809724987 809748292 809807241 809882581
2080.3 809882581 809928715 809939086 809971631 810085118 810234964 810305953 810300589 810326457 810442150 810614586 810773134
2102.8 810773134 810864687 810881317 810894608 810983777 811126649 811209083 811183751 811136007 811160684 811258733 811346352
2125.2 811346352 811330736 811213434 811130285 811175585 811283886 811328828 811260343 811156392 811128259 811209857 811326683
2147.7 811326683 811370611 811324358 811297596 811422706 811699390 811982810 812160015 812271237 812450528 812780380
2168 812780380 813212514 813632488 813973904 814264178 814598799 815034628 815494776 815863192 816113949 816349924
2188.4 816349924 816715479 817195654 817616761 817884862 818107605 818413556 818806887 819220960 819572687 819839478
2208.8 819839478 820101976 820428133 820800364 821158350 821436405 821625829 821837783 822180390 822567403 822838604
2229.2 822838604 822974980 823062301 823198438 823440492 823733270 823928177 823987901 824044108 824214935 824485838
2249.6 824485838 824729145 824848354 824894071 825004458 825218678 825465560 825675249 825782180 825824022 825952709
2270 825952709 826207995 826457679 826579571 826576650 826569259 826705277 827002704 827309489 827491820 827583194 827740312
2292.5 827740312 828045368 828397512 828663111 828811944 828972101 829315305 829844117 830386639 830755055 830918431
2312.9 830918431 831076026 831481040 832134724 832786679 833176374 833313286 833477437 833814919 834083855 834012449
2333.3 834012449 833755195 833632052 833757997 833911180 833589017 832454324 831275165 831073523 832000136
2351.6 832000136 833466411 834624290 835162938 835126340 834731877 834150374 833252132 832004547 830597162
2370 830597162 829225421 828036249 826958895 825812221 824616253 823530972 822706640 822192013 821865797
2388.3 821865797 821534812 821150243 820808589 820576072 820428431 820236862 819889009 819437027 819028556 818735898
2408.7 818735898 818488717 818149984 817656398 817113638 816663980 816289663 815857589 815294147 814653218 814051390
2429.1 814051390 813553512 813088953 812537968 811891139 811230540 810628414 810111344 809608519 808998406 808260083
2449.5 808260083 807531953 806942940 806440592 805898786 805278361 804644585 804075241 803584754 803130865 802628577
2469.9 802628577 802034497 801423907 800875962 800398707 799943447 799439847 798899412 798394918 797963917 797586083
2490.3 797586083 797185719 796688437 796147466 795717478 795430779 795136333 794718325 794234753 793787956 793426514
2510.7 793426514 793132484 792787015 792291522 791726351 791229069 790802240 790358722 789838135 789225578 788588464
2531.1 788588464 788035810 787534475 786954224 786250055 785501599 784816623 784221113 783666432 783042550 782311797
2551.5 782311797 781584501 780941606 780376494 779824555 779192626 778494120 777828515 777239859 776705146 776144326
2571.9 776144326 775497973 774808228 774173558 773647666 773150682 772590816 771978796 771385431 770900428 770502985
2592.3 770502985 770065665 769522607 768919468 768356442 767873347 767383814 766782820 766083598 765353501 764635444
2612.7 764635444 763934374 763166308 762251139 761242628 760246038 759299576 758334875 757254541 756080747
2631 756080747 754914522 753790736 752668142 751501381 750271201 749010205 747797608 746646285 745517969
2649.4 745517969 744395077 743243694 742060006 740925848 739859939 738775671 737661123 736537039
2665.7 736537039 735414684 734373391 733437181 732514024 731539249 730547845 729607642 728756428 727952003
2684.1 727952003 727093279 726155818 725237131 724398494 723581195 722716987 721779585 720772803 719763994
2702.4 719763994 718830407 717937768 716988862 715962827 714916587 713918149 712993681 712095559 711160421
2720.8 711160421 710192680 709232986 708311319 707438529 706590354 705717862 704845011 704042494 703299165 702557623
2741.2 702557623 701788306 701007962 700253487 699531198 698831856 698147595 697464943 696791351 696139038 695480645
2761.6 695480645 694810808 694167018 693534851 692862570 692143261 691403985 690649807 689848006 688974738 688023269
2782 688023269 687015414 685975313 684899569 683788180 682619870 681382239 680100143 678758979 677312315
2800.3 677312315 675793052 674256384 672668576 671010077 669297278 667508900 665636420 663662255
2816.6 663662255 661580920 659470081 657344818 655130506 652815044 650407076 647868276 645190299
2832.9 645190299 642395854 639437258 636154652 632373452 628007531 623058021 617660284 612147212
2849.3 612147212 607056320 602962554 600183547 598636627 597827256 597023427 595683694 593685746 591109693
2867.6 591109693 588109791 584892154 581605196 578393638 575406730 572683513 570177138 567839086
2883.9 567839086 565677345 563763082 562150180 560806572 559596717 558358669 557021618 555578053
2900.2 555578053 553979874 552098632 549788177 546949983 543515444 539429009 534715533 529621542
2916.6 529621542 524582684 520058811 516501904 514250278 513430357 513983011 515716732 518508017 522296071
2934.9 522296071 526885986 531987369 537318766 542614460 547672033 552383184 556737959 560781181
2951.2 560781181 564513087 568027079 571600556 575444937 579559565 583828986 588140368 592454910
2967.6 592454910 596778274 601038277 605072200 608773112 612158954 615263343 618069887 620561540
2983.9 620561540 622740984 624614179 626205504 627493799 628383636 628836274 628835559 628379941 627560437
3002.2 627560437 626473725 625232816 624006331 622886062 621807039 620682895 619521022 618335247
3018.5 618335247 617053509 615579724 613885581 612008572 610056102 608110607 606122971 603976130
3034.9 603976130 601680160 599424064 597277105 595100343 592764139 590303004 587866127 585507631
3051.2 585507631 583174407 580821157 578407526 575958431 573581934 571320295 569142580 566938162
3067.5 566938162 564604759 562266648 560068786 558014870 556012571 553886294 551657617 549492717
3083.8 549492717 547348440 545197546 543115973 540992439 538785160 536679447 534729719 532760382
3100.1 532760382 530663371 528564870 526613891 524755597 522826612 520873368 519065738 517314970
3116.4 517314970 515437484 513403475 511276245 509199023 507257521 505401552 503559828 501706421
3132.8 501706421 499899089 498196721 496512353 494706154 492835850 491042376 489335001 487699807
3149.1 487699807 486126810 484492570 482709467 480910391 479223698 477631390 476082593 474547029
3165.4 474547029 473029733 471530735 470035404 468555808 467095703 465630531 464189291 462780923
3181.7 462780923 461371541 459989905 458659828 457370639 456110030 454837143 453526646 452201068
3198 452201068 450895816 449653000 448479295 447347820 446244299 445161134 444064289 442934930 441823900
3216.4 441823900 440772057 439760208 438747823 437731922 436745733 435807794 434923977 434054762 433078617
3234.7 433078617 431993484 430963695 430028975 429125696 428260922 427412003 426510066 425606877 424786299
3253.1 424786299 423986733 423124492 422236621 421412557 420669138 419940829 419248194 418632895 417924464 417054027
3273.5 417054027 416209280 415467381 414749146 414020777 413327843 412683189 412069619 411512762 410976589 410374045
3293.9 410374045 409679174 408913255 408166885 407538354 407010734 406459153 405749738 404856116 403890729 402974725
3314.3 402974725 402105570 401238501 400396168 399625182 398850858 397914469 396857560 395868540 394961804
3332.6 394961804 394062698 393167794 392222971 391193837 390142292 389083385 388048947 387078017 386038661
3351 386038661 384817660 383537233 382376552 381337941 380288720 379216880 378248602 377348483 376287043
3369.3 376287043 374954671 373601019 372516096 371603042 370665312 369686574 368745834 367925793 367290229
3387.7 367290229 366817266 366246045 365384340 364482522 363914490 363604158 363045841 362111062 361275643 360764265
3408.1 360764265 360360622 359890670 359338015 358818054 358423471 358086050 357790917 357632071 357591450 357611030
3428.5 357611030 357647240 357732683 357924461 358026296 357891470 357742339 357827723 358148605 358561188 358948439
3448.9 358948439 359331787 359776974 360270113 360838413 361532927 362210304 362856448 363698035 364664495 365413010
3469.3 365413010 365877748 366354674 367032647 367915899 368843764 369566917 370215148 371028423 371871978 372663856
3489.7 372663856 373518080 374419540 375358284 376332492 377321362 378291547 379097939 379767030 380524218 381484896
3510.1 381484896 382628560 383733213 384600699 385431111 386521041 387830347 389010817 389949888 390886277
3528.4 390886277 391954333 393148720 394478261 395815581 397056550 398434460 400043100 401587158
3544.7 401587158 402871281 404149890 405625105 407174826 408753693 410439193 412263483 414156675
3561.1 414156675 415987939 417726308 419649869 421968371 424338192 426542342 428812385 431281716
3577.4 431281716 433894336 436625391 439426214 442123801 444723248 447555512 450525850 453430474
3593.7 453430474 456411779 459595501 462871999 466168106 469449878 472564757 475626379 478872597
3610 478872597 482314885 485909462 489414841 492787868 496440887 500235915 503784180 506965399 510091603
3628.4 510091603 513743520 517530441 521186829 524788558 528287590 531742394 535183430 538548350
3644.7 538548350 541799843 545122445 548729241 552268684 555540144 558998644 562678099 566028893
3661 566028893 568990052 571908832 574740291 577457249 580453753 583261311 585681021 588481009 591434240
3679.4 591434240 594159842 596760869 599166572 601351976 603438258 605576336 607759535 609856725
3695.7 609856725 611808479 613565564 615235209 617048025 618865132 620424509 621677339 622977376
3712 622977376 624731481 626585722 628176749 629535258 630845487 632151663 633475006 634900212 636194706
3730.3 636194706 637263417 638306916 639527917 640957713 642173886 642730713 643138289 644176245 645122051
3748.7 645122051 645810366 647048116 648587823 649792910 650718510 651718318 652748466 653648734 654471338
3767.1 654471338 655253410 656149447 657199085 658199549 659070671 659830749 660544574 661251545 662046969
3785.4 662046969 662958682 663829625 664614797 665313184 665935278 666560531 667035341 667534709 668365121 669044435
3805.8 669044435 669663191 670569777 671425164 671931267 672308028 672909617 673447788 674021602 674826801 675552905
3826.2 675552905 676170945 676702976 677241087 677874088 678333580 678649127 679180145 679809272 680453181 681130409
3846.6 681130409 681639194 681701720 681378126 681763768 682906806 683756948 684165537 684414029 684818208 685313165
3867 685313165 685636461 685996652 686493158 687055707 687628627 687974989 688242257 688602805 688981175 689466417
3887.4 689466417 689869702 690106988 690453410 690886021 691213787 691433012 691621602 691828191 692145824 692539632
3907.8 692539632 692895830 693230331 693525732 693723559 693883479 694082975 694302201 694537878 694805920 695041239
3928.2 695041239 695185184 695335627 695583522 695864797 696137309 696352959 696522295 696770847 697043419 697193980
3948.6 697193980 697280884 697442472 697680533 697928369 698166251 698373437 698519289 698645353 698841393 699113846
3969 699113846 699351132 699472308 699539125 699647009 699806392 700020254 700282693 700501382 700639248 700791121
3989.4 700791121 700963020 701089263 701204181 701339126
3997.5 701339126
##END=$$ End of the data block
