##TITLE=2 meg-mac $$ Begin of the data block
##JCAMP-DX=5.00 $$ ACD/SpecManager v 10.08
##SPECTROMETER/DATA SYSTEM=Alpha
##DATE=16 Oct 2013 11:49:50
##DATA TYPE=INFRARED SPECTRUM
##DATA CLASS=XYDATA
##ORIGIN=
##OWNER=
##NPOINTS=1765
##FIRSTX=399.75695801
##LASTX=3997.56933594
##MAXX=3997.56933594
##MINX=399.75695801
##MAXY=0.83417428
##MINY=0.31460205
##XFACTOR=1.0000000000
##YFACTOR=1.000000000000000e-9
##FIRSTY=0.56568640
##DELTAX=2.03957629
##XUNITS=1/CM
##YUNITS=ARBITRARY UNITS
##XYDATA=(X++(Y..Y))
399.8E65686405l247500k291322j646101n73874R09985J607775J401007R95994L09110
418.1E63151479m38810q58664j769126k692461k799034k369582j699865j232505j034677
436.5E48256755l19421J212000K759159L520668L385126K574206J538693P69854L11017
454.8E64008057k64466j181781j848280k213657k404571k476513k808988l350377l586948
473.2E43872476l035367k064228j271844q30710n56052k32338l8267m5657k90930j066864
493.6E34440219j852750j921893j631200j593470k004743k748370l302634l255606
509.9E16129553l071069l188134l578424l995001l680259k517164j293779m89085O6846
528.3D94383484Q05885J925885L232360M385233N104721M963398L880858K370894R91702
$$ y = [565686405, 562438905, 560147583, 558501482, 557927608, 558837593, 560445368, 561846375, 562842369, 563151479, 562712669, 561854005, 560084879, 557392418, 554593384, 552223802, 550523937, 549291432, 548256755, 547937334, 549149334, 551908493, 555429161, 558814287, 561388493, 562927186, 563697040, 564008057, 563743591, 562561810, 560713530, 558499873, 556095302, 553618789, 550809801, 547459424, 543872476, 540837109, 538772881, 537501037, 536670327, 536114275, 535881937, 535843670, 535798013, 535507083, 534440219, 532587469, 530665576, 529034376, 527440906, 525436163, 522687793, 519385159, 516129553, 513058484, 509870350, 506291926, 502296925, 498616666, 496099502, 494805723, 494316638, 494383484, 495189369, 497115254, 500347614, 504732847, 509837568, 514800966, 518681824, 521052718, 522044420]
546.6E22044420j30117j142978j879692k357245k826154l315330l936946m707456n338162
565D96410340n733877n674869m753530k989412o52283J844883M009485N557329O354659
583.3D94372725O350816N610466M211783K690435J565933P79807Q9050n61059p59005
601.7E14350951l02494L04222N51164N38469P07090J328766K225757K885282L125131
620E25714338L228664L322125L414154L483355L161311K303660J453578J271487J624047
638.4E48976719J806796J494765R95636Q06570J042188J317441J282334R28819M36843
656.7E59088111K25723N64754J064121J234234J179039O34730L89517J152396J827240
675.1E67359865J689911J086652Q79884J223385J504481J253366N22077l10719q11636
$$ y = [522044420, 521914303, 520771325, 518891633, 516534388, 513708234, 510392904, 506455958, 501748502, 496410340, 490676463, 485001594, 480248064, 477258652, 476606369, 478451252, 482460737, 488018066, 494372725, 500723541, 506334007, 510545790, 513236225, 514802158, 515581965, 515671015, 515109956, 514350951, 514048457, 514352679, 514903843, 515442312, 516149402, 517478168, 519703925, 522589207, 525714338, 528943002, 532265127, 535679281, 539162636, 542323947, 544627607, 546081185, 547352672, 548976719, 550783515, 552278280, 553273916, 554080486, 555122674, 556440115, 557722449, 558651268, 559088111, 559313834, 559878588, 560942709, 562176943, 563355982, 563990712, 564380229, 565532625, 567359865, 569049776, 570136428, 571016312, 572239697, 573744178, 574997544, 575519621, 575208902, 574397266]
693.5E74397266q81612j062751j704157k443075k665341k046168p21454P08937J655460
711.8E65237105K248049K988994M089176N253017N791367N490720M851460M412830
728.1F00362718M373252M317403L672302K471030J333177Q53419P77126K64167j062452
746.5F17362142k788544m002333m124224l715157l616751l870904l731787k459109
762.8E89053333j45674K367735M259050N390406O145238O974757P729173P609546O303489
781.2F35687053M623115L706157L787518M211545M070878L264904K744973L229379
797.5F65325522M266084M729926L997088K470970J352727J419187K015352J893580
813.8F87470436Q15868k96652n65529k01165k15650j284957k984047m208207m420936
$$ y = [574397266, 573515654, 572452903, 570748746, 568305671, 565640330, 563594162, 562872708, 563581645, 565237105, 567485154, 570474148, 574563324, 579816341, 585607708, 591098428, 595949888, 600362718, 604735970, 609053373, 612725675, 615196705, 616529882, 617383301, 618160427, 618424594, 617362142, 614573598, 610571265, 606447041, 602731884, 599115133, 595244229, 591512442, 589053333, 588907659, 591275394, 595534444, 600924850, 607070088, 614044845, 621774018, 629383564, 635687053, 640310168, 644016325, 647803843, 652015388, 656086266, 659351170, 662096143, 665325522, 669591606, 674321532, 678318620, 680789590, 682142317, 683561504, 685576856, 687470436, 688286304, 687989652, 687424123, 687222958, 687007308, 685722351, 682738304, 678530097, 674109161]
832.1F74109161m087031m060566m581035n071759m829466l783643k664686k273857
848.5F42757118k711356l335774l419340k838134j846731k58446K317667N568326Q586108
866.8F44819438J0501504J0701597R152174O638408M141509K017379m5121k374768
883.1F85552120m705608o295204o726682o302357n670726n325675n339086n389333
899.4F39797449n269527n289138n869031p040143q379817r323358r530604r096146
915.8E79999685q337021p292211n781352l808797j788377l22342L87132O66201J014233
934.1E54737151J799464K977788L983796L974974K271295j042486m977107q544743
950.4E55180132j1501610j3885677j5522241j6304195j6515583j6639888j6979725
$$ y = [674109161, 670022130, 665961564, 661380529, 656308770, 651479304, 647695661, 645030975, 642757118, 640045762, 636709988, 633290648, 630452514, 628605783, 628347337, 630665004, 636233330, 644819438, 655320942, 666022539, 675174713, 681813121, 685954630, 687972009, 687926888, 685552120, 680846512, 674551308, 667824626, 661522269, 655851543, 650525868, 645186782, 639797449, 634527922, 629238784, 623369753, 616329610, 607949793, 598626435, 589095831, 579999685, 571662664, 564370453, 558589101, 554780304, 552991927, 552669585, 553056717, 553722918, 554737151, 556536615, 559514403, 563498199, 567473173, 569744468, 568701982, 563724875, 555180132, 543678522, 529792845, 514270604, 497966409, 481450826, 464810938, 447831213]
964.7D47831213j7478406j7751813j7488956j6708523j5578628j4140099j2222141
979C36462647r684593o746858l896445j532704J37210J212031J909256K356738K596557
997.3C22813839K534538K146125J606852J066625N75721K00570j8001n4896J32472
1015.7C31003845N89251J272142J967162K447277K726078K919853L019482K965361
1032C48910451K654999K086103J449556R81181Q25674R65059J203954J399249J700133
1050.4C62176359K329886L302812M428715N549192O656707P722288Q314013P332355
1066.7D07812327L656417k168923p367790r203047p521033m259437j188636J013547
1083C80773425K411366L307253M024058M671067M902184M390657L274292K037287J190662
$$ y = [447831213, 430352807, 412600994, 395112038, 378403515, 362824887, 348684788, 336462647, 326778054, 320031196, 316134751, 314602047, 314739257, 315951288, 317860544, 320217282, 322813839, 325348377, 327494502, 329101354, 330167979, 330743700, 330944270, 330926269, 330871373, 331003845, 331593096, 332865238, 334832400, 337279677, 340005755, 342925608, 345945090, 348910451, 351565450, 353651553, 355101109, 356082290, 356907964, 357873023, 359076977, 360476226, 362176359, 364506245, 367809057, 372237772, 377786964, 384443671, 392165959, 400479972, 407812327, 411468744, 409299821, 401932031, 392728984, 385207951, 380948514, 379759878, 380773425, 383184791, 386492044, 390516102, 395187169, 400089353, 404480010, 407754302, 409791589, 410982251]
1101.4D10982251Q98034R76264J295418J874148K627731L307342L629148L404469K779245
1119.7D31774050K226144K146691K636045L425360M015297L919035K958596J281798
1136D54383016r56267l462852n640536o934553p165134o557316n557865m524827l562510
1154.4D10021156k542168j326054N692J319170K597034L936708N502909P336438R221405
1172.7D36072290J0819822J1839450J2272000J2392372J2341499J1938632J0969996
1187E18646061R464264P673502N972863M559755L310799K148986J312375J119793J630723
1205.4E55839121K577126L491700L999651M107117M078150L971040L522754K527237
1221.7E84113896J138866j77145r74000j216530j259804j394689j535952j425863r41753
$$ y = [410982251, 411880285, 412856549, 414151967, 416026115, 418653846, 421961188, 425590336, 428994805, 431774050, 434000194, 436146885, 438782930, 442208290, 446223587, 450142622, 453101218, 454383016, 453426749, 449963897, 444323361, 437388808, 430223674, 423666358, 418108493, 413583666, 410021156, 407478988, 406152934, 406158626, 407477796, 410074830, 414011538, 419514447, 426850885, 436072290, 446892112, 458731562, 471003562, 483395934, 495737433, 507676065, 518646061, 528110325, 535783827, 541756690, 546316445, 549627244, 551776230, 553088605, 554208398, 555839121, 558416247, 561907947, 565907598, 570014715, 574092865, 578063905, 581586659, 584113896, 585252762, 585075617, 584101617, 582885087, 581625283, 580230594, 578694642, 577268779, 576327026]
1240.1E76327026j91987M93586Q73268J082957J429617J934946K261698K158284J763821
1258.4E88133216J470864J534641J844525K096772K055943J739681J375615J099050
1274.7F01350307Q35002M31359o4850l77178l80040k43246k58505n84245j105189j527071
1295.1E98076344j632691j425445j067340p92742p10428p21097p30455p89404r63032
1313.5E89243710j233757j580774j919747k156973k446115k918362l421128l696918
1329.8E69869936l565074l051280k380491j818776j411438j004159o49989m87208n18799
1348.1E54982722p45833j116037j451791j584172j520217j473426j584888j565933
1364.5E43940425j319528j024067n92232k12669m2975O0975J38164J28925L39925J159430
$$ y = [576327026, 576135039, 576628625, 577501893, 578584850, 580014467, 581949413, 584211111, 586369395, 588133216, 589604080, 591138721, 592983246, 595080018, 597135961, 598875642, 600251257, 601350307, 602185309, 602616668, 602551818, 602174640, 601794600, 601551354, 601292849, 600708604, 599603415, 598076344, 596443653, 595018208, 593950868, 593158126, 592447698, 591726601, 590996146, 590206742, 589243710, 588009953, 586429179, 584509432, 582352459, 579906344, 576987982, 573566854, 569869936, 566304862, 563253582, 560873091, 559054315, 557642877, 556638718, 555988729, 555501521, 554982722, 554236889, 553120852, 551669061, 550084889, 548564672, 547091246, 545506358, 543940425, 542620897, 541596830, 541004598, 540791929, 540748954, 540809929, 540948093, 541077018, 541416943, 542576373]
1384.9E42576373K150416K372861J862347J245678N99682K2113m10795o01411o59227
1403.2E49158037p88391q87394r96709j113713j018285p20322n48840m20094m8100
1421.6E42616189K40147L84688N28336N98311O45518O40750N58675O72221R00924R81986
1442E48767745Q66712N35249J2219n13553r18448j216650j707316j605808k95520O97791
1462.4E44622421J682163L167748M591465O065965Q059084Q742094P987380P391334
1478.7E92309654P009506O621480N951941N399883N130172M782319L953457L288149
1495F34446561L107310K889514K499282J973033J453459J225233J095593P63357N25534
1513.4F49978876N08309P57634J002193J104772J170456J045525P58589N23090L21209
$$ y = [542576373, 544726789, 547099650, 548961997, 550207675, 550807357, 550829470, 550418675, 549817264, 549158037, 548369646, 547482252, 546485543, 545371830, 544353545, 543633223, 543084383, 542664289, 542616189, 542856336, 543241024, 543769360, 544367671, 545013189, 545653939, 546212614, 546884835, 547785759, 548767745, 549634457, 550169706, 550181925, 549668372, 548749924, 547533274, 545825958, 544220150, 543924630, 544622421, 546304584, 549472332, 554063797, 560129762, 568188846, 576930940, 584918320, 592309654, 599319160, 605940640, 611892581, 617292464, 622422636, 627204955, 631158412, 634446561, 637553871, 640443385, 642942667, 644915700, 646369159, 647594392, 648689985, 649453342, 649978876, 650487185, 651244819, 652247012, 653351784, 654522240, 655567765, 656326354, 656849444, 657170653]
1531.7F57170653J71602K83182J60515k65896k23696O2942N4777n7996k61128m89592
1552.1F56605363o62863q46208j546859j904011j156688j267612j668453j955628k056718
1570.5F43540323j573920j583517k032518j560092j066804j114846j143753j141608
1586.8F32323265j184523j276076j322985j375913j482487j649618j909971k188981
1603.1F19932711k422511k635479k893627l045976l149390l698171m151463l230989
1619.4E94705105k950072l750265l977180l953933l908575l367066l302753l866136
1635.7E65629125k928615j444757p21693l05295k3723N97299J086831J310408K233088
1654.1E65432668K784967K750874K998411L517390M028141M010976M240572M881203
$$ y = [657170653, 657342255, 657625437, 657785952, 657520056, 657296360, 657359302, 657414079, 657356083, 657094955, 656605363, 655942500, 655096292, 653549433, 651645422, 650488734, 649221122, 647552669, 645597041, 643540323, 641966403, 640382886, 638350368, 636790276, 635723472, 634608626, 633464873, 632323265, 631138742, 629862666, 628539681, 627163768, 625681281, 624031663, 622121692, 619932711, 617510200, 614874721, 611981094, 608935118, 605785728, 602087557, 597936094, 594705105, 591755033, 588004768, 584027588, 580073655, 576165080, 572798014, 569495261, 565629125, 562700510, 561255753, 560534060, 560228765, 560205042, 560802341, 561889172, 563199580, 565432668, 568217635, 570968509, 573966920, 577484310, 581512451, 585523427, 589763999, 594645202]
1670.4E94645202M845798N064488N638361N459427N078316N244255O385029O385982
1686.7F38746858N705356N840063N641163N950212O339967N922437O105781N188703
1703F85440540M137516L910423L463387L040016K784073K637744K721489K692103K286851
1721.4G13114142J871109J607955J334071J031280O33239K76387L52860N21361O14822
1739.7G21357226J022101J618504K301813L175616M187524M814744M530311M257023
1756.1G47264862M094660L665388L465891L108024K530575K124131J865923J891494
1772.4G70010948J940489J625180J323700J250267J306892J338064J226902R95517
1788.7G81017959P76887Q84414J151502J129150R25958Q23081Q52942R28939R82284
$$ y = [594645202, 599491000, 604555488, 610193849, 615653276, 620731592, 625975847, 632360876, 638746858, 644452214, 650292277, 655933440, 661883652, 668223619, 674146056, 680251837, 685440540, 689578056, 693488479, 696951866, 699991882, 702775955, 705413699, 708135188, 710827291, 713114142, 714985251, 716593206, 717927277, 718958557, 719591796, 719868183, 720221043, 720742404, 721357226, 722379327, 723997831, 726299644, 729475260, 733662784, 738477528, 743007839, 747264862, 751359522, 755024910, 758490801, 761598825, 764129400, 766253531, 768119454, 770010948, 771951437, 773576617, 774900317, 776150584, 777457476, 778795540, 780022442, 781017959, 781794846, 782679260, 783830762, 784959912, 785885870, 786708951, 787561893, 788490832, 789473116]
1807G89473116Q94666P37548O62506P32123Q31843Q59141P58946N65589M74691N47588
1827.4G96537757O39856O86645O02663M31537M12643N13912M84705L16441K63393L05712
1847.8H01195264L56734M32789M13060L07143K04921K12669K94626L22223K42650J52111
1868.2H04134190K18093L59059M15981M09901L75330L02077K72393L38852M00305L50952
1888.6H07577133K77400K48611K46108K90572L13044K82586K21490J60277J19150J22309
1909H09858680J85787K18213J42217N7399J17779K18212K40386K14815J49787R3579
1929.4H11496854J13368J55568J53840J35719Q9765N4598J19805K26438K29657J62005
1949.8H12937617J26124J42753K14994K67803K09749R7871Q0168J37925J87993K09988
$$ y = [789473116, 790367782, 791105330, 791767836, 792499959, 793331802, 794190943, 794949889, 795515478, 795990169, 796537757, 797177613, 797864258, 798466921, 798898458, 799311101, 799825013, 800309718, 800626159, 800889552, 801195264, 801551998, 801984787, 802397847, 802704990, 802909911, 803122580, 803417206, 803739429, 803982079, 804134190, 804352283, 804711342, 805127323, 805537224, 805912554, 806214631, 806487024, 806825876, 807226181, 807577133, 807854533, 808103144, 808349252, 808639824, 808952868, 809235454, 809456944, 809617221, 809736371, 809858680, 810044467, 810262680, 810404897, 810462296, 810580075, 810798287, 811038673, 811253488, 811403275, 811496854, 811610222, 811765790, 811919630, 812055349, 812145114, 812199712, 812319517, 812545955, 812775612, 812937617, 813063741, 813206494, 813421488, 813689291, 813899040, 813996911, 814077079, 814215004, 814402997, 814612985]
1970.2H14612985J62542O8545M2200J21355J80841J30593K6465k9743J0610J00493
1990.6H15426886J16527M4823m292l159P928q047o3598j50979k05934j88231j60515
2013H14811409k09213k90692l23414l23654k88069k50876k97606l90887m01676l54171
2033.4H11681151l28123l18229l16382k97725k45571j68681j32144j61350j61707p5996
2053.8H09475243K1577N5015K3127j6868K384O0260R3579P2122K6166P332L0160O3836
2078.3H09913933O5863K9445o0L7313J14679J43946Q6844P629L159Q8870J85907J99318
2102.8H10876846R4652m76K8789J01864J28269O7950k0266l2008K4557P9811O5029
2125.2H11415017k6584r6798o0558K6822O8724L8981k3722o3658l6776O3240J19091
$$ y = [814612985, 814775527, 814844072, 814886272, 815007627, 815188468, 815319061, 815345526, 815315783, 815326393, 815426886, 815543413, 815588236, 815583944, 815580785, 815588713, 815580666, 815517068, 815366089, 815160155, 814971924, 814811409, 814602196, 814311504, 813988090, 813664436, 813376367, 813125491, 812827885, 812436998, 812035322, 811681151, 811353028, 811034799, 810718417, 810420692, 810175121, 810006440, 809874296, 809712946, 809551239, 809475243, 809496820, 809551835, 809574962, 809558094, 809560478, 809620738, 809714317, 809786439, 809812605, 809819937, 809850097, 809913933, 809979796, 810009241, 810009181, 810046494, 810161173, 810305119, 810391963, 810399592, 810402751, 810491621, 810677528, 810876846, 810971498, 810971022, 810999811, 811101675, 811229944, 811297894, 811277628, 811245620, 811270177, 811349988, 811415017, 811388433, 811291635, 811231077, 811257899, 811326623, 811365604, 811341882, 811278224, 811241448, 811304688, 811423779]
2147.7H11423779M9948l6180k4199R0718K25365K58863J91152J40071J88649L15368
2168H12823534M17173M22120L65198L18169L24309M05312M79519L99530K58923K58982
2188.4H16472769L68356M51565M08232K59638J85073K66969L81231M21226L85225L02434
2208.8H19902718K69950L17156L48627L54290L36290K46942J96397K86162L56555K72453
2229.2H22887540J45495R4950J26362K26199K90871K04742P1943N6624J59622K54631
2249.6H24518979K37941J36316O0499J08898K22086K69950K09629P3195N603J20222
2270H25963318K76029K67148J37985K0564M113J29163K77340K94090J69158P2896J50263
2292.5H27762067L02613L59237K82586J57773J35303K67386M50969N23090L73304J35363
$$ y = [811423779, 811473727, 811437547, 811413348, 811504066, 811729431, 811988294, 812179446, 812319517, 812508166, 812823534, 813240707, 813662827, 814028025, 814346194, 814670503, 815075815, 815555334, 815954864, 816213787, 816472769, 816841125, 817292690, 817700922, 817960560, 818145633, 818412602, 818793833, 819215059, 819600284, 819902718, 820172668, 820489824, 820838451, 821192741, 821529031, 821775973, 821972370, 822258532, 822615087, 822887540, 823033035, 823127985, 823254347, 823480546, 823771417, 823976159, 824048102, 824104726, 824264348, 824518979, 824756920, 824893236, 824953735, 825062633, 825284719, 825554669, 825764298, 825837493, 825843096, 825963318, 826239347, 826506495, 826644480, 826665044, 826669157, 826798320, 827075660, 827369750, 827538908, 827611804, 827762067, 828064680, 828423917, 828706503, 828864276, 828999579, 829266965, 829717934, 830241024, 830614328, 830749691]
2312.9H30749691J12891L46303N73337N94675L86834J44661J05143K20656K11716n3943
2333.3H33391964k60949j36017J10864P4983l32356r53316j020670k17915P45177J204610
2353.6H32606375J021803N46097l6895m32014n69046p58111j119852j353622j307368
2372H28597367j121998r65893r79185j061738j001298p54595m55976k92182l13580
2390.4H21650922l80993l54766k44081j52052j89125l33548m28259l98159l25025k87652
2410.8H18557262l40402m78446n44727m70221l83258m16219n65827o75798o20901m75288
2431.2H13586175m13060n09798o61910p03275o17147n19394n23091o24418p13587p06553
2451.5H07593942n96583m87149n14626o39081o76692n84424m80771m55319n18144o18994
$$ y = [830749691, 830862582, 831208885, 831782222, 832376897, 832763731, 832908392, 833013535, 833234191, 833445907, 833391964, 833131015, 832994998, 833105862, 833180845, 832848489, 831895173, 830874503, 830656588, 831401765, 832606375, 833628178, 834174275, 834137380, 833705366, 833136320, 832378209, 831258357, 829904735, 828597367, 827475369, 826509476, 825530291, 824468553, 823467255, 822712660, 822256684, 821964502, 821650922, 821269929, 820915163, 820671082, 820519030, 820329905, 819996357, 819568098, 819169939, 818844914, 818557262, 818216860, 817738414, 817193687, 816723466, 816340208, 815923989, 815358162, 814682364, 814061463, 813586175, 813173115, 812663317, 812001407, 811298132, 810680985, 810161591, 809638500, 809014082, 808300495, 807593942, 806997359, 806510210, 805995584, 805356503, 804679811, 804095387, 803614616, 803159297, 802641153, 802022159]
2471.9H02022159o36458n31435m14074m02629n15640o00099n29111m00841l53635m03344
2492.3G97234893m87745n24700m58121l35276k99394l87550m65452m44591l62397l04400
2512.7G93165267l47853m71413n48900n18083m40061m26650n20945o36697o58214n68628
2533.1G88027823m95434n47409o76215p51793p21753o35385n80192o28292p01666o93977
2553.5G81595707o26445n63383n72801o57618o97434o36398n64218n40078n85973o72817
2573.9G75478542p03633o39260n30302m86017n41031o03199n86688m96984m48704m87804
2594.3G69954920n41210n75781n53727m83930m73261n56708o61492p28726p41899p19786
2614.7G63918400p73132r22024j024127j006604r51588r76145j070619j175165j212120
$$ y = [802022159, 801385701, 800854266, 800440192, 800037563, 799521923, 798921824, 798392713, 797991872, 797638237, 797234893, 796747148, 796222448, 795764327, 795429051, 795129657, 794742107, 794276655, 793832064, 793469667, 793165267, 792817414, 792346001, 791797101, 791279018, 790838957, 790412307, 789891362, 789254665, 788596451, 788027823, 787532389, 786984980, 786308765, 785556972, 784835219, 784199834, 783619642, 782991350, 782289684, 781595707, 780969262, 780405879, 779833078, 779175460, 778478026, 777841628, 777277410, 776737332, 776151359, 775478542, 774774909, 774135649, 773605347, 773119330, 772578299, 771975100, 771388412, 770891428, 770442724, 769954920, 769413710, 768837929, 768284202, 767800272, 767327011, 766770303, 766108811, 765380085, 764638186, 763918400, 763145268, 762223244, 761199117, 760192513, 759240925, 758264780, 757194161, 756018996, 754806876]
2633.1G54806876j149475j102686j129210j205862j270592j230478j141370j105129
2649.4G45472074j139403j208246j205921j112818j055599j077533j112103j134455
2665.7G36425996j132786j056374r40263r19580r87649j003206r31799q37982q04246
2684.1G27812111q62002r30488r17912q58307q38398q67486r20296r74953r85086r41575
2704.5G18715608r21428r64642j023948j043737j019776r66370r04143r06348r69350
2722.8G09995866r76980r14335q62718q50975q67188q73030q23974p52032p30336p55131
2743.2G01589167p80403p69020p18057o83665o92725p05898o93262o61492o32346o29723
2763.6F94622576o43492o58929o83009p03454p33972p81894q24690q70108r25482r71615
$$ y = [754806876, 753657401, 752554715, 751425505, 750219643, 748949051, 747718573, 746577203, 745472074, 744332671, 743124425, 741918504, 740805686, 739750087, 738672554, 737560451, 736425996, 735293210, 734236836, 733296573, 732376993, 731389344, 730386138, 729454339, 728616357, 727812111, 726950109, 726019621, 725101709, 724243402, 723405004, 722537518, 721617222, 720642269, 719657183, 718715608, 717794180, 716829538, 715805590, 714761853, 713742077, 712775707, 711871564, 710965216, 709995866, 709018886, 708104551, 707241833, 706390858, 705523670, 704650640, 703826666, 703074634, 702344298, 701589167, 700808764, 700039744, 699321687, 698638022, 697945297, 697239399, 696546137, 695884645, 695252299, 694622576, 693979084, 693320155, 692637146, 691933692, 691199720, 690417826, 689593136, 688723028, 687797546, 686825931]
2784F86825931j026750j105487j143098j150846j215518j315951j389325j434982j483559
2802.3F75560415j547694j615346j668334j720548j787543j867413j970828k046108
2818.7F61336601k075315k142489k247989k335906k429724k542972k644479k756715
2835F42161012k951682l290117l774225m355729m956663n433678n577267n124211m059434
2853.3F02638006k728760j515627q15630q27253j300454j930058k565563l038764l251016
2871.7E84664881l284037l210664l016770k754986k507925k306163k112150j877427
2888E63594759j623333j389205j229048j222372j325608j436233j614928j907945k287865
2906.4E49558222k792597l416240m079938m688620n080223n057812m554629l591597
$$ y = [686825931, 685799181, 684693694, 683550596, 682399750, 681184232, 679868281, 678478956, 677043974, 675560415, 674012721, 672397375, 670729041, 669008493, 667220950, 665353537, 663382709, 661336601, 659261286, 657118797, 654870808, 652534902, 650105178, 647562206, 644917727, 642161012, 639209330, 635919213, 632144988, 627789259, 622832596, 617398918, 611821651, 606697440, 602638006, 599909246, 598393619, 597577989, 596750736, 595450282, 593520224, 590954661, 587915897, 584664881, 581380844, 578170180, 575153410, 572398424, 569890499, 567584336, 565472186, 563594759, 561971426, 560582221, 559353173, 558130801, 556805193, 555368960, 553754032, 551846087, 549558222, 546765625, 543349385, 539269447, 534580827, 529500604, 524442792, 519888163, 516296566]
2922.7E16296566k269805q00908N91517J762152K799451L800571M608512N104005N332887
2941E37224948N301118N048812M687190M331291M031479L720939L496051L563285L849506
2959.4E75254619M118681M262149M317463M338503M309416M206240M008174L709912
2975.7F08525157L390610L113866K830088K512634K193749J857400J551986J255750
2992F27231240Q49784M17709j7047m71592q17239j061857j224816j220762j130820
3010.4F22554600j107514j122236j129746j184345j329362j529992j712978j851797
3026.7F11586630j915216j929700j990736k150357k293467k246619k134323k179503
3043E94746709k362073k494335k444625k356529k370179k377331k391577k429425k364874
$$ y = [516296566, 514026761, 513225853, 513817370, 515579522, 518378973, 522179544, 526788056, 531892061, 537224948, 542526066, 547574878, 552262068, 556593359, 560624838, 564345777, 567841828, 571405113, 575254619, 579373300, 583635449, 587952912, 592291415, 596600831, 600807071, 604815245, 608525157, 611915767, 615029633, 617859721, 620372355, 622566104, 624423504, 625975490, 627231240, 628081024, 628498733, 628481686, 628010094, 627192855, 626130998, 624906182, 623685420, 622554600, 621447086, 620324850, 619195104, 618010759, 616681397, 615151405, 613438427, 611586630, 609671414, 607741714, 605750978, 603600621, 601307154, 599060535, 596926212, 594746709, 592384636, 589890301, 587445676, 585089147, 582718968, 580341637, 577950060, 575520635, 573155761]
3061.4E73155761k255261k198458k237379k327800k315045k198100k063215j997947
3077.7E55562556k091468k209007k199889k184987k163946k080441k105772k175510
3094E38351536k098501j975834j972139k069235k090216j944542j857578j966894j966059
3112.4E20410538j783669j755953j897097k036452k113938k047181j903177j825750
3128.7E05047321j844585j896023j842678j703441j685679j813054j866251j790047
3145D90605563j705438j608103j545251j652062j790434j751631j641065j586795j553416
3163.4D75771368j521051j506865j517892j529008j505465j476228j466036j425028
3179.7D63823795j397520j406521j369923j306742j287878j307309j304179j286745
$$ y = [573155761, 570900500, 568702042, 566464663, 564136863, 561821818, 559623718, 557560503, 555562556, 553471088, 551262081, 549062192, 546877205, 544713259, 542632818, 540527046, 538351536, 536253035, 534277201, 532305062, 530235827, 528145611, 526201069, 524343491, 522376597, 520410538, 518626869, 516870916, 514973819, 512937367, 510823429, 508776248, 506873071, 505047321, 503202736, 501306713, 499464035, 497760594, 496074915, 494261861, 492395610, 490605563, 488900125, 487292022, 485746771, 484094709, 482304275, 480552644, 478911579, 477324784, 475771368, 474250317, 472743452, 471225560, 469696552, 468191087, 466714859, 465248823, 463823795, 462426275, 461019754, 459649831, 458343089, 457055211, 455747902, 454443723, 453156978]
3196D53156978j297563j276523j196206j151919j162261j140207j092404j115293j152783
3214.3D42571819j091540j017422j014828j039952j037389r93461r58025q99315q32081
3232.7D33687806r32008j066446j013637r27508r07689q74460q65936r22471r29326
3251.1D25248325q36581p81953q56758r24855q67546p69525p09981o58661o09517o70433
3271.4D17562515p91520q27372q08239p60287p29979p14123o37769n88269n72621n48065
3291.8D10584271n97179o98626p54505p20650o11842n01007n37127p40022r13858r60857
3312.2D03548598r28878q98272q68261p99507p34210p66933r46373j067787j031459
3330.6C95506918j005351r52929q51095r08196j073003j099139j066059j035243r53556
$$ y = [453156978, 451859415, 450582892, 449386686, 448234767, 447072506, 445932299, 444839895, 443724602, 442571819, 441480279, 440462857, 439448029, 438408077, 437370688, 436377227, 435419202, 434519887, 433687806, 432755798, 431689352, 430675715, 429748207, 428840518, 427966058, 427100122, 426177651, 425248325, 424411744, 423629791, 422773033, 421848178, 420980632, 420211107, 419501126, 418842465, 418232948, 417562515, 416770995, 415943623, 415135384, 414375097, 413645118, 412930995, 412293226, 411704957, 411132336, 410584271, 409987092, 409288466, 408533961, 407813311, 407201469, 406700462, 406163335, 405423313, 404509455, 403548598, 402619720, 401721448, 400853187, 400053680, 399319470, 398552537, 397606164, 396538377, 395506918, 394501567, 393548638, 392697543, 391789347, 390716344, 389617205, 388551146, 387515903, 386562347]
3348.9C86562347j036077j253337j297534j152813j017719j048238j100361r60111
3365.3C77696157q73954j075387j351386j366824j098782r10550r54509j034945r88185
3383.6C68041635q37267o23047m36723n70596r02533r11355n49466l05980n51254r07927
3404C61445487q20816n44071m16845l91305m92453n55963m28527l45439l44425k40386
3424.4C56865257n7816R1969R5785J02133K07931J01387j64837j72525P5906L20852
3444.8C57466042M23253L86953L62098M20451N25713O43850P29680O58422N85944Q00013
3465.2C63002419J029611Q59141M54843L69311O41852R28432R65148P38383O83456
3483.6C69672596Q83133Q93503P67857Q06868R13352J009136J014948R33379Q85189
$$ y = [386562347, 385526270, 384272933, 382975399, 381822586, 380804867, 379756629, 378656268, 377696157, 376822203, 375746816, 374395430, 373028606, 371929824, 371019274, 370064765, 369029820, 368041635, 367204368, 366581321, 366144598, 365574002, 364671469, 363760114, 363210648, 362904668, 362353414, 361445487, 360624671, 360080600, 359663755, 359272450, 358779997, 358224034, 357795507, 357450068, 357105643, 356865257, 356807441, 356899410, 356995195, 357097328, 357305259, 357406646, 357241809, 357069284, 357145190, 357466042, 357889295, 358276248, 358638346, 359058797, 359584510, 360228360, 360958040, 361616462, 362202406, 363002419, 364032030, 364891171, 365346014, 365715325, 366357177, 367285609, 368250757, 368989140, 369672596, 370555729, 371449232, 372217089, 373023957, 373937309, 374946445, 375961393, 376894772, 377779961]
3501.9C77779961P92324P06136P86394R81212J139820J089215Q96156Q74430J072704
3520.3C86118352J247973J152366R59724R71496J074076J179576J366019J406372J251548
3538.6C96727502J358331J624584J573086J283258J230806J410544J530051J626045
3554.9D08364207J756876J845092J841724J770913J749754K040834K393603K327531
3571.3D24090534K187640K310574K497971K617389K749413K843052K719641K578765
3587.6D44594979K803624K965063K916455L023833L246248L298819L277272L282487
3603.9D69408780L128291L062725L254115L457010L622711L511220L331452L652990
3620.2D96429294L867835L614903L188491L076016L672362L877044L659904L579437
$$ y = [377779961, 378572285, 379278421, 380064815, 381046027, 382185847, 383275062, 384171218, 385045648, 386118352, 387366325, 388518691, 389478415, 390449911, 391523987, 392703563, 394069582, 395475954, 396727502, 398085833, 399710417, 401283503, 402566761, 403797567, 405208111, 406738162, 408364207, 410121083, 411966175, 413807899, 415578812, 417328566, 419369400, 421763003, 424090534, 426278174, 428588748, 431086719, 433704108, 436453521, 439296573, 442016214, 444594979, 447398603, 450363666, 453280121, 456303954, 459550202, 462849021, 466126293, 469408780, 472537071, 475599796, 478853911, 482310921, 485933632, 489444852, 492776304, 496429294, 500297129, 503912032, 507100523, 510176539, 513848901, 517725945, 521385849, 524965286]
3636.5E24965286L533602L476322L442347L338575L133893L227651L706575L704667
3652.8E52528918L360390L476322L668487L347457L001511K951026K817869K667606
3669.2E77819586K902388K743662K389252K788007K998531K777875K631545K427160
3685.5E99478006K152145K003551K135336K280235K161325J873195J624465J627147
3701.8F15335405J854777J877308J577377J200617J250922J768947J895428J635968
3718.1F28396749J374901J265645J260280J330197J440704J279175J031399R93014
3734.4F38372064J175820J423479J252412N92471M11629J050294R68277P10309J277566
3752.8F47234321J570642J203060Q89599J018345J133979R79364Q24868P25389Q60512
$$ y = [524965286, 528498888, 531975210, 535417557, 538756132, 541890025, 545117676, 548824251, 552528918, 555889308, 559365630, 563034117, 566381574, 569383085, 572334111, 575151980, 577819586, 580721974, 583465636, 585854888, 588642895, 591641426, 594419301, 597050846, 599478006, 601630151, 603633702, 605769038, 608049273, 610210598, 612083793, 613708258, 615335405, 617190182, 619067490, 620644867, 621845484, 623096406, 624865353, 626760781, 628396749, 629771650, 631037295, 632297575, 633627772, 635068476, 636347651, 637379050, 638372064, 639547884, 640971363, 642223775, 642816246, 643227875, 644278169, 645246446, 645956755, 647234321, 648804963, 650008023, 650897622, 651915967, 653049946, 654029310, 654854178, 655579567, 656440079]
3771.1F56440079J073778J005411Q25465P32243P75933P82609P72119Q34942Q31544
3789.5F64074123P81536P15613O58453O59704M37081L66747P58827P07746O76870R85682
3809.9F70822382R09090M77076L19123N90622N05567N38707Q65280P78675N94855N13911
3830.3F76915288N14984N58555L61979K30968N60940P85708P67946P02083N30959Q9466
3850.7F82018876l93689K49267J092672Q93653N01632L14296L95000M64320K87473
3869F85823500L67820N65947N86271N43535L35037L32713M23670L02911L64304L93450
3889.4F90039158L00765L94761M43042K84076J22308Q4281J86146M30941N37336M05550
3909.8F93228364L21984L11435J94430J27971K02358K16067K07841K54393K49505J77741
$$ y = [656440079, 657513857, 658519268, 659344733, 660076976, 660852909, 661635518, 662407637, 663242579, 664074123, 664855659, 665571272, 666229725, 666889429, 667326510, 667693257, 668452084, 669159830, 669836700, 670822382, 671731472, 672208548, 672527671, 673118293, 673623860, 674162567, 675027847, 675806522, 676401377, 676915288, 677430272, 677988827, 678350806, 678581774, 679142714, 679928422, 680696368, 681398451, 681929410, 682018876, 681625187, 681874454, 682967126, 683860779, 684362411, 684676707, 685071707, 685536027, 685823500, 686191320, 686757267, 687343538, 687887073, 688222110, 688554823, 688978493, 689281404, 689645708, 690039158, 690339923, 690734684, 691177726, 691461802, 691584110, 691668391, 691854537, 692285478, 692822814, 693228364, 693550348, 693861783, 694056213, 694184184, 694386542, 694602609, 694810450, 695064843, 695314348, 695492089]
3930.2F95492089J73032K48969K91049K64228J67667J20342K42770L13401J90199J10447
3950.6F97614193J37746J64092J99437K15054J85549J83761K34783K57194K22742J53959
3971F99568510R8050J16944J40607J47105K13682K63512K26319J68026J35183J45316
3991.4G01223254J68979J47939J42694
3997.5G01682866
$$ y = [695492089, 695665121, 695914090, 696205139, 696469367, 696637034, 696757376, 697000146, 697313547, 697503746, 697614193, 697751939, 697916031, 698115468, 698330522, 698516071, 698699832, 698934615, 699191809, 699414551, 699568510, 699666560, 699783504, 699924111, 700071216, 700284898, 700548410, 700774729, 700942755, 701077938, 701223254, 701392233, 701540172, 701682866]
##END=$$ End of the data block
