##TITLE=2 $$ Begin of the data block
##JCAMP-DX=5.00 $$ ACD/SpecManager v 10.08
##SPECTROMETER/DATA SYSTEM=Alpha
##DATE=16 Apr 2014 10:35:00
##DATA TYPE=INFRARED SPECTRUM
##DATA CLASS=XYDATA
##ORIGIN=
##OWNER=
##NPOINTS=1765
##FIRSTX=399.75695801
##LASTX=3997.56933594
##MAXX=3997.56933594
##MINX=399.75695801
##MAXY=0.86327851
##MINY=0.23476768
##XFACTOR=1.0000000000
##YFACTOR=1.000000000000000e-9
##FIRSTY=0.62960100
##DELTAX=2.03957629
##XUNITS=1/CM
##YUNITS=ARBITRARY UNITS
##XYDATA=(X++(Y..Y))
399.8F29601002j880229j446605r33110j006782j088381n02944k60532o92189j291394
418.1F20498836j338541q90315j157701j458108j026094p10190q72493r56833p72476
436.5F11316085o72519o97613m41492j39475l90827q99017q67307l41416j29878n48244
456.9F06188297r31918o60181n11170q52525j016378q00729r00805j546204j746834
475.2E97221553j331389r99450r69768r49323p05183p33137j103163r90927l72827
493.6E89066386k44438o40810o91295n15461p93695j139581r45986l62396J97649L48509
514E84278882K46703K93434J29044l96133n59210l04282l71397q05974q60929l53038
534.4E81297100m9532q9705J76251O46830O00636J92821K16186N70357N48362P2301
$$ y = [629601002, 627720773, 626274168, 625341058, 624334276, 623245895, 622742951, 622482419, 621790230, 620498836, 619160295, 618269980, 617112279, 615654171, 614628077, 613917887, 613045394, 612088561, 611316085, 610643566, 609945953, 609504461, 609364986, 608974159, 608075142, 607207835, 606866419, 606736541, 606188297, 605256379, 604596198, 604085028, 603232503, 602216125, 601415396, 600514591, 598968387, 597221553, 595890164, 594890714, 593920946, 592971623, 592266440, 591533303, 590430140, 589439213, 589066386, 588821948, 588181138, 587489843, 586974382, 586180687, 585041106, 584095120, 583732724, 583930373, 584278882, 584525585, 584819019, 584948063, 584551930, 583992720, 583688438, 583317041, 582511067, 581650138, 581297100, 581247568, 581157863, 581334114, 581980944, 582581580, 582774401, 582990587, 583560944, 584109306, 584181607]
554.8E84181607r3460L73721P03275N84006N98967Q29876P58290M27783M35590P38621
575.2E89538276P78854M97699M79221Q17955O96361K40981L45529P82609P03275J66237
595.6E95046997j0610K90096L09110j68383m30525k71797l02493o35386o04510j30117
616E93092382J92702K17080L42190P75874J088679J114368J341999J832783J964450
634.3F01962507J552343J242697J413763J474857J020789O64950R56476J308024J105070
652.7F12701476R15348J150251J353383J151800R49323R61602J097381J522958J654565
671F23458087J792253K054870J878738J630902J813710J996815J731754J375854J408994
689.4F39141977J577735J328349Q74996P48873Q35061N67973k0028m18961n76794q90374
$$ y = [584181607, 584088147, 584461868, 585165143, 585749149, 586348116, 587177992, 587936282, 588364065, 588799655, 589538276, 590317130, 590814829, 591294050, 592112005, 592808366, 593049347, 593394876, 594177485, 594880760, 595046997, 595036387, 595326483, 595635593, 595467210, 595036685, 594764888, 594462395, 593827009, 593222499, 593092382, 593285084, 593502164, 593844354, 594620228, 595708907, 596823275, 598165274, 599998057, 601962507, 603514850, 604757547, 606171310, 607646167, 608666956, 609331906, 610288382, 611596406, 612701476, 613616824, 614767075, 616120458, 617272258, 618221581, 619183183, 620280564, 621803522, 623458087, 625250340, 627305210, 629183948, 630814850, 632628560, 634625375, 636357129, 637732983, 639141977, 640719712, 642048061, 642923057, 643671930, 644506991, 645074964, 645054936, 644635975, 644059181, 643168807]
709.8F43168807j402438j655221j567483j679420k152681k365351k214909k102971
726.1F28028333j809597p85708R73105K791822M035831M546105M403651L681422K634525
744.4F48499489J685619J078010O89685L45826K96116O69956R24409O98387M00901
762.8F55288398M98057Q39889J070857J364231J814663K016425J781583J499772J565218
781.2F67739093J597822R66847k29120j371622k140046k619147k716184k177000j204609
799.5F57846034l00110K70307N37813M11391l95298j664877k735853l367424l761470
817.9F46840513l822387l268957k314925j469791q31067j24932O52433J181364J446843
836.2F38289094J884997K660394L432571M076303M832148N695403O302118O464362
$$ y = [643168807, 641766369, 640111148, 638543665, 636864245, 634711564, 632346213, 630131304, 628028333, 626218736, 625433028, 626406133, 629197955, 633233786, 637779891, 642183542, 645864964, 648499489, 650185108, 651263118, 651952803, 652298629, 652594745, 653264701, 654189110, 654887497, 655288398, 655786455, 656626344, 657697201, 659061432, 660876095, 662892520, 664674103, 666173875, 667739093, 669336915, 670303762, 670074642, 668703020, 666562974, 663943827, 661227643, 659050643, 657846034, 657545924, 657816231, 658354044, 658765435, 658370137, 656705260, 653969407, 650601983, 646840513, 643018126, 639749169, 637434244, 635964453, 635133386, 635008454, 635660887, 636842251, 638289094, 640174091, 642834485, 646267056, 650343359, 655175507, 660870910, 667173028, 673637390]
852.5F73637390O490648O630897O574035O109953N584836N300045N094886M768371
868.9G20191061M502714M578293M838109M833817M535973M256249L998875L508508
885.2G55243599K815485K254129J930833J617789J228213J009167J007854Q79229N17606
903.5G68503904K37465J35899m7982l95656o60359o65129o45578q56936j028716r71913
923.9G63604999j028002j380920j730561j851559j968443k266467k531707k585173
940.2G48262167k643287k944648l295899l448546l535688l841936m372359m835903
956.6G19343901n169273n599260o086290o328583o320774o286741o237447o011188
972.9F71304345n595207n279899n242824n292118n312562n429983n665243n854547
$$ y = [673637390, 680128038, 686758935, 693332970, 699442923, 705027759, 710327804, 715422690, 720191061, 724693775, 729272068, 734110177, 738943994, 743479967, 747736216, 751735091, 755243599, 758059084, 760313213, 762244046, 763861835, 765090048, 766099215, 767107069, 767986298, 768503904, 768741369, 768877268, 768829286, 768433630, 767773271, 767108142, 766462564, 765605628, 764576912, 763604999, 762576997, 761196077, 759465516, 757613957, 755645514, 753379047, 750847340, 748262167, 745618880, 742674232, 739378333, 735929787, 732394099, 728552163, 724179804, 719343901, 714174628, 708575368, 702489078, 696160495, 689839721, 683552980, 677315533, 671304345, 665709138, 660429239, 655186415, 649894297, 644581735, 639151752, 633486509, 627631962]
989.2F27631962n906462n951822o111384o253421o268024o311059o532550o880462
1005.5E77416778p378221q450746j0526717j3219416j5506506j6696692j6811609j6169340
1021.8D72657531j5027403j3534874j1658430r302676o489068l475368o67602J708478
1038.1D14210588L715455N336911O371021O685674O275177N148888L292918R30816
1054.5D51967448j335680k825499l252566k700895j267523Q54701L152132N005539
1070.8D49597657O089747O353140N743175M301042K435267O56217q21263k094447l188849
1089.1D69071686l911167m228264m324585m222155l732264k828091j662583l44872
1105.4D43817705J039117K361477L520131M446268N169869N717575N875141N477160
$$ y = [627631962, 621725500, 615773678, 609662294, 603408873, 597140849, 590829790, 584297240, 577416778, 570038557, 561587811, 551061094, 537841678, 522335172, 505638480, 488826871, 472657531, 457630128, 444095254, 432436824, 423134148, 416645080, 413169712, 412502110, 414210588, 417926043, 423262954, 429633975, 436319649, 442594826, 447743714, 451036632, 451967448, 450631768, 447806269, 444553703, 441852808, 440585285, 441439986, 444592118, 449597657, 455687404, 462040544, 467783719, 472084761, 474520028, 475176245, 474354982, 472260535, 469071686, 465160519, 460932255, 456607670, 452385515, 448653251, 445825160, 444162577, 443817705, 444856822, 447218299, 450738430, 455184698, 460354567, 466072142, 471947283, 477424443]
1121.8D77424443M699081L822863K864987J678943J37985j836359m014016n773335
1138.1D79004592o410510n491912l115565R8795L523886O727159R185434J0445565
1154.4D93967444J0502726R634792Q015931N767524L146172M89652j979589m222215
1170.7E25322437o151259p541895q330643q707106q785039q560121q075446p412910
1187D61758018o634921n715609m603416l366381k134680r45330K32786J361519K308548
1205.4D42260534L062605L706217M201472M411668M321247M080772L720552L143191
1221.7D72908258K373636J624555J056403O84618N55575P45714J215786J773625K262176
1240.1D85200346K665668K988041L149211L124118K983183K762913K409757J913428
$$ y = [477424443, 482123524, 485946387, 488811374, 490490317, 490628302, 488791943, 484777927, 479004592, 472594082, 467102170, 463986605, 464085400, 467609286, 474336445, 483521879, 493967444, 504470170, 514104962, 522120893, 527888417, 531034589, 531524241, 529544652, 525322437, 519171178, 511629283, 503298640, 494591534, 485806495, 477246374, 469170928, 461758018, 455123097, 449407488, 444804072, 441437691, 439303011, 438357681, 438590467, 439951986, 442260534, 445323139, 449029356, 453230828, 457642496, 461963743, 466044515, 469765067, 472908258, 475281894, 476906449, 477962852, 478647470, 479203045, 479948759, 481164545, 482938170, 485200346, 487866014, 490854055, 494003266, 497127384, 500110567, 502873480, 505283237, 507196665]
1256.4E07196665J376211Q53062L10719l31938j040459j754284k512395l350616m195720
1274.7D96551245m852920n174846n112886m636169l758907k730727j826167j200110
1291D67258513q81881q59022j135885j625210k129734k509862k801687k965539k929062
1309.4D49420631k717584k457649k170861j906454j704186j537443j450687j425565
1325.7D34050202j448631j474887j483679j356810j147598r43214o05225M2647R12189
1344.1D26544994J825750K695054L401935M008859M472047M675687M590809M490882
1360.4D56706017M466415M206747L887623L901988M075557M381270M897445N234271
1376.7D91757333N613983O106377O570518P369578Q608579R070873Q425594Q448183
$$ y = [507196665, 508572876, 509425938, 509736657, 509404719, 508364260, 506609976, 504097581, 500746965, 496551245, 491698325, 486523479, 481410593, 476774424, 473015517, 470284790, 468458623, 467258513, 466376632, 465517610, 464381725, 462756515, 460626781, 458116919, 455315232, 452349693, 449420631, 446703047, 444245398, 442074537, 440168083, 438463897, 436926454, 435475767, 434050202, 432601571, 431126684, 429643005, 428286195, 427138597, 426195383, 425590158, 425632805, 426544994, 428370744, 431065798, 434467733, 438476592, 442948639, 447624326, 452215135, 456706017, 461172432, 465379179, 469266802, 473168790, 477244347, 481625617, 486523062, 491757333, 497371316, 503477693, 510048211, 517417789, 526026368, 535097241, 543522835, 551971018]
1393E51971018R002328Q761168Q376896P910133P355928P163048O364524N191982M063189
1411.4F16160214K600312Q00371j790642n729914r076774j2403727j6509354j9822299
1427.7E54228187k3378075k4591088k2511661k2565007k1260142j4373035q812457
1442D16736722m707128l55065L805727P286489R687960J1848778J6857356K1526157
1458.3D82686996J8326045J6389250J8391609J8799425J6238153J5757799J7852008
1472.6F04441285J6948760J3463795J1034191R251594P499278N443871L563463J675904
1488.9F73322141m54187j791060k764940m027606m596054m173219l695190m915416
1505.2F46904469q833111r795248q838594q440137o970644m531861j501441P59244
$$ y = [551971018, 560973346, 569734514, 578111410, 586021543, 593377471, 600540519, 606905043, 612097025, 616160214, 618760526, 619560897, 617770255, 612040341, 602963567, 590559840, 574050486, 554228187, 530850112, 506259024, 483747363, 461182356, 439922214, 425549179, 416736722, 412029594, 411674529, 415480256, 422766745, 432454705, 444303483, 461160839, 482686996, 501013041, 517402291, 535793900, 554593325, 570831478, 586589277, 604441285, 621390045, 634853840, 645888031, 655139625, 662638903, 668082774, 671646237, 673322141, 672867954, 671076894, 668311954, 664284348, 659688294, 655515075, 651819885, 646904469, 638071358, 628276110, 619437516, 610997379, 604026735, 599494874, 597993433, 598752677]
1521.5E98752677J025558l89874k223194k960741k519190j365126P35760L430605P123470
1539.9F01609945Q873165Q020937P843435Q147121R071767R835839J0185421R794056
1556.2F73381686R491146O896376J814008j091659l375769o455361r920180j0816574
1572.5F59923673j2919545j9057215k0845890k0725071k3884535k6849926k8691768
1586.8E06949723k9804647l0022949k9211730k7589470k4772227k1119893j7496228
1601.1C26932579j3901293j0197222o899268m080623j566470O42747L097236O205320
1617.4C00233006P824809R322226J2444645J4200538J5462488J7330170J7873824K0384609
1633.7D15076315K7541548K8149575K3546249K2239357K1428228K2476852K1604478
$$ y = [598752677, 599778235, 599388361, 597165167, 594204426, 591685236, 590320110, 591055870, 594486475, 601609945, 610483110, 618504047, 626347482, 634494603, 643566370, 653402209, 663587630, 673381686, 682872832, 689769208, 691583216, 690491557, 687115788, 680660427, 670740247, 659923673, 647004128, 627946913, 607101023, 586375952, 562491417, 535641491, 506949723, 477145076, 447122127, 417910397, 390320927, 365548700, 344428807, 326932579, 313031286, 302834064, 295934796, 291854173, 290287703, 290930450, 294027686, 300233006, 308057815, 317380041, 329824686, 344025224, 359487712, 376817882, 394691706, 415076315, 442617863, 470767438, 494313687, 516553044, 537981272, 560458124, 582062602]
1648E82062602J5550911J5532673J9197643J3505220J0352135J0976255J1688649J1088789
1664.3F89954877R431302R403348R660125Q123338P529080P441938O241560N598724
1680.6G53384292N757570O019235M653335L604531L617763L428221L410936L215849
1696.9G87091732K796173K574682K087772J799941J823306J787842J846909J949370
1713.2H03757727K053857K074957J734912J577139J746357J997590K092421K134263
1729.5H19169223K109588K139270J875043J547456J632869J708746J705944J749218
1745.9H33637357J846790J860559J756251J594067J579999J624704J516938J289308
1762.2H46705973J114369J194536J250625J075447P50720O00636O41584O53923O22630
$$ y = [582062602, 597613513, 613146186, 632343829, 645849049, 656201184, 667177439, 678866088, 689954877, 699386179, 708789527, 718449652, 726572990, 734102070, 741544008, 747785568, 753384292, 759141862, 765161097, 769814432, 773418963, 777036726, 780464947, 783875883, 787091732, 789887905, 792462587, 794550359, 796350300, 798173606, 799961448, 801808357, 803757727, 805811584, 807886541, 809621453, 811198592, 812944949, 814942539, 817034960, 819169223, 821278811, 823418081, 825293124, 826840580, 828473449, 830182195, 831888139, 833637357, 835484147, 837344706, 839100957, 840695024, 842275023, 843899727, 845416665, 846705973, 847820342, 849014878, 850265503, 851340950, 852091670, 852692306, 853333890, 853987813, 854610443]
1780.5H54610443O43551O52552N93603O48141O98328N36799L31402L53217M47333M77374
1800.9H59992743L89575K99693L48031M22120L28362J63317J72198K16067J94311J81079
1821.3H62707496K11060K07185J52767k6643j59443j6033K6822r0838l3795J26183
1841.7H63104761k9743k79307k25783j15871q5116j10149j14560j00553j14322j44660
1862.1H61784697q3983r537j10448k70664k41697j25945r6559j25766j49190j33336
1882.5H60437572q7082l4511o6698j50979j49250j31011j55091j81615j82391j48594
1902.9H59150350j06931j34050k10703k44379k13385j67071k08140k63274k55048l06666
1923.3H57040703l40163k73884k36094k65896k92897k61486k22862k59280l41356l51786
$$ y = [854610443, 855253994, 855906546, 856500149, 857148290, 857846618, 858383417, 858714819, 859068036, 859515369, 859992743, 860382318, 860682011, 861030042, 861452162, 861780524, 861943841, 862116039, 862332106, 862526417, 862707496, 862918556, 863125741, 863278508, 863251865, 863092422, 863076389, 863103211, 863012373, 862978578, 863104761, 863075018, 862795711, 862569928, 862454057, 862368941, 862258792, 862144232, 862043679, 861929357, 861784697, 861700714, 861691177, 861580729, 861310065, 861068368, 860942423, 860845864, 860720098, 860570908, 860437572, 860350490, 860315979, 860249281, 860098302, 859949052, 859818041, 859662950, 859481335, 859298944, 859150350, 859043419, 858909369, 858698666, 858454287, 858240902, 858073831, 857865691, 857602417, 857347369, 857040703, 856700540, 856426656, 856190562, 855924666, 855631769, 855370283, 855147421, 854888141, 854546785, 854194999]
1943.7H54194999k99812l24905l52859k73466k15829k95400l86000l30388k10345k01702
1964.1H51304293l07978l51429k70724k49922l24607l10957k19644k48551l46541l16680
1984.5H48357260j92702j86860l19481l48330k21610k05338l29494l23951j87934j73986
2004.9H45867574k96235l30329k33292j80960k53797l00467k10464j71303k80381l25322
2025.3H43285024k13265j56403k44856k92122j95682j33455k20597k65479j58071q8334
2045.7H41316760j75596k28762j27495m5776j07646j58489p9870k5630j20223k07305
2066.1H40039968j23381r835l4988j23143r1195J967j8597j00612o9619M8340K4199
2088.5H39543104j12176j16050k1636l0280r9539o3539L6836K4736q1718r8706k8371
$$ y = [854194999, 853895187, 853570282, 853217423, 852943957, 852728128, 852432728, 852046728, 851716340, 851505995, 851304293, 850996315, 850644886, 850374162, 850124240, 849799633, 849488676, 849269032, 849020481, 848673940, 848357260, 848164558, 847977698, 847658217, 847309887, 847088277, 846882939, 846553445, 846229494, 846041560, 845867574, 845571339, 845241010, 845007718, 844826758, 844572961, 844272494, 844062030, 843890727, 843610346, 843285024, 843071759, 842915356, 842670500, 842378378, 842182696, 842049241, 841828644, 841563165, 841405094, 841316760, 841141164, 840912402, 840784907, 840739131, 840631485, 840472996, 840393126, 840367496, 840247273, 840039968, 839916587, 839906752, 839871764, 839748621, 839657426, 839659393, 839640796, 839540184, 839470565, 839518905, 839543104, 839430928, 839314878, 839293242, 839262962, 839163423, 839099884, 839136720, 839161456, 839079738, 838981032, 838952661]
2110.9H38952661j7405r0480j04546j9312J0967p3969j05203l3617j1682p6175r8705
2133.4H38332534k9981j5140r1433j27435q8990o6519j02877j28567j09077j05798
2153.8H37466717j29104j27435j14023j16766j41442j65701j75952j68086j33276j18017
2174.2H36076915j38223j61290j78993j76906j42634j32919j65403j67310j24931j17421
2194.6H34570885j47105j53362j53900j45554j24037j26720j43528j42991j20700r7274
2215H33215714r4951j12176j34468j42932j34885j42097j55926j42694j30474j52231
2235.4H31872880j69694j51753j49310j90437k39909k78234k78175k45154k47896k58564
2255.8H29663754k43187k78116l24905k95043k53617k73288l03149k71916k25962k51710
$$ y = [838952661, 838935256, 838844776, 838740230, 838720918, 838731885, 838657916, 838552713, 838519096, 838507414, 838431239, 838332534, 838302553, 838287413, 838195980, 838068545, 837979555, 837913036, 837810159, 837681592, 837572515, 837466717, 837337613, 837210178, 837096155, 836979389, 836837947, 836672246, 836496294, 836328208, 836194932, 836076915, 835938692, 835777402, 835598409, 835421503, 835278869, 835145950, 834980547, 834813237, 834688306, 834570885, 834423780, 834270418, 834116518, 833970964, 833846927, 833720207, 833576679, 833433688, 833312988, 833215714, 833120763, 833008587, 832874119, 832731187, 832596302, 832454205, 832298279, 832155585, 832025111, 831872880, 831703186, 831551433, 831402123, 831211686, 830971777, 830693543, 830415368, 830170214, 829922318, 829663754, 829420567, 829142451, 828817546, 828522503, 828268886, 827995598, 827692449, 827420533, 827194571, 826942861]
2276.1H26942861l09586k86162k08795k17021k88308k96354k77936l20018l78012l62993
2296.5H23997676l17573l58463m29749m45366m44829m85421n44309n35369m74870m94302
2316.9H19467425o13510o63400o01470n62132n97477o24835o07670o45399o94453o31869
2337.3H13225210n40018n48005o41883m44949N1380M7803m99309r82701j001656p69318
2357.7H07896554o27398o11007n34535m27186l61741k84433k23518k07543k34306k84612
2378.1H04100275k72095k43426l21865m74453n62310n73218n97834o52015o83070o81162
2398.5G99038827o92725p11679p12335o83368o50942o78956p34866p25687o78420o69062
2418.9G92100787o84559o82116o35743n89073n94556o21319o05881n63204n81682o26028
$$ y = [826942861, 826633275, 826347113, 826138318, 825921297, 825632989, 825336635, 825058699, 824738681, 824360669, 823997676, 823680103, 823321640, 822891891, 822446525, 822001696, 821516275, 820971966, 820436597, 819961727, 819467425, 818853915, 818190515, 817589045, 817026913, 816429436, 815804601, 815196931, 814551532, 813857079, 813225210, 812685192, 812137187, 811495304, 811050355, 811101735, 811149538, 810650229, 809667528, 808665872, 807896554, 807269156, 806658149, 806123614, 805696428, 805334687, 805050254, 804826736, 804619193, 804384887, 804100275, 803828180, 803584754, 803262889, 802788436, 802226126, 801652908, 801055074, 800403059, 799719989, 799038827, 798346102, 797634423, 796922088, 796238720, 795587778, 794908822, 794173956, 793448269, 792769849, 792100787, 791416228, 790734112, 790098369, 789509296, 788914740, 788293421, 787687540, 787124336, 786542654, 785916626]
2439.3G85916626o07788n73218n91755o25491o18935o03437o03914o06060o25849o40690
2459.7G79819489o50406o76036o96242o89983o63043o72102p01546p02202p06435p29322
2480.1G72932172p40886p33197p28726p53880p80165p58290p40826p76828p89225p50184
2500.5G65379965p64131q28624q46028q07047p80881q27908q85725q80480q69334q95679
2520.9G56994128r13441q98778r00627r42945r74774r60946r46045r66311r82165r69649
2541.3G47538447r75549j001716r92953r73523r81212r94742r94205r62675r32395
2559.6G38729477r42051r34184q76069q31425q38161q55327q16464p46846p28727p23361
2580G30436862o76692o43015o53565o45161n88715n52713n72563o03318o08981o24716
$$ y = [785916626, 785308838, 784735620, 784143865, 783518374, 782899439, 782296002, 781692088, 781086028, 780460179, 779819489, 779169083, 778493047, 777796805, 777106822, 776443779, 775771677, 775070131, 774367929, 773661494, 772932172, 772191286, 771458089, 770729363, 769975483, 769195318, 768437028, 767696202, 766919374, 766130149, 765379965, 764615834, 763787210, 762941182, 762134135, 761353254, 760525346, 759639621, 758759141, 757889807, 756994128, 756080687, 755181909, 754281282, 753338337, 752363563, 751402617, 750456572, 749490261, 748508096, 747538447, 746562898, 745561182, 744568229, 743594706, 742613494, 741618752, 740624547, 739661872, 738729477, 737787426, 736853242, 735977173, 735145748, 734307587, 733452260, 732635796, 731888950, 731160223, 730436862, 729760170, 729117155, 728463590, 727818429, 727229714, 726677001, 726104438, 725501120, 724892139, 724267423]
2600.4G24267423o67035o75083o27875n98431o48081p06315o97970o75559o98448p28786
2620.8G17543840p06613o64115o80565p46549p55787p13229p22587p69794p73608p42555
2641.2G10268438p37846p40230o97196o41703o58870p43091p67768p05122o74129p08103
2661.6G03194380p03931o51240o45042o79254o61433n98669n89669o30736o31690n85139
2682F96817577n81384o19829n89609n06639m98355n49137n43654m87864m66466m86672
2702.4F91487968m83274m21346l68952l94285m29392l82662l07679l09646l28541k90155
2722.8F87772036k60532k75612k60830j79708j38939j86026k21133j91331j33693j30594
2743.2F85793638j90735j97887j54018j66595k17498k09331j52946j63555k17080k15054
$$ y = [724267423, 723600388, 722925305, 722297430, 721698999, 721050918, 720344603, 719646633, 718971074, 718272626, 717543840, 716837227, 716173112, 715492547, 714745998, 713990211, 713276982, 712554395, 711784601, 711010993, 710268438, 709530592, 708790362, 708093166, 707451463, 706792593, 706049502, 705281734, 704576612, 703902483, 703194380, 702490449, 701839209, 701194167, 700514913, 699853480, 699254811, 698665142, 698034406, 697402716, 696817577, 696236193, 695616364, 695026755, 694520116, 694021761, 693472624, 692928970, 692441106, 691974640, 691487968, 691004694, 690583348, 690214396, 689820111, 689390719, 689008057, 688700378, 688390732, 688062191, 687772036, 687511504, 687235892, 686975062, 686795354, 686656415, 686470389, 686249256, 686057925, 685924232, 685793638, 685602903, 685405016, 685250998, 685084403, 684866905, 684657574, 684504628, 684341073, 684123993, 683908939]
2763.6F83908939j99735k21848k34843k20418k23577k65538l26217l45170l42488l91364
2784F81137741m56870m75883m83752n41150o22034o66917o97255p62999q14497q42214
2804.4F74774170q87156r22739r69947j036703j083613j119077j121521j092493j102090
2822.7F65438831j162648j233459j285374j306653j312733j337826j407623j559615
2839.1F54832900j757801j882672j941502j973570j943230j822114j591087j329660
2855.4F40591264j161576j116573j178503j306475j439452j558840j668453j725555
2871.7F29435837j706838j684726j697301j711190j723469j740276j777768j850486
2888F15543783j877427j834035j836956j891494j918971j925349j924694j917183j928151
$$ y = [683908939, 683709204, 683487356, 683252513, 683032095, 682808518, 682542980, 682216763, 681871593, 681529105, 681137741, 680680871, 680204988, 679721236, 679180086, 678558052, 677891135, 677193880, 676430881, 675616384, 674774170, 673887014, 672964275, 671994328, 670957625, 669874012, 668754935, 667633414, 666540921, 665438831, 664276183, 663042724, 661757350, 660450697, 659137964, 657800138, 656392515, 654832900, 653075099, 651192427, 649250925, 647277355, 645334125, 643512011, 641920924, 640591264, 639429688, 638313115, 637134612, 635828137, 634388685, 632829845, 631161392, 629435837, 627728999, 626044273, 624346972, 622635782, 620912313, 619172037, 617394269, 615543783, 613666356, 611832321, 609995365, 608103871, 606184900, 604259551, 602334857, 600417674, 598489523]
2906.4E98489523j943350j956761k022385k094984k059460j931489j787066j569688
2922.7E83124340j251579r71615p82132o44982n42700m49419l82960l55959l06189
2941E77436805k68042l89338o31869q02040q42273r07183j045108j052379r36032r00685
2961.4E69661856r60470j008451j026690j049339j055122j066625j109361j110018
2977.8E61275780j106918j223683j349807j361489j364708j373768j374900j486182
2994.1E50634325j632512j702726j755774j802504j851559j873195j809120j766145
3010.4E36440790j904309k163529k339304k396405k437889k486170k546310k622545
3026.7E17544329k632856k622903k657175k697944k750755k740264k670228k670378
$$ y = [598489523, 596546173, 594589412, 592567027, 590472043, 588412583, 586481094, 584694028, 583124340, 581872761, 580901146, 580119014, 579474032, 578931332, 578481913, 578098953, 577742994, 577436805, 577168763, 576779425, 576147556, 575345516, 574503243, 573596060, 572550952, 571498573, 570562541, 569661856, 568701386, 567692935, 566666245, 565616906, 564561784, 563495159, 562385798, 561275780, 560168862, 558945179, 557595372, 556233883, 554869175, 553495407, 552120507, 550634325, 549001813, 547299087, 545543313, 543740809, 541889250, 540016055, 538206935, 536440790, 534536481, 532372952, 530033648, 527637243, 525199354, 522713184, 520166874, 517544329, 514911473, 512288570, 509631395, 506933451, 504182696, 501442432, 498772204, 496101826]
3043D96101826k736091k739370k636582k559066k565562k557397k519369k462507k353251
3061.4D72972631k249419k187848k196431k294273k324670k217591k076983k028049
3077.7D55397367k147495k283842k309024k327770k317697k276659k334505k392411
3094D37007964k360791k314926k348363k460420k484173k375394k333820k450376k442569
3112.4D15437132k218604k144068k334625k595007k767504k689600k412080k239287
3128.7C96036357k288163k398670k332210k116502k089679k310395k405912k269417
3145C77825409k148181k058446j979113k089351k269835k232790k123415k101869k078294
3163.4C58744115k015293j967341j979410j969844j917094j893640j894981j881361
$$ y = [496101826, 493365735, 490626365, 487989783, 485430717, 482865155, 480307758, 477788389, 475325882, 472972631, 470723212, 468535364, 466338933, 464044660, 461719990, 459502399, 457425416, 455397367, 453249872, 450966030, 448657006, 446329236, 444011539, 441734880, 439400375, 437007964, 434647173, 432332247, 429983884, 427523464, 425039291, 422663897, 420330077, 417879701, 415437132, 413218528, 411074460, 408739835, 406144828, 403377324, 400687724, 398275644, 396036357, 393748194, 391349524, 389017314, 386900812, 384811133, 382500738, 380094826, 377825409, 375677228, 373618782, 371639669, 369550318, 367280483, 365047693, 362924278, 360822409, 358744115, 356728822, 354761481, 352782071, 350812227, 348895133, 347001493, 345106512, 343225151]
3179.7C43225151j865118j855642j831770j786709j736194j696288j676470j674325
3196C29102635j648694j589864j518488j472712j469403j470268j426697j345277j281947
3214.3C15879285j278281j302779j260787j192421j171767j137167j077921j060724
3230.7C06397438j055807j034170j009792r78351r51409r23723q97497q78751q81404
3249B97786534q78871q26686p67380p69019q19207q40693q04335p64638p16806o46293
3269.4B89952606o87063q11696q39799p94322p66426p63118p72953p63089p12216o21974
3289.8B82419950o03080p57664r03666r23098q73178p00801m96120n86658r43870j187235
3310.2B74444580j176298j043409r37551r06646r09806q51869q06660r81330j206041
$$ y = [343225151, 341360033, 339504391, 337672621, 335885912, 334149718, 332453430, 330776960, 329102635, 327453941, 325864077, 324345589, 322872877, 321403474, 319933206, 318506509, 317161232, 315879285, 314601004, 313298225, 312037438, 310845017, 309673250, 308536083, 307458162, 306397438, 305341631, 304307461, 303297669, 302319318, 301367909, 300444186, 299546689, 298667938, 297786534, 296907663, 296080977, 295313597, 294544578, 293725371, 292884678, 292080343, 291315705, 290598899, 289952606, 289265543, 288453847, 287614048, 286819726, 286053300, 285290182, 284517229, 283754140, 283041924, 282419950, 281816870, 281059206, 280155540, 279232442, 278359264, 277658463, 277162343, 276575685, 275631815, 274444580, 273268282, 272224873, 271287322, 270380676, 269470870, 268619001, 267812341, 266831011, 265624970]
3328.6B65624970j178831j027554q88973p61748q73834j144290j217007j200617j125604
3346.9B56206512q87244r27836j306534j414716j182080r99569j014263j024842q12397
3365.3B46637031o31481q44166j297027j419454j075670p87050p61002q12576p78198
3383.6B38230407o27026l42577Q240m5851n15506o09845j17138K07708j76847o72624
3404B35338941m97505p3761N9188N0887p122n9322O5252K51204L11926M13284O76289
3426.5B36529261Q83490Q16643Q24779J039550R30890N64382N62429R18284J236067
3444.8B44305775J368150J329168J342789J479268J635790J776129J865863J825572
3461.1B56928504J872777K248675K513975K182901J653165J657187K058298K478242
$$ y = [265624970, 264446139, 263418585, 262529612, 261767864, 260894030, 259749740, 258532733, 257332116, 256206512, 255319268, 254391432, 253084898, 251670182, 250488102, 249488533, 248474270, 247449428, 246637031, 246005550, 245161384, 243864357, 242444903, 241369233, 240582183, 239821181, 239008605, 238230407, 237603381, 237260804, 237269044, 237223193, 236707687, 236097842, 235980704, 236188412, 236011565, 235338941, 234841436, 234767675, 234826863, 234877750, 234870628, 234811306, 234876558, 235127762, 235439688, 235852972, 236529261, 237412751, 238229394, 239054173, 240093723, 241024613, 241588995, 242151424, 243069708, 244305775, 245673925, 247003093, 248345882, 249825150, 251460940, 253237069, 255102932, 256928504, 258801281, 261049956, 263563931, 265746832, 267399997, 269057184, 271115482, 273593724]
3477.4B73593724K615750K347201K256423K548546K681732K632856K742201K911568
3493.8B94330001L069430L135860L143967L194719L110051L007770L226876L610552
3510.1C19829226L870189L864646L712535L791719M110664M461229M445553M206032
3526.4C52291793M317015M633725M846424N085527N242795N159796N313962N650640
3542.7C92541677N703360N439967N272507N481929N750656N779177N782634N904376
3559D37656283N948425N795330N766838O227076O296575N771906N584627N726278N822688
3577.4D90596026N912781N976886N862176N760074N843401N858898N659640N710065
3593.7E37179947N974769O172061O261826O254196O204903O244600O665528P048786
$$ y = [273593724, 276209474, 278556675, 280813098, 283361644, 286043376, 288676232, 291418433, 294330001, 297399431, 300535291, 303679258, 306873977, 309984028, 312991798, 316218674, 319829226, 323699415, 327564061, 331276596, 335068315, 339178979, 343640208, 348085761, 352291793, 356608808, 361242533, 366088957, 371174484, 376417279, 381577075, 386891037, 392541677, 398245037, 403685004, 408957511, 414439440, 420190096, 425969273, 431751907, 437656283, 443604708, 449400038, 455166876, 461393952, 467690527, 473462433, 479047060, 484773338, 490596026, 496508807, 502485693, 508347869, 514107943, 519951344, 525810242, 531469882, 537179947, 543154716, 549326777, 555588603, 561842799, 568047702, 574292302, 580957830, 588006616]
3610E88006616P154643P249057P199288P542491Q187473P943630P448196P618308Q920014
3628.4F57269716R687722Q639157Q354366Q623421Q647263Q655429Q493900Q191526
3644.7G26562500Q300900R093047Q831143P105708O476104P032693O719470N759835
3661G85881400N177617M861117M513621M301131M074692L302873K802968K577424K247691
3679.4H19740534K160966K171040K082526K003432J699447J201451R90093R70900R48310
3697.7H33968699Q39353P19666P06315P88570P85708N30839K00570K34246L79622K97785
3718.1H39451373J23739N6803O9678R6202K17914K56062J61827P212l6001J52707J78933
3740.5H40736449j74880l92020l2842m0293l93450l18468k8074p033j93596k73943
$$ y = [588006616, 595161259, 602410316, 609609604, 617152095, 625339568, 633283198, 640731394, 648349702, 657269716, 666957438, 675596595, 683950961, 692574382, 701221645, 709877074, 718370974, 726562500, 734863400, 743956447, 752787590, 759893298, 766369402, 773402095, 780121565, 785881400, 791059017, 795920134, 800433755, 804734886, 808809578, 812112451, 814915419, 817492843, 819740534, 821901500, 824072540, 826155066, 828158498, 829857945, 831059396, 832049489, 833020389, 833968699, 834808052, 835527718, 836234033, 837022603, 837808311, 838339150, 838539720, 838773966, 839153588, 839451373, 839575112, 839631915, 839701593, 839797795, 840015709, 840271771, 840433598, 840440810, 840404809, 840557516, 840736449, 840561569, 840169549, 840136707, 840096414, 839702964, 839384496, 839356422, 839349389, 839155793, 838881850]
3760.9H38881850j89543j14560j13308k31505l45468k51293n8770n067j89602l57092
3781.3H37025642l65138l83019l36111j87277q7441j20043k06054j94013k84612m42922
3801.7H34419012l07739l26276m07099j53899j371j55509k89976k34008m64917o33955
3822.1H31444263l49760k20239k50816k59578j66893n5433k62200n16534m37856l89695
3842.5H28535259l48687j68205k2947j91510q27492q67605j35541M8697j17719l13520
3862.9H25590730l38853k25782l29971m56155l79503k30431j41382k65360k66552j49131
3883.3H22807610k75910l32713l10123l86357k78712p6592q2671k24829l64363m58062
3903.7H20017278l53396j66058j60456k11954j65343j13011j47819k16306k69770k61903
$$ y = [838881850, 838692307, 838577747, 838464439, 838232934, 837887466, 837636173, 837577403, 837572336, 837382734, 837025642, 836660504, 836277485, 835941374, 835754097, 835666656, 835546613, 835340559, 835146546, 834861934, 834419012, 834111273, 833784997, 833377898, 833223999, 833222628, 833067119, 832777143, 832543135, 832078218, 831444263, 831094503, 830874264, 830623448, 830363870, 830196977, 830141544, 829879344, 829362810, 828924954, 828535259, 828186572, 828018367, 827995420, 827803910, 826976418, 826108813, 825973272, 826021969, 825904250, 825590730, 825251877, 825026095, 824696124, 824239969, 823860466, 823630035, 823488653, 823223293, 822956741, 822807610, 822531700, 822198987, 821888864, 821502507, 821223795, 821147203, 821064532, 820839703, 820475340, 820017278, 819663882, 819497824, 819337368, 819125414, 818960071, 818847060, 818699241, 818482935, 818213165, 817951262]
3924.1H17951262j73211j52528k29657k21074j15990j18435j87158k07723j94430j31071
3944.5H16219985q3088r5725j32919j63674j47224j24991j58011j76073j40309r9480
3964.9H14898491p9811r9599j18911j19567j45257j65283j30296o8188m5836j08898
3985.3H13816845j85251j56283p0870o3419j18733j48356
3997.5H13073933
$$ y = [817951262, 817778051, 817625523, 817395866, 817174792, 817058802, 816940367, 816753209, 816545486, 816351056, 816219985, 816136897, 816041172, 815908253, 815744579, 815597355, 815472364, 815314353, 815138280, 814997971, 814898491, 814818680, 814719081, 814600170, 814480603, 814335346, 814170063, 814039767, 813971579, 813925743, 813816845, 813631594, 813475311, 813404441, 813341022, 813222289, 813073933]
##END=$$ End of the data block
