##TITLE=$$ Begin of the data block
##JCAMP-DX=5.00 $$ ACD/SpecManager v 10.08
##SPECTROMETER/DATA SYSTEM=Varian
##DATE=18 Dec 2012 10:13:42
##DATA TYPE=INFRARED SPECTRUM
##DATA CLASS=XYDATA
##ORIGIN=
##OWNER=
##NPOINTS=3735
##FIRSTX=399.26403809
##LASTX=4000.35498047
##MAXX=4000.35498047
##MINX=399.26403809
##MAXY=82.79550171
##MINY=31.25844955
##XFACTOR=1.0000000000
##YFACTOR=0.000000100000000
##FIRSTY=68.41959381
##DELTAX=0.96440572
##XUNITS=1/CM
##YUNITS=TRANSMITTANCE
##XYDATA=(X++(Y..Y))
399.3 684195938 677994003 696606598 703981857 694533844 689939804 700408325 713842163 713010330
407 713010330 706085281 701568069 700304260 699622955 695181885 693604050 691014786 693652039 696556625
415.7 696556625 696445541 693289413 673611755 696701736 703631058 695426712 687545700 679238663
423.4 679238663 688273239 697281876 698400192 696289673 697704849 704762192 710919113 709399872
431.1 709399872 699039001 697714615 697611618 693150482 691951294 692635193 697359924 700237503 702368393
439.8 702368393 702673569 699618988 694006653 686630936 688239441 692531128 694503784 692146301 687899475
448.4 687899475 691272202 695281525 693201904 689358215 689145737 689959030 687658997 687672272 688519897
457.1 688519897 684539261 685010452 688726959 694484406 694585190 689794846 687721634 685329437 686913757
465.8 686913757 686568375 679545670 680971832 684624405 685956650 686804657 686203232 690567474 690081024
474.5 690081024 687655945 686472702 683382950 683105240 685255203 684600449 686850281 694300537 694348068
483.2 694348068 690869141 693554916 692652969 690156555 690603867 689233704 688115234 691233521 693060150
491.8 693060150 692632599 695238190 697658768 698564453 697326813 693169785 688586578 685908127 686306152
500.5 686306152 687600174 688111801 689519806 691080704 692354202 691317673 687058182 687568817 688793488
509.2 688793488 684231644 681011047 680510635 678679123 678677444 681748199 682896118 681539078 680811615
517.9 680811615 678697128 675928268 672694016 669027634 670675201 672980652 673152695 675915527 675086060
526.6 675086060 672804489 672504272 672580872 672738800 670608063 667890320 667146759 668800888 670951538
535.2 670951538 673856049 676823425 678150101 677801819 675300064 673658447 671447144 668250122 669058533
543.9 669058533 673001022 677178345 678338242 678684845 679842682 680170288 679860916 677426910 676059799
552.6 676059799 676552048 676155624 676017609 676019745 676338501 677944031 679788742 680107803 678973160 677928085
562.3 677928085 677569351 676645203 674955750 675140991 677163086 680279694 682930603 682925644 682322693
570.9 682322693 680971909 679204865 678478622 677129898 675813065 675625305 675052795 676351929 679303665
579.6 679303665 679581833 678203964 677525864 675925827 673806534 673579483 673749466 673224335 673928833
588.3 673928833 675807343 678527222 680713120 680686874 679888458 679187698 676037216 672285843 671479416
597 671479416 671541519 672255325 671540222 669771347 670815659 670784760 668597412 664284210 658623810 652912292
606.6 652912292 646226501 639683685 632022591 623061371 612335892 601102409 590104942 581984367
614.3 581984367 576777229 572787552 572072601 570521240 567721596 562528267 556255112 550435600 543840790
623 543840790 540292206 540770874 546798782 556791191 569543457 583422928 596845016 606481895
630.7 606481895 611450500 614192314 613785057 610270805 603886070 598022690 593283806 588586044 586661263
639.4 586661263 589480438 599322090 612522888 626935387 640690384 653825226 666002731 675183563
647.1 675183563 681399918 686804428 689870224 690348816 691062393 692882690 694857407 696115875 698046494
655.8 698046494 699729538 701540451 703471985 704061432 704595413 703639221 702041626 701378021 701179733
664.5 701179733 703909302 708754044 710370483 702827454 706113586 709849777 711418991 710581436 709262695
673.2 709262695 708914032 707841034 708245926 710450363 712471542 714954758 716772156 716200562 714958801
681.8 714958801 714602280 714340363 713417664 712237244 712134781 712852936 713336105 713210754 712778931 711969147
691.5 711969147 710758286 709364319 707297134 705807343 704359818 703448029 703919754 703885727 704925232
700.2 704925232 705670242 705188522 706028900 706636581 706163254 704805222 704257965 705206375 705873566 707138367
709.8 707138367 709599304 712796783 715059128 716208496 717366409 717326889 717260284 718172073 718314972
718.5 718314972 718534775 720634003 723553314 725134888 725844803 727351379 728586349 727478867 724903488
727.2 724903488 723316803 722189178 721194458 720774689 720432892 722075882 723449402 722975006 722759552
735.8 722759552 722084274 721181335 719300003 717365952 717390137 718766708 721005554 722947464 724207458
744.5 724207458 725194931 726557159 727598495 727455826 727707443 728898392 730896530 733656998 735896072
753.2 735896072 737551270 740940323 744632339 746943665 748584366 748082428 747387009 747794495 748193283
761.9 748193283 748414688 748970032 749623871 750273895 752434311 753432693 753093414 752213745 750284424
770.6 750284424 748902130 747615051 747219162 747403870 748676910 751277542 753503723 756074905 758965988
779.2 758965988 760600357 760226974 760254822 760382843 760419922 760606537 760936890 762921066 764724960 767824326
788.9 767824326 769996643 769921875 770572205 769609451 768208694 766989365 766048584 766661072 768736801
797.6 768736801 770760269 771190491 771389236 771052094 770276871 769188309 768682327 769060287 769087906 768699188
807.2 768699188 768171768 769330444 771564484 772650070 772776642 773840561 773490524 770942459 770265503
815.9 770265503 770188446 769839172 769653702 770994949 773551865 774591446 775153656 775092926 773962097
824.6 773962097 771743393 770156021 769155426 767281418 766369553 766026611 765060196 763712997 763062515
833.3 763062515 762194214 759707489 755928574 751825027 748873749 746237106 743780670 742414780 741944656
841.9 741944656 742103424 741799088 740543747 739328766 737769165 736245880 736420746 737312851 738195343
850.6 738195343 739409027 741410980 744242783 747363358 750136719 751628723 753264389 754674454
858.3 754674454 755415726 756711426 757510681 758909836 761129608 763438034 764887085 766173706 768201523
867 768201523 768388138 767759552 766990891 766321640 766052551 766929245 769594574 771162109 771564713 772015991
876.7 772015991 773266068 773813019 772125244 769186554 767123337 766378098 764253922 762809067 762920074
885.3 762920074 763481216 763105927 760831146 759696045 758936234 757680588 756972656 757241364 758060760
894 758060760 757939987 757481308 758209915 760205307 760911636 760118408 759759140 760047989 760097427 758659897
903.7 758659897 757165222 756913605 756579742 755661392 754196243 752250900 751081009 748846283 745862961
912.3 745862961 744168091 741721497 739438019 737847290 736363907 734448700 731831207 729481812
920 729481812 727321091 725741501 724170380 722239304 719437943 717400436 716601639 715607910 715922470
928.7 715922470 716380539 716629944 716876755 716657028 716941071 717710953 718654633 719685898 722248306
937.4 722248306 724992371 727357788 730433426 732882156 735693054 738594666 740972595 742656708
945.1 742656708 743859100 745333481 746872635 748815842 750219574 752022247 752881927 752916107 753408737
953.8 753408737 752572021 752157516 751312408 749920883 748653488 747173920 746111374 744707413 743106308
962.5 743106308 741103210 739350281 737090454 734066925 731713104 729872742 728328247 727235336
970.2 727235336 726629715 725710678 725343781 725093613 723946381 722889023 721779633 720905914 720087357
978.9 720087357 719227066 718212738 716847305 715334244 713705673 712456741 711205673 709431610 706411514
987.6 706411514 702639542 699151154 695500259 691656647 687487411 680696793 670174255 657299271
995.3 657299271 646635590 646942444 657449417 668759079 675063858 676865692 677255554 677398529
1003 677398529 677248535 677181396 677122498 676780243 675996475 675519943 674742508 672897186 670938721 669411011
1012.6 669411011 668242340 667047501 665790253 664372635 662417831 660295868 658150787 655873108
1020.3 655873108 653474731 651317520 649315109 646842194 644805374 642862625 641593552 640515671
1028.1 640515671 637487030 634997902 632578278 630129318 627672119 624187775 621977844 620234032
1035.8 620234032 619709053 619754677 619045830 617737808 616375198 616249657 615718613 615539513 615599709 615292091
1045.4 615292091 614703865 614571037 615504990 616606789 617899170 618156395 618566971 619280434 620091743
1054.1 620091743 620099068 619246025 619282417 619559174 621193428 621559448 620932465 620377655 619364662 619571991
1063.7 619571991 618704224 617128716 615085945 613875313 613467445 612998047 613053551 612207680 611760292
1072.4 611760292 610965691 610952797 610024300 608069191 607184296 605472527 604895172 604111099 603298035
1081.1 603298035 602027435 600924568 600615387 598682823 596907310 594424553 591602783 587646523
1088.8 587646523 584150391 580209427 573781128 568055191 560443726 552351189 542939835 532940636
1096.5 532940636 522860947 511951103 502264252 491239586 481748848 470794830 460091019 449947968
1104.2 449947968 439941559 431378441 420625038 412351074 403176613 394924431 386885986 379413948
1112 379413948 373515625 367599640 365010986 361171188 360675468 359635162 359503441 360916710 360745239
1120.6 360745239 362676659 363496971 366852646 368022957 369663773 371604614 372466240 374205132 373087845
1129.3 373087845 373942604 372308197 370486565 367397461 364059334 362118073 357720642 355891838
1137 355891838 352583199 351227226 348667488 345907745 344394569 340786629 338356628 332940826 330212593
1145.7 330212593 326685677 323369751 320674553 317503853 316996727 313958797 313664417 312584496 313203888
1154.4 313203888 313433571 313034134 315150604 315394173 318570900 320030060 323457184 326408920 329309158
1163.1 329309158 334142113 337596741 343599586 347789650 354166641 359808998 366631317 374467201
1170.8 374467201 381022224 390341263 398109779 407338943 414370232 421868362 430032959 437339134
1178.5 437339134 445669403 452227402 460829620 468118668 475491371 482154770 488562584 495903358
1186.2 495903358 501021576 506720619 511152992 516255493 520634804 525337486 530890503 535324898
1193.9 535324898 541296692 546138306 551421890 556386642 561565933 566713295 570819588 576115150
1201.6 576115150 581310158 587312431 592015762 596400185 601343231 605634041 609609032 612489738
1209.4 612489738 615189400 617501640 620903931 624490166 627331085 630016861 632405739 634850998
1217.1 634850998 636560173 638620834 640075684 641055069 641544342 641493073 642351074 643110962 644529572
1225.8 644529572 645662231 646857147 647973328 648183365 648772125 649295425 650081253 650209274 650325470
1234.4 650325470 650847702 651787491 653305969 654209518 655379257 656416168 657282181 657735748 657892914
1243.1 657892914 657799149 657796783 658518982 658610992 659286957 660240707 661266556 661713104 661492996 662298889
1252.8 662298889 662684784 663165054 663176041 662684402 662695694 663299103 664619980 665336533 666030579 666737213
1262.4 666737213 667851944 668759079 668869476 668817520 669034729 670214157 670965118 672098618 673839569
1271.1 673839569 675970993 678176422 679655075 680854645 681350403 682288666 683292618 684326019 685943909
1279.8 685943909 687579498 689445038 691119308 693388672 695611191 697040710 698250580 699492950
1287.5 699492950 700761795 701630249 702625656 703797455 705528412 707469254 709028625 710785599 712312164
1296.2 712312164 713845825 715172729 715574951 715739441 716086807 716785889 717636185 718723297 719943314
1304.8 719943314 721282043 722728500 723263092 723453140 723648376 723698349 723829346 723394394 723258514
1313.5 723258514 723860550 724814911 725953217 727006149 727803574 727907257 728030853 728254471 728471832
1322.2 728471832 728833084 729125977 729876251 730546417 731195526 732509155 733658905 734483795 734804687
1330.9 734804687 734379730 733962708 733451538 733362808 733432999 732841415 733132324 734024048 734521713 734469681
1340.5 734469681 734918289 735576401 735024796 734166565 733607483 733298416 732963181 733016281 733397217 733313141
1350.2 733313141 733753586 733953857 733756332 733441238 732550049 731172485 730329819 730377045 729915924 730103378
1359.8 730103378 730521317 730891953 730987854 729169083 729354782 729188461 727764511 726809158 725633240
1368.5 725633240 724743423 724471207 724536743 724903336 725248489 724279480 722839050 722306900 721748505 720260391
1378.1 720260391 718924561 718517838 717654495 717348099 717535324 717838364 718617096 720100861 721375732
1386.8 721375732 719390106 719160614 720233307 720295563 720054855 720054016 721181183 721016388 719260864 719648132
1396.4 719648132 720140152 719622116 716836777 715478439 715238495 714845734 714978180 715142365 714147415
1405.1 714147415 714000244 714778137 714750824 714752731 714011917 712711716 711791687 710900497 710771790 710942535
1414.8 710942535 712033157 712905045 713556747 715422821 711730804 710483627 711970825 712482071 712236023
1423.4 712236023 710057602 710540466 712418518 713625336 715450211 716695328 715936050 716114807 717091293
1432.1 717091293 716930389 716826096 718591537 720294418 716534500 716664810 719917450 721930008 722739182
1440.8 722739182 723013153 723192139 723806305 723728714 723403854 723988571 724326782 723577728 725111237 727087326
1450.5 727087326 728096313 728785248 729013443 730222702 731101685 730032883 727196655 725629730 727658997
1459.1 727658997 729121017 731953506 734252396 735930099 738568726 737004242 734966354 735901642
1466.8 735901642 736704788 737152786 738365326 741406860 743449173 743346939 743341751 746030197 749003448
1475.5 749003448 748310394 748603897 749958267 750373154 751087799 751599350 752640152 754388504 755952377
1484.2 755952377 757203598 758988800 758764114 757437668 759158707 756421432 752606506 754054489
1491.9 754054489 755444031 756107483 758014984 760390549 754941864 755959702 755842896 751713715 752450180
1500.6 752450180 752087784 751188660 750876083 752999573 755628586 746703568 739065704 742134781 744265442
1509.3 744265442 743263397 744574509 743104401 739958572 740881500 740680313 740557327 737381516 735437622
1518 735437622 739679337 743387527 741119385 733616333 731324844 733178940 735678864 732686539 732640686
1526.6 732640686 733788605 731934204 732094879 732946014 732835999 732463455 730444641 723718033 725430527
1535.3 725430527 726787109 727881088 731579666 726769257 719654617 724191132 723713379 721748734
1543 721748734 723979874 723856277 719160995 721001740 721994476 723102188 723294525 720893478 722806168
1551.7 722806168 725002213 727329407 724273834 723453827 727628250 730740509 721411362 704168777
1559.4 704168777 717271042 724398880 728210144 730053253 730744934 728858337 728317032 729785461
1567.1 729785461 730582428 731678543 725816727 726459503 729028091 729375381 730058899 731551132 732452393
1575.8 732452393 722984695 723446198 723908844 722631683 721720810 720189743 719918823 718873749 718615799
1584.5 718615799 717758255 716106110 714507294 712379837 710707092 707575226 705934601 703564453
1592.2 703564453 702286758 701449890 699447632 698708572 696426544 694833755 692043228 689815063 687544632
1600.9 687544632 685199280 683452454 680318069 679311676 677782669 677158356 674839935 672988281
1608.6 672988281 670921860 667294846 666539459 663649292 662285538 660394516 660495605 660919495 650611801
1617.3 650611801 652065125 651651535 651108246 649228134 649518051 648398743 640429916 640458298 640039978
1626 640039978 641180344 638954811 637157364 636776390 635552139 635046959 633469658 635188217 637006645
1634.6 637006645 630179596 625862312 627692261 627842369 628335419 630028114 629392128 630368118 629702721
1643.3 629702721 630882187 632592888 630110435 631268272 628247108 630551262 633086548 637247353
1651 637247353 641080093 634905624 630799141 633033333 637501068 639019089 640328522 641471024 642955780
1659.7 642955780 645020218 647502060 649659348 648774796 652102356 654238434 655919342 658461914
1667.4 658461914 661304703 660959778 660356064 664442139 665071259 668627777 673708115 675534973 674185562
1676.1 674185562 676575089 679537277 681156311 683318634 683544388 687226334 693054886 694472504
1683.8 694472504 690833206 692270203 698078384 701741562 703262329 705664597 706892700 709021530
1691.5 709021530 711527023 714667664 719119568 724449234 721367569 723678741 729460068 734561310
1699.3 734561310 733382797 727888947 735519714 740317917 743153076 745139160 747385635 748216248
1707 748216248 749868088 753461533 754807816 754772797 756458588 758591232 761076584 761340256 761846619
1715.6 761846619 765887222 767815552 760859756 763716354 767547073 769384689 770434265 770471878 770121307
1724.3 770121307 771115952 772091446 772833405 774699173 777318420 776223984 775622864 780138855 784599380
1733 784599380 780032501 770496140 775593109 779445419 781113586 783738174 782588654 779974365 783982010
1741.7 783982010 786784973 785363998 785059738 787558975 789166641 790289230 791335526 791490021 794548340
1750.4 794548340 794327393 792406311 795533752 797756042 799537354 801263885 799200363 799294510 800906296
1759 800906296 802302246 804760437 802516022 802078323 804964371 805597153 806013412 807149277 807552109
1767.7 807552109 804855728 806826553 810804520 811065979 807260666 805242920 809180603 810913467
1775.4 810913467 809298248 810527115 811112747 812251282 812524796 810382614 810661545 812161636 813423996
1784.1 813423996 812520905 812268753 813804474 814291534 814630051 815840530 816094131 816235199 813369598
1792.8 813369598 812217712 815483398 816300125 815077133 816251221 818213806 817932281 816429672 817626953
1801.5 817626953 816822128 816015396 816656952 817007675 818088303 818751297 818657684 819630966 820868835
1810.2 820868835 819282379 818650131 819040222 818990097 819436111 819288483 819739532 819651566 819834824 820679474
1819.8 820679474 820835724 821494751 821279678 822096176 823264389 820237656 819508438 821319427 823311844
1828.5 823311844 823611832 819472122 820230713 822381592 822283478 822341919 822617950 822860413 822541428 821773682
1838.1 821773682 822416687 822766647 823318405 823740387 825343781 826048050 820591965 821967163 824095078
1846.8 824095078 823805466 822737808 823154068 823985062 823529587 823843384 824057388 824391098 824665298
1855.5 824665298 824709702 825094986 824561234 824304657 824458008 824529877 823986816 824007645 824640884 825400925
1865.1 825400925 826608810 826847763 827596817 826462784 823891373 823862305 824329224 824843521 824832611
1873.8 824832611 825399857 825843735 825865402 825858459 825933609 826044312 825580521 825689621 825497971 825583115
1883.4 825583115 825666351 825439148 825857391 826142349 827635727 827808609 825312042 825554504 826181412
1892.1 826181412 825914383 826232376 825849075 824781647 825394287 826078186 826487961 826832733 826948853
1900.8 826948853 826977081 826589050 826532822 826259308 825949249 825794296 825754242 825990143 826318665 826454163
1910.4 826454163 826356888 826981659 826669464 826128998 825649185 825701904 827111206 825063400 823966751
1919.1 823966751 825700302 826961594 827955017 826746521 825410538 825742111 825920486 825582962 825410995
1927.8 825410995 825465622 825588837 825721817 825863571 826501312 826311340 826152115 826410675 826110229 825804672
1937.5 825804672 825372543 825043793 825175552 826863403 827277451 824870300 825252075 825911026 825539627
1946.1 825539627 825503082 825492477 825166245 825074005 825163956 824874725 824799347 824919739 825342255 825637283
1955.8 825637283 825734863 825698776 825161819 824708557 824274292 824245682 824409561 824666595 824969254 825311966
1965.4 825311966 826092606 825547638 824783325 825037155 824752884 824222336 824024963 824181519 824107513 823868713
1975.1 823868713 824274673 824646072 824650879 824712143 824388962 823970108 823727341 823421707 823299866 823065567
1984.7 823065567 823082504 823455963 823654938 823501663 823187408 823931198 824383774 822865219 822201080 822513351
1994.3 822513351 822506790 822378540 822458572 822932358 822999115 822822342 823121567 823227921 822963409 822555008
2004 822555008 822398300 822307129 821988449 821769333 821602859 822047043 822670593 822733078 822557220 822250748
2013.6 822250748 822019882 821754608 821110535 820317993 820341797 820649185 820810852 821361694 821719360 821758652
2023.3 821758652 821610641 821330948 820846558 820226898 819973145 819820862 819953003 820315094 820513153 820808105
2032.9 820808105 821164932 821124954 820877609 820563660 819943848 819387512 818985062 818997574 819109726 819348526
2042.6 819348526 819840775 820082245 820575027 820542984 820010223 819502563 819013367 819048157 818595505 818103790
2052.2 818103790 818443146 818962860 819126434 819196091 819202805 818828201 818585892 818052216 817289352 817003326
2061.9 817003326 817372894 817740021 817528076 817516785 817828979 818125916 817582016 817057343 816923981 815976562
2071.5 815976562 815385895 815199509 814907684 814747391 815035248 815705261 815669861 815206451 814847641 814707489
2081.1 814707489 814434509 813887482 813492126 813062286 812875137 813345795 813951874 814251862 814446335 814334412
2090.8 814334412 814003830 813634567 813416290 813418503 813395233 813551025 813619614 814046707 814475403 814557724
2100.4 814557724 815041199 815258484 815085526 814544678 814027481 814089890 814592133 814773102 814632187 815495300
2110.1 815495300 816145477 816234207 816483612 816373444 815956039 815280228 814860687 814580307 814370880 814532166
2119.7 814532166 815271149 816023712 816359558 816495056 815863953 815413208 814900360 814030685 813738251 813639450
2129.4 813639450 814075470 814706497 815050659 815057068 815152206 815671844 815483551 814716644 814410248 814520493
2139 814520493 814221420 814050598 814640121 815278931 815782166 816274033 816479263 816249924 816061401 815691147
2148.6 815691147 815322266 815348434 815331573 815332184 815565338 816122284 816596985 817007980 817046661 816632843 816377563
2159.3 816377563 816016541 815555344 815012131 815117569 815720062 816166382 816589203 816620255 816690903 816672897
2168.9 816672897 816220627 815784531 815712509 815277710 814648895 814890900 815092926 815275879 815571289 815738831
2178.5 815738831 815538559 814881668 814821701 814901733 814654846 814190292 814269943 814829178 815109940 815778732
2188.2 815778732 816345291 816540375 816413727 816154785 815959778 815596161 815558701 815622711 815908279 816384811
2197.8 816384811 816672821 817024155 817510147 817868423 817688065 817309952 817194214 817289581 817213058 817212219
2207.5 817212219 817566528 817902756 818024292 818122559 818423615 818389053 818080978 817584763 817104111 817055969
2217.1 817055969 816975250 817100830 817457657 817944794 818406525 818354568 818254242 818288422 817946167 817661514
2226.8 817661514 817728043 817739792 817982178 817914963 817901001 818210068 817975540 817917099 818013458 817910538 817448044
2237.4 817448044 817042694 816697083 816322556 816846848 817347107 817591248 817628632 817577820 817518082 817159805
2247 817159805 817154312 817074127 817014389 816735153 816802750 817380829 817467422 817526627 817429428 817655182 817614136
2257.6 817614136 817350311 817189560 816710129 816851654 816967697 816991959 816849747 817063141 817734833 817718506
2267.3 817718506 817717209 817739944 817777710 817326050 816699600 816707306 817007217 817247696 817044830 817158279 817426224
2277.9 817426224 817679291 817644653 817467041 817526398 817214661 817131271 817068710 817175751 817076569 816840286
2287.5 816840286 817223511 817392044 817540741 817615433 817841797 817670441 817037811 816738510 816494675 816546402
2297.2 816546402 816623306 817386322 817914200 817854919 817837601 817364273 817465668 817352066 817148285 817082291
2306.8 817082291 816937561 817338486 817328568 817367325 817715759 817948303 817525177 817004929 817076492 817199173
2316.4 817199173 817508392 817266922 817082672 817318497 817481461 817515411 817627258 818013992 817982483 818323288
2326.1 818323288 818165894 817747726 817790756 817066193 816402969 816424332 817594147 818647079 819082184 819252472
2335.7 819252472 818971252 819366913 819401474 818853760 818384476 817637482 817046890 817180862 818472443 819008789
2345.4 819008789 817849808 817295456 817946320 819087753 819643784 818846207 818436356 818244324 818186951
2354.1 818186951 819293060 820154266 820988007 821162262 820078354 818531418 818431320 819679031 819269485
2362.7 819269485 818557358 818755569 818536301 818745575 820054245 820206757 819862061 819990387 819121552
2371.4 819121552 818479309 818307800 818315659 818366699 817726364 817366028 817963867 818587036 818693771 818890381
2381.1 818890381 818809814 818274765 817887115 817693024 817819901 818125229 818170471 817976837 818187103 818677368
2390.7 818677368 818830643 818554840 818204575 817965240 817535706 817538910 817793808 818074341 818443146 818350983
2400.3 818350983 818459778 818553543 818355942 817947388 817418365 817410049 817301788 816884689 816963959 817631760
2410 817631760 817890396 817580566 817419739 817701340 818106232 817765732 817084961 816636810 816586304 816812973
2419.6 816812973 816989441 817222977 817312088 817524338 817506485 816962357 816728897 816738205 816504288 816292572
2429.3 816292572 816156998 816021194 816282806 816587830 816676559 816571503 816347961 816218338 816260834 816366806
2438.9 816366806 815806885 815462875 815618668 815549545 815605164 815739899 815995102 816000061 815862808 815566101
2448.6 815566101 815247726 815225906 814895096 814771271 814763641 814867477 815170441 815307846 815395584 815140076
2458.2 815140076 814719238 814331818 814232330 814076767 814130936 814384232 813974762 813921509 814120026 814242630
2467.8 814242630 814447479 814305649 813815613 813099442 812825089 812927094 813058701 813275299 813626938 813825760
2477.5 813825760 813610687 813283920 813112869 812936096 812434998 812594223 812919235 812465134 812262497 812372513
2487.1 812372513 812463303 812393036 812469177 812584381 812355118 812164307 811901245 811515198 811196594 811159515
2496.8 811159515 811109924 810963974 811094971 811438751 811667328 811653290 811470642 810860825 810550003 810709152
2506.4 810709152 810736542 810561066 810146027 809892502 809786911 810018692 810312653 810366058 810188217 809705963
2516.1 809705963 809543762 809661484 810021744 809893036 809534225 809809036 809850693 809882660 809936676 809757538
2525.7 809757538 809373779 808947983 809021149 809045486 808634186 808269577 808430862 808936539 809093094 808798141
2535.4 808798141 808885880 808830795 808166428 807946854 807830200 807692566 807706451 807821960 808089294 808297424
2545 808297424 808275375 807945404 808182602 808217010 807625122 807363205 807306595 807324905 807020721 806863556 806994171
2555.6 806994171 807016373 806895905 806718063 806754532 806321564 805720291 805715485 806044464 805922470 805690536
2565.2 805690536 806140823 806486130 806580505 806621552 806457825 805968475 805635834 805532150 804995117 804777603
2574.9 804777603 805028763 805148621 805038910 805128098 805369949 805286865 805103607 804793167 804705887 804530258
2584.5 804530258 804037399 803982697 804226761 804129486 803938599 804230652 804189606 803822021 803569336 803462753
2594.2 803462753 803544159 803202133 802958374 802833862 802601547 802823944 803186951 803142319 802950363 802694321
2603.8 802694321 802028961 801735001 801839218 801714706 801292953 801318665 802123413 802168732 801784821 801473770
2613.5 801473770 800962677 800833664 800664749 800366058 800299988 800335083 800290298 800186310 799969406 799847641
2623.1 799847641 799869766 799789047 799730072 799414749 799071655 798740387 798507462 798652267 798566360 798689957
2632.8 798689957 799233093 799206543 798757172 798656387 798387527 798025894 797762299 797141037 796798630 796633987
2642.4 796633987 796708527 796852417 796719208 796885376 797016602 796932678 796375885 795822296 795576172 795386276
2652 795386276 795681763 795772324 795745850 795735474 795246964 794989395 795100784 794696808 793909988 793728943
2661.7 793728943 793908463 793727417 793464661 793848038 794253387 794118652 794023590 793824692 793654099 793555908
2671.3 793555908 793149261 792607574 792556915 792830124 792811584 792854385 792833710 792841797 792832870 792389450 791950607
2681.9 791950607 791775589 791429749 790633621 790540161 790949936 791041336 791244965 790974045 790392075 790300369
2691.6 790300369 790475693 790206070 789480896 789071655 789110107 789378815 789433975 789103546 789066696 789217758
2701.2 789217758 788913879 788988037 789309845 788912659 788527222 788190384 787767715 787575531 787419205 787475204
2710.9 787475204 787716446 787596817 787181702 786906204 786569824 786328430 786104355 785772858 785806961 786042862
2720.5 786042862 786143036 785893936 785664825 785724182 785961761 785940170 785178146 784401627 784253845 784627609
2730.2 784627609 784592743 784012375 783750000 783943329 784145966 783920288 783633652 783171234 782755890 782539368
2739.8 782539368 782271576 782359924 782250595 782133865 782160950 782225800 782517166 782229462 781603622 781219177
2749.4 781219177 781177673 781166458 780793381 780402145 780367966 780617371 780733185 780779037 780640335 780211945
2759.1 780211945 779713440 779132614 778698883 778567276 778511505 778423843 778485565 778537064 778381348 777994003
2768.7 777994003 777718658 777798233 777826614 777630920 777196121 776759109 776227646 775890427 775950546 775805359
2778.4 775805359 775803909 775594254 774915848 774640350 774545746 773946228 773366089 773383789 773612366 773705750
2788 773705750 773458023 773457947 773259735 772408676 771962204 771749725 771756058 771129456 770337524 771077347 771286087
2798.6 771286087 770466461 770260086 770376511 770267639 770018387 769511948 768706589 767968826 767367401 767153625
2808.3 767153625 766997833 766562653 766331787 766158905 766228485 766558075 766288910 765690231 765135574 764191132
2817.9 764191132 763606339 763650589 763215790 762559814 762475433 762314224 761933517 762072220 761906204 761000824
2827.6 761000824 760048370 759549942 759631729 759306870 758603210 758289948 758419724 758221741 757386017 756841583
2837.2 756841583 756188126 755282364 754334259 753173294 752226410 751408310 750720062 750012360 749321136
2845.9 749321136 748430634 746931839 745662460 744454880 742771454 741666107 741447296 741178360 740677948
2854.6 740677948 740221100 740103302 740198288 740331497 740535507 739996719 739221649 738968201 738819733 738638000
2864.2 738638000 738248520 737987366 737845917 737438126 736712799 735743942 734893723 734490356 734356384 733498917
2873.8 733498917 732229767 731713181 731825562 732086029 732174606 732194138 732285461 732003403 731248245 730533905
2883.5 730533905 730070343 729544983 728721695 728235550 728199997 727942276 727685623 727612534 727498550 726777344
2893.1 726777344 725866470 725186691 724105988 723485794 723255081 722882614 722456436 721902847 721824799 721681824
2902.8 721681824 721141434 720206451 719251022 718830185 718491364 718312225 717861328 717555389 717595673 716756668
2912.4 716756668 715825882 715453339 714849319 713844604 712729645 711703568 710885696 710351028 710004807
2921.1 710004807 709635391 709550705 709635849 709359283 709130325 708841324 708843689 709010315 708229218 707761688
2930.7 707761688 708186798 708654175 709149704 709494400 709762802 710123978 710207138 710056381 710039291 710245209
2940.4 710245209 710699387 711155167 711508636 711648178 711810150 712195206 712445908 712526550 711988907 711427917
2950 711427917 711145172 710673141 710555954 710233536 709904404 710195770 710216980 709704666 709496002 709757690
2959.7 709757690 709874039 709646759 709031830 708867111 709425888 710027618 710336533 710642242 711523895 712357941
2969.3 712357941 713095322 713435669 713135147 713275299 714008865 714744034 715129166 715843277 716735001 717537231
2979 717537231 718377838 718707504 718983612 719324875 719616013 719536743 719194641 719442825 720215149 720951691
2988.6 720951691 721323090 722103348 722972717 722978287 722475052 722266617 722661209 722868118 722607422 722290878
2998.2 722290878 722646484 723240204 723406601 723494034 723318329 723283081 723165207 722569275 721969147 721647415
3007.9 721647415 722005768 722535095 722525940 722364807 722472458 722542343 722462692 722071609 721418839 720846481
3017.5 720846481 720179367 719600601 719388580 719700089 719816132 719443436 719438019 719318771 718526917 717829056
3027.2 717829056 717484970 716929169 716529236 716215286 715984497 716231613 716087189 715784149 715696106 715526428
3036.8 715526428 715006332 714507980 714256744 713611221 713011856 712405548 712128220 712064667 711432648 710976791
3046.5 710976791 711063995 711405258 710942612 710098648 709417953 708685303 708364258 707926636 707644501 707378159
3056.1 707378159 706874695 706659012 706408157 705800018 705204391 704977570 704446564 704218979 704337845 704181137
3065.7 704181137 704107513 703726501 703538895 703109436 702360077 702390976 702245789 701182556 700201569 699715042
3075.4 699715042 699403839 699727173 699745255 699007797 698868027 698981400 698820190 698468933 697949753 697231903
3085 697231903 696429367 695974274 695735474 695362625 695111923 695064087 694810791 694354706 693813477 693479080
3094.7 693479080 692950516 692071609 691686935 691400452 691131744 691161880 690968323 690382919 690018158 689852829
3104.3 689852829 689384613 688813934 688129654 687460480 686840439 686455688 686269379 685859222 685665283 685847473
3114 685847473 686014175 685303726 684288559 683784637 683078156 682205963 681527634 680908279 680134506 680114288
3123.6 680114288 680500641 680234756 679595718 678768082 678215942 677448730 676420975 675621948 675060196
3132.3 675060196 674658356 674231491 674167404 673711014 673188629 672821503 671883774 670995178 670110016 669145279
3141.9 669145279 668145981 667698975 667886658 667905884 667394485 666497879 665999146 665655518 665174561 664275360
3151.6 664275360 663374481 662938690 662142029 661203232 660642471 660511093 660062180 659390411 658728333 657596893
3161.2 657596893 656502533 655347824 654546814 654111938 653579712 653587494 653755341 653376007 652732315 651899948
3170.9 651899948 650805588 650013428 649214859 648276443 647568207 647237549 647156830 646529694 645875473 645508270
3180.5 645508270 645086365 644480209 643737030 642646790 641129227 640215149 639444656 638999214 638876572
3189.2 638876572 638324356 638072891 637838440 637189560 636069679 634923058 634127388 633584938 632726440
3197.9 632726440 631724014 631417160 630955200 630893974 630702782 629541206 628642502 628025360 627335434
3206.5 627335434 626042976 624966393 624510765 624442863 624483452 624180260 624123421 623427353 622249908 621366653
3216.2 621366653 620857544 620448303 619520988 618655815 617702446 617178802 617053261 616715851 616250610 615648880
3225.8 615648880 615242424 614506912 613644981 612879524 612341690 611956062 611310692 610942230 610792160 610649872
3235.5 610649872 609655418 608200378 607892151 607620125 606371918 605699158 605414047 604658012 604746933
3244.2 604746933 604696007 604025078 603714561 603125534 602214622 601390915 601181030 600565147 599380646 598706551
3253.8 598706551 598256226 598004227 597888832 597472229 596792297 596456223 595723038 594810257 593999557 592750664
3263.4 592750664 592445564 592432365 592396393 592519455 591951637 591311607 590989151 590773735 589866982 588924026
3273.1 588924026 588250542 587558975 587287521 586360893 585569572 585994453 586698532 586915512 586292343 585318604
3282.7 585318604 584470482 583423805 582585182 582138596 581593170 581426582 581483650 581394691 581210747 580809250
3292.4 580809250 580220222 579632034 579100800 578243866 577682571 577088051 576532326 576649208 576548996 576302452
3302 576302452 575736313 575229568 574698830 573844986 573263054 572724686 572289124 571555710 570739059 570011787
3311.7 570011787 570140839 570386696 569157486 568357201 567609825 566683922 566305084 565829048 565373306
3320.3 565373306 565012283 564738693 564080582 563640900 563189583 562401352 561694145 560914536 560343285 559534492
3330 559534492 558684044 557709961 557509155 557621040 556469154 555830841 555518875 554903984 554247437 553256912
3339.6 553256912 552043533 551147728 550751266 550163994 549968376 549493065 548819504 548579445 547735863
3348.3 547735863 546711159 545887794 545002899 543422737 541933174 541513596 541554947 541391220 540644417
3357 540644417 540174065 539885521 539414978 538714333 537633095 536614647 535702705 534980583 534510612 534125862
3366.6 534125862 533152885 532208176 531935616 531381454 530597229 529731140 528669205 527785606 527162056
3375.3 527162056 526177063 525283165 525187492 525314789 525506592 525244179 524087257 522806015 522242203
3384 522242203 522025986 521693230 520999451 520294266 520663223 520778427 519976425 519301186 518754463 517960892
3393.6 517960892 517080994 517070808 517461853 517007637 516067352 515715103 515483398 514940529 514724503 514670906
3403.3 514670906 514542389 513917389 512860794 512074738 511990509 511912384 511644440 511701889 511340332 511039085
3412.9 511039085 510963211 510748291 510049667 509450378 509822769 509740257 509563217 509090080 508362427 508259583
3422.6 508259583 508303528 508675003 508943100 509566002 509489212 508279419 507670174 507887459 507888336 507380867
3432.2 507380867 507670708 507889290 508169937 508599701 508508492 508245277 508029480 508483963 508615723 509191666
3441.8 509191666 509189644 508578300 509051056 509682541 510616226 509631004 509644012 510810242 510475273 510667725
3451.5 510667725 510682755 510988007 511502304 512153168 512831001 512994537 513737183 513866043 514006424 514652596
3461.1 514652596 515222015 515010529 514895859 515835304 516498680 517035484 517283669 518290901 519285889
3469.8 519285889 519543915 520103264 520233154 520645447 520869980 520910873 521447906 522180672 523041115 523920326
3479.5 523920326 524626274 525143967 525950279 525906334 526566124 527502594 527358017 527938690 528279610 528409805
3489.1 528409805 528878326 529473648 530297928 531442108 532857933 533529434 533608093 533591385 534276085 534976883
3498.7 534976883 535542679 536859093 538394394 539224625 538865318 538677597 539124756 539967918 540585022
3507.4 540585022 542152710 543296242 542190475 543068619 544072990 544738426 545862427 546409569 547341881
3516.1 547341881 547982788 548783569 549321747 549297333 549658928 551352043 553461494 553247185 553424835
3524.8 553424835 555100174 556507263 556119156 555900154 557144127 558102837 558582268 559451027 561179390
3533.5 561179390 562086143 563641129 564551811 564032516 565239220 565483513 565559158 566435776 568223801
3542.1 568223801 569668121 570105019 571039925 571354065 572793007 572754440 573395844 575203705 577069702
3550.8 577069702 579315567 577341805 577491837 579111557 580308113 582341423 582791443 584070549 585278397
3559.5 585278397 586178970 586811981 588788567 590115623 589906273 594310722 595273399 593074036 592582092
3568.2 592582092 592042770 596020432 598010025 598901749 600714645 602428932 603054237 603911858 605831795
3576.9 605831795 605571861 607276344 609203835 609406738 610751152 612915878 614797745 615325546 619130173
3585.5 619130173 620886345 617948875 618515053 617300949 620751343 624622536 627502594 628513336
3593.2 628513336 628715134 632170639 629383011 630133095 634002647 634436340 637213440 637711716 638013268
3601.9 638013268 640495453 641900177 643371887 646696854 649950867 648701935 651410217 649715576
3609.6 649715576 648306580 656257935 657834244 655288315 659109573 657761230 660522842 664964142
3617.4 664964142 664990387 665413589 663184967 663560638 666901932 669467850 672370071 675631485 677873993
3626 677873993 680392075 686546249 684067078 671356812 676611404 681828613 687656097 689703217
3633.8 689703217 687168198 689000397 692153015 694388199 694497986 695255280 697100143 699732361 701159668
3642.4 701159668 700974274 703061447 706110687 711967545 712797241 708027725 713055573 713634872 708553619
3651.1 708553619 705902100 711227646 715416794 718991394 724291687 715695267 716450806 721525269
3658.8 721525269 723055954 723898544 723247681 724914246 725671616 726779709 728240128 728335266 732290192
3667.5 732290192 734237595 732581253 732818222 726294022 728214264 736431732 746036911 746281052 726913605
3676.2 726913605 729193726 736158752 740790100 738980408 738379211 740615692 742315445 743582306
3683.9 743582306 742963943 742356186 746462326 751995926 741330795 739561386 749034653 741825562
3691.6 741825562 740301514 745073242 745321732 746402206 745542221 744491577 745866470 746337814 749314423
3700.3 749314423 753158188 747439499 743840027 748245697 749798126 749529495 750213089 753538361 757754440
3709 757754440 750228424 754255753 758781509 743811722 748642273 753366089 753256836 753786316 756523743
3717.7 756523743 758112564 753887024 754523239 760770950 757839584 752386856 757171478 759118195
3725.4 759118195 758526764 754410782 754275665 758574753 759723969 765379410 762539597 754921494 765053940
3734 765053940 766568985 754908524 753477402 755560532 755785370 758088379 761737518 758006134 760654907
3742.7 760654907 772945938 766740494 748113022 756954193 762636261 768184891 765770493 754985275
3750.4 754985275 763833466 757091751 750796051 756377563 761111221 764876938 759315643 761042404
3758.2 761042404 766451263 757687454 755794373 760153885 761115952 761358490 764815979 761817474 757542572
3766.8 757542572 760946274 765359192 765008316 756421890 758538666 761082840 761000595 761966629 761295700
3775.5 761295700 762346344 763586884 766275711 766752777 759162292 760460968 762259064 763711014
3783.2 763711014 766175995 761848450 759787292 761124496 761777115 762417145 762130737 762239685 762338181
3791.9 762338181 763115082 763335648 764420776 767133560 762549362 758574753 760856857 765958099 773789902
3800.6 773789902 766680984 754493179 756995087 759756851 765781937 772003708 761741333 756507339
3808.3 756507339 760973663 763206482 763654327 763781128 763885040 766013412 772217407 769839859 754492874
3817 754492874 760571671 766980133 771219406 773310547 754642868 755322037 760543518 763315582 766712189
3825.7 766712189 766586151 761671524 761508942 763188171 766103439 766668625 757814178 761907196 769957428
3834.3 769957428 763562927 763064270 771588287 762716751 758484726 765543747 757987289 758091278 765417252
3843 765417252 763009796 759786301 763097305 764331970 763699112 765479507 765208664 767042313 772330780
3851.7 772330780 767203064 769922333 752609253 752660675 762847595 761234665 759583817 762667694
3859.4 762667694 765276184 767479477 762192001 762878342 770275879 762794342 755792847 760385284
3867.1 760385284 766625137 773013153 763803711 754766617 758498077 764313431 767929840 758443451
3874.8 758443451 759116669 762586899 762638779 765085983 769252853 762427826 755652008 762431030 762853622
3883.5 762853622 763782654 769020767 756581573 757136612 760768280 762338104 767501984 766085968
3891.2 766085968 755767822 757638245 761694717 760801468 762317276 763507462 765985794 767187576
3898.9 767187576 757319107 762651596 764281311 759620209 764910660 760784760 758538055 758783646
3906.7 758783646 759446182 761875916 761351776 761020660 761336975 762036133 762026520 761516190 763563538 766579666
3916.3 766579666 762679901 757211380 761086960 761828537 757764359 760104752 762340927 763884659
3924 763884659 761646881 757271423 759142532 761631546 763075027 762206497 761832809 764011154 760499573
3932.7 760499573 758093643 759852066 760118408 761038055 761871719 761033096 760431137 759802094 761281204
3941.4 761281204 762998581 759248123 758815689 760223923 761180954 763100815 760764618 760513992 760356140
3950.1 760356140 757857056 760077362 761048813 760218887 759595108 759173126 759958649 760145874 760675125
3958.7 760675125 760670090 760837555 761020355 759832993 759875870 760141220 759827881 759780273 760280838 761164017
3968.4 761164017 760983429 760322418 760922318 760965881 759848862 759130478 758733902 759288635 759608231 759758453
3978 759758453 760383835 759919586 759441452 759340057 758871613 759068298 759628983 759173203 758977966 759432220
3987.7 759432220 759752502 760337372 759836884 759091492 759169388 759648514 760307083 759966202 759608688 759446716
3997.3 759446716 758917618 758840790 759450226
4000.2 759450226
##END=$$ End of the data block
