##TITLE=$$ Begin of the data block
##JCAMP-DX=5.00 $$ ACD/SpecManager v 10.08
##SPECTROMETER/DATA SYSTEM=Varian
##DATE=18 Dec 2012 10:13:24
##DATA TYPE=INFRARED SPECTRUM
##DATA CLASS=XYDATA
##ORIGIN=
##OWNER=
##NPOINTS=3735
##FIRSTX=399.26403809
##LASTX=4000.35498047
##MAXX=4000.35498047
##MINX=399.26403809
##MAXY=83.05027008
##MINY=31.27192307
##XFACTOR=1.0000000000
##YFACTOR=0.000000100000000
##FIRSTY=71.85607147
##DELTAX=0.96440572
##XUNITS=1/CM
##YUNITS=TRANSMITTANCE
##XYDATA=(X++(Y..Y))
399.3G18560715p008057j938934o465149m723129M961319J1904602O741333l998032
407G18034668n792923l077393n621490m933395p19605L092575K903824l312225n887986
415.7F94686050j854934j30387k283249Q774109J4057312l749084j0619049J197510
423.4G00078278N383148l259888m389267k293014J853561P653580N985412m124450
431.1G06887360n377732R13239m767533o836166n50766K924423L981324P44171j286927
439.8F96631393N80063K579956k782211q048096K68326L416519N85709J298599j603088
448.4F92927170l166809J411133O294937o36750q384399J347885M312897j510239m737625
457.1F87858200J481400M365692L494110O252670j931305o784744k911224j742402
$$ plain form
399.3 718560715 711552658 709613724 703148575 698425446 703386765 715291367 722032700 718034668
407 718034668 712241745 709164352 703542862 698609467 697889862 700982437 703886261 700574036 694686050
415.7 694686050 692831116 692700729 690417480 699191589 713248901 709499817 698880768 700078278
423.4 700078278 705461426 702201538 697812271 695519257 697372818 705026398 711011810 706887360
431.1 706887360 701509628 702422867 697655334 690819168 690268402 693192825 697174149 697918320 696631393
439.8 696631393 697211456 699791412 697009201 688961105 689229431 692645950 693231659 694530258 692927170
448.4 692927170 689760361 691171494 697466431 696829681 688445282 689793167 694106064 692595825 687858200
457.1 687858200 689339600 693705292 697199402 703452072 701520767 694736023 691824799 690082397
464.8F90082397j879348l167267j694565O94199L607025M965744K608871p13348l747864
473.5F90755844m32510p44934o663132n300827M912338P792664R32007O33926L595581
482.2F95480957O59866k60467J171188j496734l614197j318207P69653L40805l6544
490.9F91696320J398239J434097L038864L400803k300110n332565k651444M27551j109161
499.6F90002594j727753J911316R40247q14209J456299K601471o9275n052414j235733
508.2F88012543J613006m053344m506379N01786k91825r98001J689911J258698j770172
516.9F81456223j163483M07944l581696m122391l41110J257782J610336J919480Q95080
525.6F78338165k023086j452484r93576r60389j936111j637192L17383k9831K727356
$$ plain form
464.8 690082397 688203049 685035782 683341217 684035416 687642441 692608185 695217056 694503708 690755844
473.5 690755844 690323334 689578400 682915268 677614441 682526779 690319443 691251450 691885376 695480957
482.2 695480957 696140823 695880356 697051544 695554810 691940613 690622406 691392059 691732864 691696320
490.9 691696320 693094559 694528656 697567520 700968323 698668213 693335648 690684204 691111755 690002594
499.6 690002594 688274841 690186157 691126404 690312195 691768494 694369965 694300690 689248276 688012543
508.2 688012543 689625549 685572205 681065826 681567612 681275787 680277786 681967697 683226395 681456223
516.9 681456223 680292740 680700684 677118988 672996597 672655487 673913269 675523605 677443085 678338165
525.6 678338165 676315079 674862595 673869019 672908630 670972519 669335327 669652710 669622879 672350235
534.3F72350235J689606j009980L92991q927l99551l7842J135559q80432l757629j054764
543.9F68419266K456512L056717K698212K931747P43942l43627q88672l004761j377411
552.6F74691925J010742M20227n16586P90710J815720K032013J990662N06591j949615
561.3F80792389l513489k248154m06646Q80432R59930P67670J634903J502685J206742
570F81576462M501j81808o59714l025665k617722r1705J143188q06274o87J170273
579.6F76510849R1858J509704Q20694j235580j000595l63388m73633j616211j987533
588.3F72256165J676788M299011K169571k19421j654053j030121k388687k756424p1335
597F72281494m60663L9673r78546j493225Q42209r78165l405151l283692l165741o616668
$$ plain form
534.3 672350235 674039841 673029861 673422852 673413925 673014374 672976532 674112091 673231659 669474030 668419266
543.9 668419266 670875778 673932495 676630707 679562454 680306396 679962769 679074097 676069336 674691925
552.6 674691925 675702667 676122894 675606308 676397018 678212738 680244751 682235413 682742004 680792389
561.3 680792389 677278900 675030746 674624100 675504532 676464462 677232132 678867035 680369720 681576462
570 681576462 681580963 681399155 680739441 677713776 675096054 675004349 676147537 675341263 675340576 676510849
579.6 676510849 676602707 678112411 678933105 677697525 676696930 676333542 675859909 674243698 672256165
588.3 672256165 673932953 678231964 680401535 680182114 678528061 677497940 675109253 672352829 672281494
597 672281494 671820831 671860504 670881958 669388733 670230942 669252777 665847626 662563934 659398193 652781525
606.6F52781525p186509o060409q733215r410439r733849r828300j1374245r331054
614.3E81123505o096383k791481J240464k297249l588562m282456n469207p314759
622E50523872p767143m017982N90896Q256340J0667076J2823449J3470840J2331200
629.8E96878548R761924N372849L124657n84679l446655n917549o070176n710678m948196
638.4E88460045j685181J935425Q937263J2732583J5443000J4662857J3640442J3197022
646.2F67323456R816742O292724L661881L702469J780700r04007J376114K099305J110763
654.8F96260147K387161K638016J131516J024322J151810k25754p36237n05523J1215
663.5G03136673M92096J714706L649903J902542o990891L495331L480072O5460K44904
$$ plain form
606.6 652781525 645595016 639534607 630801392 621390953 611657104 601828804 590454559 581123505
614.3 581123505 575027122 572235641 573476105 571178856 567590294 563307838 557838631 550523872
622 550523872 542756729 538738747 539329643 547585983 558253059 571076508 584547348 596878548
629.8 596878548 606640472 612013321 615137978 614553299 611106644 605189095 599118919 593408241 588460045
638.4 588460045 586774864 588710289 597647552 610380135 625823135 640485992 654126434 667323456
646.2 667323456 677140198 683432922 687094803 690797272 692577972 691673965 693050079 695149384 696260147
654.8 696260147 698647308 701285324 702416840 703441162 704592972 704367218 703630981 703125458 703136673
663.5 703136673 703628769 705343475 708993378 710895920 703905029 707400360 710880432 710945892 711190796
672.2G11190796O99158j056595j364823J88446J944352K363739K225875J881714R1400
680.9G18164062j169357m17938K50244j206131j599655m1504P05032K51313k49100
689.6G14686966Q7585j008911j914825j520920j154480q69141k094497j777649m4785
698.2G04389343N95932Q97522Q16193J290893J143265o30646j682357j505661p63016
706.9G04551468j34812R82361K941132K893066K853241L261872J290893J215058J127319
715.6G20981598o67191k07519j07117O27213K186355K281418J808777O96182J067429
724.3G28667145J081924j136780j685028j110382j735916j143188k3346J2283J000977
733G23927689O84509j40457L46222P5683j397400k476883p61489K62603n43136L31268
$$ plain form
672.2 711190796 711889954 710833359 709468536 709656982 711601334 713965073 716190948 718072662 718164062
680.9 718164062 716994705 716576767 716827011 715620880 714021225 713979721 714684753 714936066 714686966
689.6 714686966 714774551 713765640 711850815 710329895 709175415 708306274 706211777 704434128 704389343
698.2 704389343 704985275 705882797 706698990 707989883 709133148 708502502 706820145 705314484 704551468
706.9 704551468 704416656 705399017 708340149 711233215 714086456 717348328 718639221 719854279 720981598
715.6 720981598 720314407 720106888 719999771 720626984 722813339 725094757 726903534 727599716 728667145
724.3 728667145 729749069 728612289 726927261 725816879 724080963 722937775 722914429 722926712 723927689
733 723927689 724612198 724471741 724817963 724893646 723496246 721019363 720257874 720520477 719977341 720308609
742.6G20308609K369537K960282J746978J136475R81751R7351j62201R20028J146546
751.3G31505356J312485L130874L071518K546158L222504K329254J285248J162414
759G49565811K06833o55212J39236L41492J195907J292191k12860O28204J020813J40762
768.6G53663177q23516p58210m56314q18023o65894n81436J810760L347168K048340
777.3G56766052J806793K235642P66296o62841N28106M10309L51639O95343J062775
786G63960114J758346J239777K187881J410294Q05511O99234r96704p78198j118927
794.7G69167328j185608O2180J548538J784820J343155O44379o57272j089707j355514
803.4G70262299L7002K83508r0332J35498K64130J255570P58209O62842M42428O87256
$$ plain form
742.6 720308609 722678146 725638428 727385406 728521881 729503632 729600983 729438782 730358810 731505356
751.3 731505356 732817841 735948715 739020233 741566391 744788895 747118149 748403397 749565811
759 749565811 749772644 749117432 749256668 749598160 750794067 752086258 751873398 752501602 753522415 753663177
768.6 753663177 752839661 752081451 751625137 750807114 750141220 749559784 751370544 754717712 756766052
777.3 756766052 758572845 760808487 761574783 760911942 761440048 761850357 762201996 762897339 763960114
786 763960114 765718460 766958237 769146118 770556412 771361923 772061157 771064453 770286255 769167328
794.7 769167328 767981720 768043900 769592438 771377258 772720413 773364792 772707520 771617813 770262299
803.4 770262299 770299301 770582809 770492477 770627975 770892105 772147675 772905884 773568726 774011154 774698410
813G74698410n7983j562500p02362o00815L06473M90341J038055K064285Q86231K60010
822.6G76820145l50342j099930j805115o77490r02023k482453j309280q86688j652451
831.3G65654373q29239P82395j104050l723907l810883l114319k692108k960205k061844
840G46140213j500702j215362J7929m44947j771927p25860o03027j636811k70309j40152
849.6G37849045J7166K104111L190231K942200K704467K556229J680603J757279J179428
858.3G55980759J151504J821442K81601Q97369K238922K370224J563797J273728J758804
867G69338150n569j164628p94525Q3466m31976N26657K319030J644288J663360J048432
876.7G74226685P49969l81775k022476j903687j775970k102432k166443o29349l93066
$$ plain form
813 774698410 774640427 773077927 772375565 771774750 772081223 772571564 773609619 775673904 776560135 776820145
822.6 776820145 776469803 775369873 773564758 772887268 771985245 769502792 768193512 767306824 765654373
831.3 765654373 764825134 765607529 764503479 760779572 756968689 753854370 751162262 748202057 746140213
840 746140213 744639511 743424149 743442078 742997131 741225204 740499344 739896317 738259506 737989197 737849045
849.6 737849045 737866211 739970322 743160553 746102753 748807220 751363449 753044052 754801331 755980759
858.3 755980759 757132263 758953705 759235306 760132675 762371597 764741821 766305618 767579346 769338150
867 769338150 769332581 768167953 767373428 767456894 767024918 767551575 769870605 771514893 773178253 774226685
876.7 774226685 774976654 774594879 772572403 770668716 768892746 766790314 764623871 763994522 763601456
885.3G63601456K42309m7760j765671j409759j088333k68402l815M120m94080o77185
895G58092880K18354J033477K020722O04019j02387k38418o90918r33685j547089n9814
904.6G58397141k9450q36258q06885j490249k274857j636810j532059l265686k738037
913.3G43786850j894455j984405k238999j801376j307450j872024j270981j674118
921G29743042k475891k343063k402344k009430j295319j298752j453781k03399O48803
929.7G16909866L01285j31149n3101k9220K22320J107102J428604K718277L361664
938.4G25835648K338562K280349K816468K770004J971664K452545K316514J656875
946.1G44438629J822357J188584J679535J826934J770173Q27407k85797q3999p50656
$$ plain form
885.3 763601456 763843765 763796005 762030334 760620575 759532242 759263840 759260025 759264145 758770065 758092880
895 758092880 758311234 759344711 761365433 761969452 761867065 761628647 760937729 760004044 758456955 758397141
904.6 758397141 758367691 757531433 756724548 755234299 752959442 751322632 749790573 746524887 743786850
913.3 743786850 741892395 739907990 737668991 735867615 734560165 732688141 731417160 729743042
921 729743042 727267151 724924088 722521744 720512314 719216995 717918243 716464462 716261063 716909866
929.7 716909866 717211151 717080002 717026901 716997681 717220001 718327103 719755707 722473984 725835648
938.4 725835648 728174210 730454559 733271027 736041031 738012695 740465240 742781754 744438629
946.1 744438629 746260986 747449570 749129105 750956039 752726212 753553619 753267822 753183823 752433167
954.8G52433167l42103q44039j574097j067429j277008j452408j354751j730271k074661
963.4G40716400j381225k207642l078079k204972j722259j456223q48465o68487j092224
972.1G26056824n50919o7215m61883j018830j451797j360321j384430j225739p67288
980.8G17768402m32510j264801j994171j509171j078186j466064l103867l776398l642807
989.5F99500427l663025l577957m599380p301178j0577393j3239212j0733871J075210
997.2F46883621J1317215J1276703N308609J615524J275177R33380Q8349p71408r51157
1005.9F76976013o33316m23126l63083o49261j245728j548233r71451j749649k312851
1014.6F67079315r60312r03549j967163k308502k278137k414856k178574k063522j892777
$$ plain form
954.8 752433167 752091064 751247025 749672928 748605499 747328491 745876083 744521332 742791061 740716400
963.4 740716400 739335175 737127533 734049454 731844482 730122223 728666000 727817535 727149048 726056824
972.1 726056824 725505905 725438690 724976807 723957977 722506180 721145859 719761429 718535690 717768402
980.8 717768402 717335892 716071091 714076920 712567749 711489563 710023499 706919632 703143234 699500427
989.5 699500427 695837402 692259445 687660065 680358887 669781494 656542282 645808411 646883621
997.2 646883621 658200836 669477539 674786148 676401672 677676849 678610229 678698578 677927170 676976013
1005.9 676976013 676342697 675919571 675556488 674907227 673661499 672113266 671141815 669392166 667079315
1014.6 667079315 666119003 665215454 663248291 660939789 658661652 656246796 654068222 652004700 650111923
1023.2F50111923k074585k619858k234115j509400k151832k906532j269036j675415
1031F33671150k361145k373619k974434j333923k141800k442970o76613J16882m49562
1039.6F19033966j283455p99751r74274J06468L57781p6637l88527k52648O23093N62477
1049.3F16908493J488152O12754P34559J067657m62379l30582O41212P80602o72569
1058F20767899K2506K68975j97831n41420j157569n2109r90029j122093r03854j025276
1067.6F15069199n57099p67250q13446n71403O29272j26305n70449j886750k208023
1076.3F08197746o58684j543121j122894j189690j038246j341209p76558M1504j258889
1085E99309959k036552l296967k251968l233223m366264n087929n843468n214843q252678
$$ plain form
1023.2 650111923 648037338 645417480 643183365 641673965 639522133 636615601 635346565 633671150
1031 633671150 631310005 628936386 625961952 624628029 622486229 620043259 619366646 619483528 619033966
1039.6 619033966 617750511 616950760 615976486 616082954 616440735 616364098 615975571 615722923 616346016 616908493
1049.3 616908493 618396645 619009399 619743958 620811615 620349236 620018654 620659866 621440468 620767899
1058 620767899 620790405 621059380 620861549 620320129 619162560 619110451 618120422 616998329 616094475 615069199
1067.6 615069199 614512100 613744850 612931404 612360001 612989273 612862968 612292519 610405769 608197746
1076.3 608197746 607539062 605995941 604873047 603683357 602645111 601303902 600527344 600568848 599309959
1085 599309959 597273407 593976440 591724472 588491249 584124985 579037056 573193588 567978745 559726067
1093.6E59726067p950173q865738r758034r874267j0819321r922256j1999130j0089608
1101.4D80447540j0363006j0106240j0307884j0249939q332825j0399627q428612r914932
1109.1D02344475q145066p707366p748833n403176n608596k202339l273049r78470
1116.8C61277580j051254l53432R52034O95496K377014K76833K902641Q95500J570549
1125.5C69542961J951866R32312J904869j343040M64096j807098j748810k658005l537369
1134.1C63701782k799682m826508k243080l446465m97665k227097l179702j719780
1141.9C42761803l866997j810913m333267k700196l776359k889252k035751l325272
1149.6C18023796n06458k725201q70495j202411R22870O8589m59671K542915Q96091
$$ plain form
1093.6 559726067 551775894 542910156 533152122 523277855 512458534 502536278 490537148 480447540
1101.4 480447540 470084534 459978294 449670410 439420471 431087646 420688019 412259407 402344475
1109.1 402344475 394199409 386492043 378743210 373340034 367731438 365529099 362256050 361277580
1116.8 361277580 360226326 359872894 360824928 361520424 363897438 364174271 367076912 367972412 369542961
1125.5 369542961 371494827 372427139 374332008 372988968 373453064 371645966 369897156 367239151 363701782
1134.1 363701782 360902100 356075592 353832512 350386047 349888382 347661285 344481583 342761803
1141.9 342761803 338894806 337083893 332750626 330050430 326274071 323384819 321349068 318023796
1149.6 318023796 317517338 314792137 313921642 312719231 313642101 313710690 313251019 315793934 316690025
1158.3C16690025L215618J182080L417167K965928K735328M961014L959198O073265
1166C45199623L787117N974426N464020O906090Q423920P060394R002571P004662Q526458
1174.6D07349281P054787P821198Q242797P354088Q465309O871071Q803139P319298
1182.4D69280968P435493O848908N949478O635513N427399O201935M329452M799080
1190.1E16908226M695549M749260N362663N085030O168556M985352N473785M859238
1197.8E58287659N219955M902916M233399N590057N261917N277367M037094N131683
1205.5E97942047N246201M127960L879585L385964L898315K015266K590981L417740
1213.2F26504059K651253K477607K409134K914963J475525J447296J233063Q12149
$$ plain form
1158.3 316690025 319905643 321087723 324504890 327470818 330206146 335167160 339126358 345199623
1166 345199623 348986740 354961166 360425186 367331276 375755196 382815590 391818161 398822823 407349281
1174.6 407349281 414404068 422225266 430468063 437822151 446287460 453158531 461961670 469280968
1182.4 469280968 476716461 483565369 489514847 496150360 501577759 507779694 512109146 516908226
1190.1 516908226 521603775 526353035 531715698 536800728 542969284 547954636 553428421 558287659
1197.8 558287659 563507614 568410530 572643929 578233986 583495903 588773270 592810364 597942047
1205.5 597942047 603188248 607316208 611195793 614581757 618480072 620495338 623086319 626504059
1213.2 626504059 629155312 631632919 634042053 636957016 638432541 639879837 641112900 641925049
1220.9F41925049P53403J5258Q75092P00226J049118J519394J445465J317444O63070
1229.6F50263519M654l46451M30603M00467O91147P04270P97805J344757J127167J313324
1239.3F56731262R17282J057892M38080m37088n41000j36872O86341L99627Q92182
1247.9F60007706R28344Q95539M50515J50452P33643L38669N93566j39770k16675J61667
1257.6F63903656K42462J056595R35135J308136J006698P59964M55933J17798L01361
1266.3F70087738K74887Q25501R49783J294479J345597J841888J871414J568146J716690
1274.9F81776123Q76770Q35037P23419J176072J530609J513214K072754J656723J961365
1283.6F94122086K250747J880036J462173J065979R41239J034011R47495J079712J829910
$$ plain form
1220.9 641925049 642678452 642693710 643568802 644269028 645318146 646837540 648283005 649600449 650263519
1229.6 650263519 650268173 649921722 650352325 650752792 651443939 652148209 652946014 654290771 655417938 656731262
1239.3 656731262 657648544 658706436 659144516 658707428 658166428 658029556 658715897 659115524 660007706
1247.9 660007706 660936050 661831589 662282104 662432556 663166199 663504868 664098434 663958664 663741989 663903656
1257.6 663903656 664146118 665202713 666137848 667445984 668452682 669212646 669668579 669786377 670087738
1266.3 670087738 670362625 671188126 672137909 673432388 674777985 676619873 678491287 680059433 681776123
1274.9 681776123 682652893 683487930 684211349 685387421 686918030 688431244 690503998 692160721 694122086
1283.6 694122086 696372833 698252869 699715042 700781021 701722260 702756271 703703766 704783478 706613388
1292.3G06613388J519775J603852K147522J841888J291046R49784Q06961J53503L95432
1301G17323151Q19702O65893J156540J234207J133423J042252Q53348Q17794J73111
1309.7G25219421l69873r6283p4157o4850O53839J097717J190491J284256Q72803L8452
1319.3G29751816k6169L58429K54898L42789L47366J81580K70462Q39996J714935J222382
1328.9G35258484M27627L32337j63803k88773n30548o01807k42691K5025O97708L98941
1338.6G35312500K21100K03094K70386P30057j65711p26318l73535m60434n71137Q9035
1348.2G34529037M57612J81579K14996k65350k81219j48011p79647j216660o60629
1356.9G32031708k38724n72586J81656N91507P20520j26724j962204L2806K1744j104126
$$ plain form
1292.3 706613388 708133163 709737015 711884537 713726425 715017471 715967255 716774216 716927719 717323151
1301 717323151 718142853 718808746 719965286 721199493 722332916 723375168 724228516 725046310 725219421
1309.7 725219421 724849548 724753265 724679108 724614258 725268097 726365814 727556305 728840561 729713364 729751816
1319.3 729751816 729725647 730084076 730338974 730681763 731029129 731210709 731481171 732321167 734036102 735258484
1328.9 735258484 735686111 736018448 735854645 735565872 735035324 734433517 734190826 734215851 734913559 735312500
1338.6 735312500 735533600 735736694 736007080 736737137 736571426 735845108 735471573 735011139 734440002 734529037
1348.2 734529037 734986649 735168228 735383224 735117874 734836655 734688644 733908997 732692337 732031708
1356.9 732031708 731792984 731220398 731402054 731993561 732714081 732587357 730625153 730657959 730679703 729575577
1366.6G29575577p85523j124649j547699m70504K68554N72434L38516j038666r99679
1375.2G24788361p09687o22177j071319j274186n23986m66385j50147m8446O92062
1383.9G20614090Q86230J120301J018829k125397l58200L70331q5831K58484K81296
1392.6G21980133J369400n68085k276535N39551Q11081J65787k732392j994857k94495
1401.3G16999588l62244j20926K77558m95148n28870O13938J26114j44577m96063j091767
1410.9G14777603j300049j269607k3728M17405P25173J052247J176910Q32214m334793
1419.6G12053375j78451J783905N21087K1897j893997M6310J502151J083298J747666
1428.3G16687241R53216p74765M77142J157990k25906m23127J805954J896592l685151
$$ plain form
1366.6 729575577 728790054 727665405 726117706 725647202 725915756 726488190 726826706 725788040 724788361
1375.2 724788361 724078674 723456497 722385178 721110992 720587006 720120621 719970474 719922028 720614090
1383.9 720614090 721500320 722620621 723639450 721514053 721155853 721526184 721440353 721698837 721980133
1392.6 721980133 723349533 722781448 720504913 721044464 721855545 722021332 719288940 717294083 716999588
1401.3 716999588 716637344 716516418 716793976 716298828 715769958 716383896 716510010 716365433 715869370 714777603
1410.9 714777603 713477554 712207947 712184219 712601624 713326797 714379044 715555954 716388168 712053375
1419.6 712053375 711874924 713658829 714179916 714201813 712307816 712354126 713856277 714939575 716687241
1428.3 716687241 717640457 716865692 717342834 718500824 718274918 717851791 719657745 721554337 717869186
1437G17869186p4997L310700K354813R62295K53525J8616N98449J33820j25504Q87299
1446.6G26188202P52487j414947N60531J963959R53293Q07419Q06350J012039J011658
1455.3G32640991O42777j542282l574753J228332J742707K682647K015686J611176
1463G37447281K579193j926270j729049J179733M27322L21503J328049L186569K338638
1471.7G45152969q53042M8828L792038L632202j190338m80347J461411O87408J065140
1480.3G53316269L94363O24771J829300J669922J227417J805268k87400j787338J929169
1489G60721741j379242m538422O03714J541519J017380J778870J601638n301132J497040
1497.7G57543106J11084l668976O68564p83462j329651P7896K779999L170242n490112
$$ plain form
1437 717869186 717794189 721104889 723459702 724421997 724675522 724694138 725292587 725426407 725300903 726188202
1446.6 726188202 726940689 725525742 726086273 728050232 729003525 729810944 730617294 731629333 732640991
1455.3 732640991 733283768 731741486 728166733 729395065 731137772 733820419 735836105 737447281
1463 737447281 740026474 738100204 736371155 737550888 737978210 738299713 739627762 742814331 745152969
1471.7 745152969 744299927 744348755 748140793 751772995 750582657 750102310 751563721 752251129 753316269
1480.3 753316269 753710632 754335403 756164703 757834625 759062042 760867310 760579910 758792572 760721741
1489 760721741 759342499 754804077 755407791 756949310 757966690 759745560 761347198 756046066 757543106
1497.7 757543106 757654190 753985214 754653778 753870316 752540665 752618561 755398560 758568802 753078690
1506.4G53078690q019638M78439J940842j321030R83429j688843l611450O74972m07714
1515.1G42107697J21536j867523k764283L100052L239441j884842o359405j945572
1522.8G33747101J798782K647171k857055o88782O94961j387634L63388N97534K05231
1531.5G35120697M47617j462555p533264Q21762J242218J079406L441773k197876o757736
1540.1G24202042K640838q79211k691651K567139P8735m384002J873626R87778J199265
1548.8G25594559J60446k146759J580047K081910K347870l559723l12348M232254L318405
1557.5G33296661o854324j5098114R565353N763398L753204K022629J342926j729889
1565.2G32061844j306381J163940M24500O87713n437469J112976K301636J48010J002884
$$ plain form
1506.4 753078690 745059052 745537491 747478333 746157303 747140732 745451889 741840439 742515411 742107697
1515.1 742107697 742229233 740361710 737597427 740697479 743936920 742052078 735692673 733747101
1522.8 733747101 735545883 738193054 735335999 734647217 735342178 733954544 734317932 734915466 735120697
1531.5 735120697 735568314 734105759 726572495 727394257 728636475 729715881 733157654 730959778 724202042
1540.1 724202042 726842880 725963669 723272018 725839157 725917892 721533890 723407516 724395294 725594559
1548.8 725594559 725755005 723608246 725188293 727270203 729618073 726058350 725746002 729978256 733296661
1557.5 733296661 726442337 711344223 720909576 726672974 730426178 732448807 733791733 732061844
1565.2 732061844 730755463 731919403 732343903 733031616 727594147 728707123 731008759 731156769 732159653
1573.9G32159653J571579J250686r652786K7313N53284j207504q70514j622544k22473
1582.6G21986694j133880n40619r90219j649094j505127j995849j473160l278656j885224
1591.2G07534866k377777j269226j032410k374038r30252k370911j148148k386550
1599F93645554k401734k717819k819901j424484k807159j103745j786804j304550k440338
1607.6F74839020j679917j914672l734894j538468l244552j462326k067719L04718
1615.4F59501190K75269r528580J570816q15659m38613j769638N6915r03626p114486
1624F40833588n89066r18388J184044k966462k169914L13759q02498o28509j519051
1632.7F32737503J794891J604195o651459m859848K066841J131516O56471J280365
$$ plain form
1573.9 732159653 733731232 734981918 725329132 725356445 725909729 724702225 723831711 722209167 721986694
1582.6 721986694 720852814 720312195 719321976 717672882 716167755 714171906 712698746 709420090 707534866
1591.2 707534866 705157089 703887863 702855453 700481415 699551163 697180252 696032104 693645554
1599 693645554 691243820 688526001 685706100 684281616 681474457 680370712 678583908 677279358 674839020
1607.6 674839020 673159103 671244431 667509537 665971069 662726517 661264191 659196472 659501190
1615.4 659501190 659776459 650247879 651818695 651003036 650564423 648794785 648851700 647948074 640833588
1624 640833588 640244522 639326134 640510178 637543716 635373802 635687561 634885063 634256554 632737503
1632.7 632737503 634532394 636136589 629485130 624625282 626692123 627823639 628480110 629760475
1640.4F29760475p06138J493873l66592J267280J919747k807770O07147k172737K583847
1649.1F31579132K085838L863602M749794K159042r435043k73132M611435J480102
1656.8F40820770J031418R24835J855011K358475K521668K634353j170730L155136
1664.5F54130936K174148J497345K615433K621765j310654k2659M903412J110153L496552
1673.2F71216431M672165J638717r32770K033997K937470K181701K554779P8659L814545
1681.9F90195694O165695J195603l598633J703415N768890L183441P70798K265778
1689.6G07650681J078186K493743K580567K969665M668122M499054k680817L649063
1697.3G26908264O031418O303177R01184r571610O987992M907837K938003K154465
$$ plain form
1640.4 629760475 629054337 630548210 630181618 631448898 633368645 630560875 631168022 628995285 631579132
1649.1 631579132 633664970 637528572 642278366 644437408 635002365 634729233 639340668 640820770
1656.8 640820770 641852188 642777023 644632034 646990509 649512177 652146530 650975800 654130936
1664.5 654130936 656305084 657802429 660417862 663039627 661728973 661706314 666609726 667719879 671216431
1673.2 671216431 675888596 677527313 676594543 678628540 681566010 683747711 686302490 686381149 690195694
1681.9 690195694 696361389 697556992 693958359 695661774 701430664 704614105 705384903 707650681
1689.6 707650681 708728867 711222610 713803177 716772842 721440964 725940018 723259201 726908264
1697.3 726908264 732939682 739242859 740144043 730572433 737560425 742468262 745406265 747560730
1705G47560730K511597O57806J774597L662338J480561j2436J252212K258377L098755
1713.7G64244537N01404J81656L821793J855163o918106K739563L854752J946106R56955
1722.4G73183823r2621l74832R06677J129532R72824J456756K346344n16967n46799
1731.1G78464737M215317M495544k135239j0072860L305740L741303J524887K394561
1738.8G85933990j162033k412033L989029K614594q76999n4627K421036J356659O88553
1747.5G92498169J115494K16446L539962m04052k272339L504410K342910J989289J476364
1756.2H04006653k612381L30353J843643J530914K570877k191849j261444K700806
1763.9H06917572J246414Q44345J415940P40661k988968J449890M001999L70560m041138
$$ plain form
1705 747560730 750072327 750730133 752504730 756167068 757647629 757635193 758887405 761145782 764244537
1713.7 764244537 764745941 764927597 768749390 770604553 763686447 766426010 770280762 772226868 773183823
1722.4 773183823 773091202 772716370 773623047 774752579 775725403 777182159 779528503 779011536 778464737
1731.1 778464737 782680054 787175598 785040359 774967499 778273239 782014542 783539429 785933990
1738.8 785933990 784771957 782359924 786348953 788963547 788086548 788031921 790452957 791809616 792498169
1747.5 792498169 793613663 793830109 797370071 796966019 794693680 798198090 800541000 802530289 804006653
1756.2 804006653 801394272 801724625 803568268 805099182 807670059 805478210 804216766 806917572
1763.9 806917572 808163986 809008331 810424271 811164932 808175964 809625854 813627853 813998413 809957275
1772.5H09957275j711349L848038J430664j740647J555710O47965M98962P3700j805878
1781.2H12754440N55649J678772J130524r04312m57535J397705Q66394N72662J233902
1789.9H18828201J38092j17492l231049j145096L893357J449737j615524M85687K053757
1798.6H20739670J14288j611252R92432j268845o72683J132965M19540R17130L82232
1807.3H21145477p2937J161423J326370j478882o75735M01382k19268L25622R5444
1815.9H22008896O12335k11334j4267Q12073M18243P86667n99670Q10623J386337l342133
1825.6H22667770o30035J911926K059860Q02231l947143J47476J792984L17306M24958
1834.3H25547333K7389j4953k87400p14340L87039K55738P27844O10351J847992Q37326
$$ plain form
1772.5 809957275 808245926 812093964 813524628 811783981 813339691 813987656 814486618 814560318 812754440
1781.2 812754440 813310089 814988861 816119385 815215073 814757538 816155243 817021637 817594299 818828201
1789.9 818828201 818966293 818848801 815617752 814472656 818366013 819815750 818200226 818685913 820739670
1798.6 820739670 820853958 819242706 820235138 818966293 818293610 819426575 819846115 820763245 821145477
1807.3 821145477 821072540 822233963 823560333 822081451 821405716 821807098 821587830 821913452 822008896
1815.9 822008896 822621231 822409897 822395630 823207703 823625946 824412613 823812943 824623566 826009903 822667770
1825.6 822667770 822037735 823949661 826009521 826811752 822864609 823012085 824805069 825122375 825547333
1834.3 825547333 825574722 825559769 825272369 824558029 824945068 825200806 825928650 826539001 828386993 829224319
1843.9H29224319n819320J174164K115936r1553q05359J70517N45349l43170L89176
1852.6H26560059J84021L21426K12097r4223L56369l40805n5847O0196o7673k97851
1862.2H26837769L00064O97479L14178Q42667N46036N87082j403885k504425P4386
1870.9H26291351P95288P88117J14517K78320L31421J60599o9885o027j26114m80271
1880.6H28077316M02375l3417k12097o6834p248L81546M27552J481552N1956k684250
1890.2H27818451j74484R18579J5793K94342j23444r85184O20804O72989J75781J62354
1899.8H29395981K35367J1367n86853j05514n23987l18069M11529K33536J72958L72544
1909.5H29298859j00861m05197N78232p019j75705n74112n5084J592788j788711j200104
$$ plain form
1843.9 829224319 823404999 824579163 826695099 826603546 825798187 825968704 826514053 826170883 826560059
1852.6 826560059 826744080 827065506 827277603 827183380 827539749 827198944 827143097 827203293 827135620 826837769
1862.2 826837769 827137833 827835312 828149490 828992157 829538193 830125275 828721390 826216965 826291351
1870.9 826291351 827086639 827874756 827989273 828267593 828599014 828759613 828689728 828683701 828557587 828077316
1880.6 828077316 828479691 828446274 828234177 828167343 828160095 828541641 828969193 830450745 830502701 827818451
1890.2 827818451 827643967 828562546 828578339 828872681 828749237 827764053 828384857 829057846 829233627 829395981
1899.8 829395981 829631348 829642715 829055862 828950348 828426361 828108292 828519821 828753357 828926315 829298859
1909.5 829298859 829197998 828792801 829371033 829364014 829188309 828614197 828559113 830151901 828363190 827163086
1919.1H27163086J490936R65576P22809q77609j136322R9487J25199k87705j96304
1927.8H28069153j54343K35520N55267J19934L37143q2932m8217p5455l42255j98517
1937.5H28415298m67605l58582k3193J636200L15552k218552Q90579Q52967l87497
1946.1H28655167j46408l76816n64423m8447J02845q7204K42386K78625L38059k33994
1955.8H28159790k38419J89362l03192m00925n10788n0964L84064Q2092O6299O83747
1965.4H28061066P28683r11636o63834O09665q4228q80356n33066M9438M3641J87530
1975.1H26606903O19812K17285j73568K31781k7466l77045l22418k82974k07062n49545
1984.7H25735703j84250L31726N7678k18277L5706Q20159K49787j448899n68389N51529
$$ plain form
1919.1 827163086 828654022 829619598 830342407 829464798 828328476 828427963 828553162 828265457 828069153
1927.8 828069153 827914810 828150330 828705597 828825531 829162674 829079742 829031525 828956070 828613815 828415298
1937.5 828415298 827947693 827589111 827565918 829202118 829517670 827299118 828189697 829042664 828655167
1946.1 828655167 828508759 828131943 827567520 827519073 827621918 827534714 827777100 828055725 828393784 828159790
1955.8 828159790 827921371 828110733 827807541 827406616 826895828 826844864 827228928 827311020 827377319 828061066
1965.4 828061066 828789749 827878113 827214279 827823944 827739716 826859360 826326294 826375732 826419373 826606903
1975.1 826606903 827226715 827444000 827270432 827502213 827474747 827097702 826775284 826492310 826285248 825735703
1984.7 825735703 825551453 825883179 825940857 825722580 825758286 826578445 826828232 825379333 824810944 825362473
1994.3H25362473j7243k32773J23978K19955J32141J5641L4103k34604j05743K5177
2004H25323105k11029j88828j13907l3721m7913L11966J95312k36663j60981l9673
2013.6H24797668J14594k12860o22635p30362k70386Q3695L21426O12946L03878K22321
2023.3H24620285l5934j69754l02659q68988o75354j48315K19269K04773L21960M11301
2032.9H23576584L21197J49842r5597j32827n02777o48346o28815j28098r0637j98440
2042.6H21622086O54754P19757N23529k11029n36880k88391n41687j76163l08685m44947
2052.2H21012344P8125P12738M31748j3886K8992m00085k48185m48379n86929l33939
2061.9H20232544J65863N31921k80990j26724L16085K36359j58463m11529o86264j243286
$$ plain form
1994.3 825362473 825345230 825112457 825236435 825456390 825588531 825604172 825638275 825403671 825297928 825323105
2004 825323105 825112076 824923248 824809341 824775620 824727707 825039673 825234985 824998322 824837341 824797668
2013.6 824797668 824912262 824699402 824076767 823346405 823076019 823159714 823481140 824094086 824397964 824620285
2023.3 824620285 824584351 824414597 824111938 823242950 822567596 822419281 822638550 822843323 823165283 823576584
2032.9 823576584 823897781 824047623 823952026 823819199 823316422 822668076 822039261 821911163 821820526 821622086
2042.6 821622086 822276840 822996597 823520126 823309097 822772217 822483826 821942139 821765976 821457291 821012344
2052.2 821012344 821090469 821803207 822234955 822221069 822250061 821849976 821601791 821153412 820566483 820232544
2061.9 820232544 820398407 820930328 820649338 820522614 820838699 821075058 820916595 820505066 819818802 818575516
2071.5H18575516m22135l8986k93197j14594M65393N00717k84271j41830j80436k95181
2081.1H17770996m52728n72281j25656k50702m00772O256O38962O34155K15301j26647
2090.8H17336884l9444j36185o24848l93829j95618J38855K60697L27301N45654M91486
2100.4H17710953N79757K0218j87149j24817k83889k40479J52130L50800Q468N73807
2110.1H18559799N78079P5913L0746N3330k84119q14438j42135j57166k50091K55279
2119.7H17905197O37436Q04672K86179J12533o67800o00586o9275o05927n35431m21753
2129.4H16845245J24741O58035M26865J67694L19290M16718j89896n35049k58561J3810
2139H17988892l68653k21176N13458N85022L74298L10135L09754N3024j02005m55399
$$ plain form
2071.5 818575516 818153381 818114395 817821198 817706604 818171997 818672714 818388443 818246613 818066177 817770996
2081.1 817770996 817318268 816745987 816620331 816369629 815968857 815975113 816614075 817248230 817463531 817336884
2090.8 817336884 817297440 817161255 816536407 816142578 815946960 816085815 816346512 816673813 817219467 817710953
2100.4 817710953 818290710 818310928 818123779 817998962 817715073 817474594 817626724 817977524 817985992 818559799
2110.1 818559799 819137878 819213791 819244537 819297867 819013748 818199310 818057175 817900009 817649918 817905197
2119.7 817905197 818542633 819347305 819633484 819746017 819078217 818477631 818408356 817802429 817266998 816845245
2129.4 816845245 816969986 817628021 818054886 818222580 818541870 818958588 818768692 818233643 817975082 817988892
2139 817988892 817620239 817399063 817912521 818497543 818871841 819181976 819491730 819544754 819442749 818987350
2148.6H18987350m35409r9259J8387J69831J65405N77621L90168L65753K78702m42124
2158.3H19976425k78778l09448l56827m10309J06049M48685m6311M39377O81229L05252
2167.9H20555344l52936n86472l67584m16489l65676k89917j6251k8381K59857M95682
2177.6H18887177J49688k88315k86178K43378r6436m55856m59671P5760N74951K29568
2187.2H18574066J14365J36337N35202L62549j9837p5149j80512P7j85089J60980N02167
2197.8H19925156L48053K71530M10766M13666j19781j66779j38779k4719k05231j20925
2207.5H20592957O37207M36859Q8501J1978K7160o7443q9646j22528l30276j64948
2217.1H21019821j91574O7062K12021K37427N37491K42538J9608r9564m00238k40478
$$ plain form
2148.6 818987350 818551941 818452682 818471069 818640900 818806305 819383926 819774094 820139847 820418549 819976425
2158.3 819976425 819697647 819388199 819031372 818621063 818727112 819175797 819129486 819568863 820250092 820555344
2167.9 820555344 820202408 819615936 819248352 818831863 818466187 818176270 818160019 818131638 818391495 818887177
2177.6 818887177 819036865 818748550 818462372 818705750 818609314 818153458 817693787 817769547 818344498 818574066
2187.2 818574066 818688431 818824768 819359970 819722519 819702682 819627533 819447021 819447098 819262009 819422989 819925156
2197.8 819925156 820273209 820544739 820955505 821369171 821249390 821082611 820943832 820919113 820713882 820592957
2207.5 820592957 821230164 821667023 821755524 821767502 821794662 821727219 821637573 821515045 821184769 821019821
2217.1 821019821 820828247 820895309 821107330 821344757 821882248 822124786 822144394 822044830 821644592 821404114
2226.8H21404114q0796j20391J56784M272J78909L59955k36740k44827j80664P8277
2236.4H21318893q2244l32184j83411n17425j10550M72869P24183L44543P1945N5390
2246H21762009n44892n05829k03094l4027l54614Q9340O19125J46866K51312K49100
2255.7H21475296L19214j69144n80063l20892J48621K52761n81588o9351J92565K91291
2265.3H20958710M04129k41471J10779O7139k27814m54712k34604R6131J91726K03171
2275H20873184k30789J16272L38211M20303k517o5537j0834p68890k56500r4757J65252
2285.6H20483398K70386N6992L47519K05078J84555k12479J39694m0741l54309j0833
2295.2H21069260k58713j831l7766M98200J7395l10745M38003q9493j34506m19846
$$ plain form
2226.8 821404114 821323318 821202927 821359711 821363983 821542892 821902847 821666107 821421280 821240616 821318893
2236.4 821318893 821236649 820904465 820721054 820203629 820093079 820565948 821290131 821634674 821706619 821762009
2246 821762009 821217117 820711288 820508194 820474167 820119553 820208893 820828018 820974884 821226196 821475296
2255.7 821475296 821794510 821625366 821045303 820724411 820873032 821125793 820544205 820474854 820667419 820958710
2265.3 820958710 821362839 821121368 821232147 821299286 821071472 820616760 820382156 820478287 820670013 820873184
2275 820873184 820642395 820758667 821096878 821517181 821514664 821449127 821438293 820669403 820412903 820318146 820483398
2285.6 820483398 820753784 820810776 821158295 821363373 821547928 821335449 821475143 821434402 821080093 821069260
2295.2 821069260 820810547 820808716 820770950 821269150 821286545 820975800 821413803 821324310 821189804 820769958
2304.9H20769958j95465j92260k33384K65961Q8425M71115O4087K2354l54843k38419
2314.5H20467529O85273L8070Q9340j67541M5090N7220q84476n73272K31475Q86460
2324.2H20875168L58429M53415K13165L1128J9455j063919l03803J5793J81046J099777
2333.8H21879654O49872O9351J88141J5411r84649j201706M45938Q67614k29263K67792
2343.4H21968155j35956n70907J25045l42254L89099J190567N62210j04828Q6441k99911
2353.1H22867661L09982N26581q95081M89197L92151l34015k34528o89468J20392j280365
2362.7H21272507p80564J479950N88837m42200l2043O21338O31561k19269l00216k65656
2372.4H22554245j004028j77994K65121n8136K7771J85471N69229K50778K57263K4491
$$ plain form
2304.9 820769958 820574493 820382233 820148849 820414810 820503235 820974350 821038437 821060791 820705948 820467529
2314.5 820467529 821152802 821190872 821280212 821112671 821157761 821214981 820330505 819757233 819988708 820875168
2324.2 820875168 821233597 821687012 821900177 821931305 821950760 820886841 820583038 820598831 820779877 821879654
2333.8 821879654 822529526 822598877 822787018 822802429 821817780 820616074 821062012 821929626 821700363 821968155
2343.4 821968155 821832199 821261292 821386337 821044083 821433182 822623749 823185959 823081131 823167572 822867661
2353.1 822867661 823177643 823704224 822809143 823298340 823690491 823356476 823121948 822432480 822552872 821272507
2362.7 821272507 820491943 821971893 822560730 822118530 822086487 822707825 823339386 823120117 822819901 822554245
2372.4 822554245 821550217 821372223 821637344 821579208 821606979 821792450 822361679 822612457 822869720 822894211
2382H22894211l51029k53372m02908J21536M25339K7389l29666J068M56162K24228
2391.7H22812958j11466n19256m37317l34702r3307K61535L00904L19443J07421J38245
2401.3H22444458j72882M3182j8005n47104J18866k57034m91257K11487L91998L71018
2410.9H22094727k50245m34722K26974J57013n42526m47312j99737j58844J34659J87759
2420.6H20767746J51443L46451L46680k19879k90451k38571n55191l07923L01132L29285
2430.2H20630722k58102L891K28042J63422K55966k68249l17994m8751j73569l92609
2439.9H19822769j72500j69220j32752L90625L25852K75802K9831k42157m90875l59955
2449.5H19277420n7144m18930l5172q3923J26114O31866J14441n3024j73187j60752
$$ plain form
2382 822894211 822543182 822289810 821886902 822008438 822433777 822461166 822131500 822132568 822588730 822812958
2391.7 822812958 822701492 822182236 821744919 821410217 821316910 821578445 821879349 822198792 822306213 822444458
2401.3 822444458 822271576 822314758 822296753 821749649 821868515 821611481 821120224 821331711 821723709 822094727
2410.9 822094727 821844482 821409760 821636734 821793747 821251221 820803909 820604172 820445328 820579987 820767746
2420.6 820767746 820919189 821265640 821612320 821392441 821101990 820863419 820308228 820000305 820301437 820630722
2430.2 820630722 820372620 820376511 820604553 820767975 821023941 820755692 820437698 820388947 820215378 819822769
2439.9 819822769 819650269 819481049 819348297 819738922 820064774 820340576 820370407 820128250 819637375 819277420
2449.5 819277420 819220276 818801346 818766174 818682251 818808365 819440231 819554672 819501648 819328461 819167709
2459.2H19167709n09948m76456m0436k43835Q545K13852K40173L63617j9303n04226
2468.8H18199692Q8577n1346p25174k21023j62278P5760R2698J37405K97928k03247
2478.5H17528992k22321j98822J80740l66973o06995L80936K32162k35062o55975k08511
2488.1H15828171N04226M56086j21003m10690J57242k80380o32172l34167r8801J89667
2497.7H15258179P0953O9580L23105K54974k47802L814j2588n32379r4300P8965l27759
2508.3H14844742m41742L6774M4097k38800J72577K70233r7885k67563l27606k81296
2518H13713531O257j84098J602K63520k10343R1248L87726K2888p00150n97152J99737
2528.6H12994766K7390j77689k14386K13089N36804j67083k99759K05993o0577m08478
$$ plain form
2459.2 819167709 818657761 818181305 818140869 817897034 817905579 818119431 818359604 818723221 818703918 818199692
2468.8 818199692 818288269 818236923 817511749 817290726 817128448 817204208 817296906 817434311 817732239 817528992
2478.5 817528992 817306671 817107849 817288589 816921616 816314621 816695557 816927719 816692657 816036682 815828171
2488.1 815828171 816332397 816788483 816667480 816256790 816414032 816133652 815501480 815167313 815068512 815258179
2497.7 815258179 815329132 815398712 815721817 815976791 815728989 815732803 815720215 815187836 815093536 815172501 814844742
2508.3 814844742 814403000 814439774 814483871 814245071 814417648 814687881 814589996 814322433 813994827 813713531
2518 813713531 813719788 813535690 813537292 813800812 813590469 813681717 814069443 814092331 813392181 812795029 812994766
2528.6 812994766 813022156 812844467 812630081 812843170 813379974 813212891 812913132 813119125 813058548 812650070
2538.2H12650070j59836k82898k62527J21384M74624P7973k79694K13776j70746j1978
2547.9H12370148Q6364n95169k87170j12457j61743N2413L60795M2495k09655p8660
2557.5H11467361j20163j1215n84335n92499n0583L03116K86865l76358j55182L20588
2567.2H10487595M51583J38779k31476n22918p71027K29K13852r1019L7918Q5984K99606
2577.8H10099106L34854q7204l95126n73426o00738m3183m4250k94876N3863P5455
2587.4H08524475k10647k10648L05862J98899l67050m43192k73056N7678j88904m48074
2597.1H06945343L5248J526l45917K09885M36477J69678J3809m67682p00607n53589
2606.7H05744171Q3161J04141l2425K99072n5084J449j52511k11029k06680p16401
$$ plain form
2538.2 812650070 812490234 812207336 811944809 812066193 812540817 812618790 812339096 812552872 812382126 812370148
2547.9 812370148 812456512 811861343 811574173 811461716 811299973 811352386 811713181 811755676 811546021 811467361
2557.5 811467361 811347198 811335983 810751648 810159149 810108566 810411682 810698547 810322189 810167007 810487595
2567.2 810487595 810939178 811077957 810846481 810323563 809552536 809552765 809766617 809675598 809713516 809799500 810099106
2577.8 810099106 810433960 810346756 809951630 809378204 808777466 808734283 808690033 808395157 808449020 808524475
2587.4 808524475 808313828 808103180 808409042 808607941 808240891 807797699 807524643 807582321 807393417 806945343
2597.1 806945343 806980591 806982117 806636200 806846085 807282562 807452240 807466049 806998367 806297760 805744171
2606.7 805744171 805827332 805931473 805899048 806198120 806143036 806144485 805991974 805780945 805574265 804857864
2616.4H04857864k82898j28173k23465k0371J34354J61590J11847P4158k62909n8823
2626H04363174k54516q15659l91006J72500P2937m10385k25601N16434M94461k84424
2635.6H03237915o02798n47409P8659K42767o32935k62222O3171o5765J91803M0512
2645.3H01743698r4910j82418l35770n87311k46734j22147k74506n111k16065L03803
2654.9G99982529O16607j16958j24131j20010q34122r53521l39508M501o2180j17721
2664.6G97935486L44391J28021k63290J54495J07116j31683l06320k23236k75955j98670
2674.2G97270355J06049m0436P8201N5313J16349k02103o30875j87759L50571r7428
2683.9G96818237j269912n33600J98745M960K48642p0038o9733j99203k65122k94800
$$ plain form
2616.4 804857864 804574966 804446793 804223328 804202957 804337311 804498901 804610748 804684906 804421997 804363174
2626 804363174 804108658 803292999 802901993 803074493 803147430 802737045 802511444 803027878 803522339 803237915
2635.6 803237915 802635117 802087708 802166367 802409134 801776199 801513977 801577148 801511383 801703186 801743698
2645.3 801743698 801648788 801466370 801130600 800543289 800296555 800174408 799899902 799894791 799678726 799982529
2654.9 799982529 800599136 800482178 800358047 800238037 799403915 798450394 798110886 798115387 798053207 797935486
2664.6 797935486 798279877 798407898 798144608 798299103 798406219 798274536 797968216 797744980 797469025 797270355
2674.2 797270355 797376404 797335968 797414169 797469482 797585831 797383728 796752853 796565094 796915665 796818237
2683.9 796818237 795548325 795014725 795213470 795218430 795467072 795397034 795327301 795128098 794862976 794568176
2693.5G94568176p51648l64380N06440N37109p7057m8218l01513l62397m348j16043
2703.1G93586121k17057n31540k19879n0506l57285j00479M35486L56903l52936l98788
2712.8G92150040m22135l99704k37350l0899j69678p36160j05286L64304M28848K40478
2722.4G91082458k66342m5013l7079l96805q71887m59900M01764R4376n08576l06549
2732.1G88686447K26898O9352k36130k88620k91214m31824k69165P6447p2556j38626
2741.7G87331009m55093l58506J23825Q7967J00861J13144K41089N6686n78842p51190
2751.4G85910950m12369l86581j49079L29132P5302k76260m13971K7313j37863p59659
2761G83806915j70440L3035k22702j52435J58615L9138m78210l52402k01492l2043
$$ plain form
2693.5 794568176 793816528 793452148 793958588 794495697 794418640 794370422 794068909 793706512 793702164 793586121
2703.1 793586121 793369064 792837524 792617645 792567139 792209854 792109375 792544861 792901764 792548828 792150040
2712.8 792150040 791727905 791328201 791090851 791059952 790890274 790154114 790048828 790413132 790841980 791082458
2722.4 791082458 790816116 790771103 790734024 790337219 789465332 789005432 789407196 789501572 788992996 788686447
2732.1 788686447 788913345 788982697 788746567 788457947 788166733 787734909 787465744 787542191 787469635 787331009
2741.7 787331009 786875916 786517410 786641235 786729202 786830063 786943207 787184296 787240982 786662140 785910950
2751.4 785910950 785498581 785112000 784962921 785292053 785367355 785091095 784677124 784704437 784566574 783806915
2761 783806915 783636475 783669510 783446808 783294373 783452988 783492126 783013916 782661514 782460022 782427979
2770.7G82427979M4555k49634l88641l27835m87824m35409q5983j07804J8311J9073
2780.3G80426788J068k07214n94025m05426l64685k71911j95999L05J90429J37558
2789.9G78716888l0975p10220p07245l31726l24555n69076l25318M25873r8266q08487
2799.6G75236893l77961J29014j88675m20380m32510l34778j84632q63418l03879J53961
2809.2G72413635n60074k19421k57645j58538K51464k62451p00302o56967n69916o26831
2818.9G68652954l72009l52936m35410j94473l50418k35672J5793k67792m15191n72358
2828.5G65472488o44302m23737l48739j16120j77459m83856n03998l97644l11890o90155
2838.2G61374588r20944j208115j387100r32007p59277o65589p62176o34995m76608
$$ plain form
2770.7 782427979 782472534 782222900 781834259 781506424 781018600 780583191 780497208 780389404 780407715 780426788
2780.3 780426788 780427856 780220642 779626617 779221191 778856506 778584595 778388596 778388901 778579330 778716888
2789.9 778716888 778685913 777975693 777268448 776936722 776612167 776043091 775717773 776143646 776045380 775236893
2799.6 775236893 774858932 774987946 774799271 774378891 773946381 773611603 773426971 772563553 772259674 772413635
2809.2 772413635 771853561 771634140 771376495 771217957 771469421 771206970 770506668 769849701 769279785 768652954
2818.9 768652954 768280945 767928009 767492599 767298126 766947708 766712036 766727829 766460037 766044846 765472488
2828.5 765472488 764828186 764404449 764055710 763939590 763762131 763278275 762774277 762376633 762064743 761374588
2838.2 761374588 760453644 759245529 757858429 756926422 756167145 755501556 754739380 754104385 753627777
2846.8G53627777j454620k020645j323166r64203j189804q10089m20533n68084n07584
2855.5G44369049Q8654O39724O15998J64871q02689j005859m60205l11279k15073k11487
2865.2G42871704l07159l89634k19802m17633p81098p10907m10766j58310j061325
2873.8G38415070j179276n9433K86179J76925j07956j38702k74658m16947m11758o61469
2883.5G35627975m46777m72641p63550m08859m01306l36075K77481k86255q59832p01905
2893.1G31228256p56149o91071j024398o30646l7384k93503k98386m76913n76477k99072
2902.8G26144257j83640p73163q02917m01230o60248k01416k24762m24118k4872m33120
2912.4G22014771p24488o17294r32236j170654q65021j068649j131516m46396J36033
$$ plain form
2846.8 753627777 752173157 750152512 748829346 747865143 746675339 745865250 745444717 744876633 744369049
2855.5 744369049 744457703 745097427 745713425 745878296 745075607 744069748 743609543 743298264 743083191 742871704
2865.2 742871704 742564545 742174911 741955109 741537476 740756378 740045471 739634705 739476395 738415070
2873.8 738415070 737235794 737176361 737462540 737639465 737531509 737392807 737118149 736701202 736289444 735627975
2883.5 735627975 735181198 734708557 733945007 733536148 733134842 732798767 733076248 732789993 731930161 731228256
2893.1 731228256 730472107 729781036 728756638 728125992 728088608 727795105 727496719 727019806 726443329 726144257
2902.8 726144257 725960617 725187454 724384537 723983307 723323059 723121643 722896881 722472763 722447891 722014771
2912.4 722014771 721290283 720672989 719740753 718570099 717705078 716636429 715504913 715058517 715194550
2921.1G15194550K96325q1405l81546r03778m86527L6087k91977n8136n47027k12250
2930.7G12564316R68246Q24890J25504j70364L84597N84259K32544j15661k8382K84195
2940.4G15654144J13907J23062K53601N09491P18537L13186r9258j03226k32544m51736
2950G16799164l30658k12326m16260n25284k12555n2185J40076R6588k86865k4719
2959.7G14974976J55868j74560o16150m86145L06778P50885N43975N35508P20749N69763
2969.3G17281647R26666O53763Q4152K58484L50571O32400M75235O20804O84662O64596
2979G22632980R41010K21557K01798O19507M61197k02790j81884O17675M76914O44302
2988.6G26432266P03354Q06503R54895J36185n21011l35160K46659k99607l52249K90604
$$ plain form
2921.1 715194550 715490875 715409470 715027924 714124146 713637619 713673706 713381729 713323593 712776566 712564316
2930.7 712564316 713532562 714357452 714482956 714312592 714697189 715281448 715513992 715398331 715369949 715654144
2940.4 715654144 715768051 715891113 716144714 716654205 717372742 717685928 717586670 717483444 717250900 716799164
2950 716799164 716468506 716256180 715839920 715314636 715102081 715049896 715189972 715286560 714999695 714974976
2959.7 714974976 715130844 714956284 714340134 713853989 714160767 714911652 715455627 715991135 716711884 717281647
2969.3 717281647 718208313 718862076 718946228 719204712 719555283 720187683 720662918 721283722 721968384 722632980
2979 722632980 723573990 723795547 723997345 724616852 725078049 724875259 724693375 725311050 725787964 726432266
2988.6 726432266 727135620 727942123 728897018 729033203 728512192 728177032 728423691 728124084 727771835 728062439
2998.2G28062439K80838K01721M273N03082L59726l71246n32914p02514m46625p6294
3007.9G27282486K61917J90506J23749K32467N875J07575o3553m90494m96826m26026
3017.5G26727676o19964o38352q3923J02005k64893r8648N10331N035j166611o89621
3027.2G23783035R5978k50854l77121p90940q02231K49100L81622m2114l81851m21143
3036.8G21443481k75039n47104r34219q16193k53983k96554j84021P4234n04990m12674
3046.5G17292938L23181j8615o84738m90647o06689p06330n21774n88684l14636l24478
3056.1G13359528o21186l05328J50375n32989q26035k91061l39966n9433l59573j91117
3065.7G09983215J79062l46756p6217n43442o47431j21154p61795j209031o53076p1945
$$ plain form
2998.2 728062439 728343277 728544998 728549271 729052353 729412079 729040833 728507919 727805405 727358780 727282486
3007.9 727282486 727544403 727734909 727858658 728091125 728097000 728204575 728141022 727650528 727153702 726727676
3017.5 726727676 726107712 725469360 725385437 725487442 725222549 725123901 725634232 725639267 724472656 723783035
3027.2 723783035 723879013 723628159 723251038 722460098 721657867 721906967 722288589 722246475 721864624 721443481
3036.8 721443481 721168442 720621338 719687119 718870926 718616943 718320389 718136368 718210602 717705612 717292938
3046.5 717292938 717616119 717597504 716912766 716422119 715815430 715109100 714587326 713998642 713684006 713359528
3056.1 713359528 712738342 712433014 712583389 712050400 711224365 710933304 710593338 710533905 710174332 709983215
3065.7 709983215 710162277 709815521 709739304 709195862 708548431 708427277 707665482 706456451 705803375 705731430
3075.4G05731430j91803m4784r8725o6986J20545k8611l1433n63583o68640p53403
3085G03404007p91168m21524n00412k45972j984R9945r6206n67246m36172j0376m91638
3095.6F99941254j283341p58819j33438J5869p6294k11335n49926q65860m56620o8359
3105.3F95553131J89133n71060j220704o42318l13416q3389m65469n79834Q5601K8077
3114.9F91979752m55323p50961q30002n49240k95410q36639r40705j81808J29852l25241
3124.6F86944275p23190n40238p64389q82110l44239n64117r82056n56030l74680m31823
3134.2F80781403k24610p2326j03989j012116j209487n71290q96530j253280j163025
3142.9F74274750l99704L09143j6709o66503o92139m53186l78571l65448r64431j087571
$$ plain form
3075.4 705731430 705539627 705494843 705396118 705329132 705449677 705421066 705389633 704826050 704157410 703404007
3085 703404007 702612839 702191315 701690903 701444931 701442947 701542892 701446686 700879440 700443268 700432892 699941254
3095.6 699941254 698657913 697899094 697765656 697781525 697705231 697493896 696943970 696078110 695621490 695553131
3105.3 695553131 695742264 695171204 693950500 693308182 692994766 692911377 692445908 691866074 691951675 691979752
3114.9 691979752 691524429 690773468 689943466 689394226 689098816 688262177 687321472 687139664 687269516 686944275
3124.6 686944275 686221085 685680847 684916458 684034348 683690109 683125992 682143936 681587906 681213226 680781403
3134.2 680781403 680556793 680484467 680380478 679368362 678158875 677587585 676691055 675437775 674274750
3142.9 674274750 673875046 674184189 674167480 673500977 672808838 672355652 671977081 671611633 670647202 669559631
3152.5F69559631j090240r05609l17688m80042j62887k03095m17251n60151j264877
3161.2F64157791j165085r10034q45566o84433l38363k56577n11474n49164l81546
3169.9F58515549m17557o83746n98298j182022j118927m59442n24521m42962n15061
3178.6F52573013k48413o43768r48410q49991j045685n14679p53097r74427n94787
3187.3F45999756m41361n85937m44794j93710p76444r32312q42590m50439m97590r55352
3196.9F39879227j060753q89626k48337p66868m51622J38359n19981j115609j282768
3205.6F33682022n04265n41267m63791o11572j093178o20842l03726K82707k73666
3214.3F29552422q69713j078110j231041l63731o41709j479797j106606r0789j62239
$$ plain form
3152.5 669559631 668469391 667563782 667246094 666766052 666603165 666400070 665982819 665422668 664157791
3161.2 664157791 662992706 662082672 661237106 660552673 660214310 659957733 659446259 658897095 658515549
3169.9 658515549 658097992 657414246 656815948 655633926 654514999 654055557 653531036 653088074 652573013
3178.6 652573013 652324600 651680832 650732422 649882431 648836746 648322067 647568970 646594543 645999756
3187.3 645999756 645558395 644972458 644527664 644333954 643557510 642625198 641782608 641332169 640834579 639879227
3196.9 639879227 638818474 637928848 637680511 636913643 636462021 636600380 636080399 634964790 633682022
3205.6 633682022 633177757 632636490 632172699 631561127 630467949 629847107 629543381 629826088 629552422
3214.3 629552422 628682709 627604599 626373558 626009827 625368118 623888321 622781715 622690926 622528687
3222.9F22528687l45498l17192p05528m50172n89791q60824j100617n42793K49100
3231.6F17865372j37444l57551p64351q65593o87790r79691q81729k56996m11606j224403
3241.3F11298218j407242n23453P07588j00822o94046j79558l69530o93550j377334
3249.9F06660271p74918l35884p14951o39152o48079k72064l29361p93686r02023k5902
3259.6F01224251o0425q64258p17583p83805n10216p04880m73251K43301Q0834m3831
3269.2E97390137l31421p15218j086044q17909j060982q20236j32370q20236k59514
3277.9E91346207J70784j42670m25148j065712r34677n58243m26063n95971m52613
3286.6E86915894k14386k25525l19367q2435j12496p70225k21978l62358r26399n97038
$$ plain form
3222.9 622528687 622183189 621865997 621160469 620710297 620120506 619259682 618159065 617616272 617865372
3231.6 617865372 617727928 617370377 616606026 615740433 615052643 614072952 613191223 612934227 612522621 611298218
3241.3 611298218 609890976 609367523 610075111 609974289 609280243 609100685 608731155 608037605 606660271
3249.9 606660271 605885353 605549469 604834518 604195366 603547287 603275223 602945862 602152176 601250153 601224251
3259.6 601224251 601163826 600299568 599581985 598798180 598287964 597583084 597109833 597353134 597433968 597390137
3269.2 597390137 597058716 596343498 595257454 594439545 593378563 592558327 592425957 591605721 591346207
3277.9 591346207 591516991 591374321 590949173 589883461 588948784 588390541 587964478 587368507 586915894
3286.6 586915894 586701508 586475983 586156616 586074181 585961685 585191460 584969482 584607124 583680725 583083687
3296.2E83083687o63757m35334l97529l06473j82991n59769l44238j43356p63970j204948
3305.9E78081322r45740l14484k04124p22695m62722m21944n66483m97741m66461j86005
3315.5E73292923j151276j129112L2654m49333j118355q32520l01742k06871j27983
3324.2E68008385l02429j034585j835670j284943m34417p05605l36456o45256q62236
3332.9E60566788m15459m85611k57263m76685o81152j086197j116180q17910p19528
3341.6E54510803n69954r87396n42984o65321q48046m06341r88121p46956l85819j047668
3351.2E47322197j506729j151619q32596o05545m46510n44281j42327o38809j044617
3359.9E40409164o71882j257134j231193l03078n74646q97980o40983j094933p50732
$$ plain form
3296.2 583083687 582419930 581984596 581587067 581280594 581097603 580537834 580193596 580050240 579286270 578081322
3305.9 578081322 577135582 576821098 576616974 575894279 575431557 575009613 574443130 573945389 573478928 573292923
3315.5 573292923 572141647 571012535 571045189 570595856 569477501 568644981 568343239 568136368 568008385
3324.2 568008385 567705956 566671371 564835701 563550758 563116341 562410736 562074280 561429024 560566788
3332.9 560566788 560151329 559665718 559408455 558931770 558250618 557164421 556048241 555230331 554510803
3341.6 554510803 553940849 552953453 552410469 551745148 550897102 550490761 549502640 548755684 548369865 547322197
3351.2 547322197 545815468 544663849 543831253 543225708 542779198 542234917 542092590 541453781 540409164
3359.9 540409164 539737282 538480148 537248955 536945877 536371231 535473251 534832268 533737335 532986603
3368.6E32986603l12805o97174j015206j122436j043740j373443o16913k51274r11637
3377.2E25641975l04870m3373m70505o99081n88952l61938o02875j214714j096878
3385.9E20258789n01747l93982j13411l94745o05430q2818k64625j104202q21572J89362
3395.6E16165619j51634r84307r04770k89115j2246K26097J02463o84395q65974r98344
3405.2E11603394n43290k58903o26068o76308k55203J90925l57475o3057N2719m33235
3414.8E08633499o51970m23279L36113k85835l05061o02532r07936k2735L98559N68505
3424.5E06737328l47252j81465L87382Q3962o48041o96907O9923m0131N17579M4174
3434.1E05926552J9760L15781m6692N76782k69928o34346j32217L99627m0359R5977
$$ plain form
3368.6 532986603 532673798 531976624 530961418 529838982 528795242 527421799 526804886 526553612 525641975
3377.2 525641975 525337105 525293732 524823227 524124146 523535194 523173256 522570381 521355667 520258789
3385.9 520258789 519757042 519363060 519249649 518854904 518249474 518166656 517902031 516797829 515976257 516165619
3395.6 516165619 516013985 515029678 514124908 513835793 513823547 514049644 514152107 513467712 512601738 511603394
3405.2 511603394 511060104 510801201 510175133 509498825 509243622 509434547 509077072 509014015 509066734 508633499
3414.8 508633499 507981529 507558250 507894363 507608528 507303467 506700935 505792999 505770264 506168823 506737328
3424.5 506737328 506390076 506208611 506595993 506679955 506031914 505335007 505404930 505364799 505882378 505926552
3434.1 505926552 505946312 506262093 506215401 506792183 506522255 505887909 505755692 506155319 506114960 506210937
3443.8E06210937Q98858N65681J186333q76580p70721R09309J20469K60353J74408
3452.5E08679047R18655N29785J18904P80526Q35838N94024k86369Q60176P64427l61137
3462.1E13433876j65215M86031J091385O50024P65801L27453O18210O49414J65940
3470.8E18022919O36291J23558M79279M86984L47061J004715O40488J72691O95648
3479.5E22609634J171761Q73451N34706k04086N72739Q62159M28810R44062L99322
3488.1E28192558K81067O82144R19419Q21113J010704Q90465L06740O92100J67962
3496.8E33964272K13317P70684J026458J048279J132164J445046N37872J91536K28271
3505.5E40557899O49796K75383O50597R03015n49240J312980J689301R39140J014939
$$ plain form
3443.8 506210937 507109795 507675476 508861809 507985229 507214508 508123817 508244286 508504639 508679047
3452.5 508679047 509597702 510127487 510246391 511026917 511862755 512456779 512170410 513030586 513795013 513433876
3462.1 513433876 513268661 513754692 514846077 515496101 516261902 516589355 517207565 517856979 518022919
3470.8 518022919 518659210 518782768 519262047 519749031 520096092 521100807 521741295 521913986 522609634
3479.5 522609634 523781395 524654846 525189552 524985466 525558205 526420364 526849174 527793236 528192558
3488.1 528192558 528473625 529155769 530075188 530896301 531907005 532797470 533104210 533796310 533964272
3496.8 533964272 534177589 534948273 535974731 537023010 538155174 539600220 540138092 540329628 540557899
3505.5 540557899 541207695 541483078 542133675 543036690 542487450 543800430 545489731 546428871 547443810
3514.2E47443810Q78448P61299k34070L85208Q84095L63464N56603K023124K052193
3522.9E55114174j90315J15432J192704K072601R78432k02179j59874P40967J284637
3531.5E60946579N55725J077919P80029K051773R18732q97026J698685J128731O77604
3540.2E68938751M66233J258811J138382P66373J871986K74811J196366l84064R20105
3548.9E76447754K191887J431160K195091j266212P2860Q49152J602936K250404J84631
3557.6E85959663J729775J408615J324921O25076J658592J190643J57776N508004P27615
3566.2F00290680l069496j74904J7395M178619K036553O98547J035156J367302O01731
3574.9F06981583J337165K397843j15471K169037J948776L59955J758690K480507J748390
$$ plain form
3514.2 547443810 548322258 549083557 548849487 549234695 550118790 550482254 551038857 553061981 555114174
3522.9 555114174 554923859 555039291 556231995 558304596 559283028 559080849 558920975 559661942 560946579
3531.5 560946579 561502304 562580223 563360252 565412025 566330757 565433731 567132416 568261147 568938751
3540.2 568938751 569404984 570663795 571802177 572568550 574440536 574715347 575911713 575527649 576447754
3548.9 576447754 578639641 580070801 582265892 580999680 581072540 581921692 583524628 585775032 585959663
3557.6 585959663 587689438 589098053 590422974 591048050 592706642 593897285 594055061 599563065 600290680
3566.2 600290680 597221184 597046280 597063675 601242294 603278847 603977394 605012550 606379852 606981583
3574.9 606981583 608318748 610716591 610601120 612770157 614718933 615078888 616837578 619318085 621066475
3583.6F21066475O1760L856735K446289j777534J85928j348534L435326L268814K831726
3592.3F34026985J069756J65558L537483j954079R57375L166465N71595K881317N15518
3601F44937973N57632K456284J830597K004166K824325J827011j822967K807388m70352
3609.6F56952057L3798P993698J396561k869644L887100r79004K890930M862976R8954
3618.3F74267426l67508j503525J065216K832641K761612K793198K829666K448654
3626F87127380J764832N706711N54657j0671768L566741L726883N105057J910782k418060
3634.7F96373215J822509L751832K709808l93067N54581J675034K538452J179733p27081
3643.4G09485016K344971L775940O598052R82819m927597N259705l29285m454956k217712
$$ plain form
3583.6 621066475 621128235 624984970 627431259 625653725 625839653 624491119 627926445 631195259 634026985
3592.3 634026985 635096741 635262299 638799782 636845703 637803078 640969543 641541138 644422455 644937973
3601 644937973 645495605 647951889 649782486 651786652 654610977 656437988 654615021 657422409 656952057
3609.6 656952057 656985855 664979553 666376114 663506470 667393570 666414566 669305496 674168472 674267426
3618.3 674267426 673899918 672396393 673461609 676294250 679055862 681849060 684678726 687127380
3626 687127380 688892212 694598923 695153580 684481812 688048553 691775436 696880493 698791275 696373215
3634.7 696373215 698195724 701947556 704657364 704264297 704818878 706493912 709032364 710212097 709485016
3643.4 709485016 711829987 715605927 722203979 723186798 718259201 723518906 723189621 718734665 716516953
3652.1G16516953M400863L802872L881760M970855r354553J141129N637054J977768
3659.8G32974701J109009p91779J170426Q98284J203309J031341K52533M413223K852631
3668.5G45113678q9722M45252p835160J799546Q286285Q862991p44934j9550018K334366
3677.1G38622284P693405M690323k681961m91104K650146J499787Q71582m44718j40075
3685.8G52269669M218521O120453j0900574m189377R230270o082000j013260N176315
3693.5G54830017K51389J112823l06702q02536J051560m20685K340546L917007n339432
3702.2G56633987k986755M692841J912994m2801O3934L274994M631806p656784M170379
3710.9G64694595M869004j4414063L917389L834457L13645Q48617K406311J630936
$$ plain form
3652.1 716516953 720917816 724720688 728602448 733573303 724218750 725359879 730996933 732974701
3659.8 732974701 734083710 733291931 734462357 735360641 736563950 737595291 737847824 742261047 745113678
3668.5 745113678 745023956 745469208 737634048 739433594 747719879 756582870 755837936 736287918 738622284
3677.1 738622284 746315689 751006012 748324051 747832947 750483093 751982880 752854462 752409744 752269669
3685.8 752269669 756488190 762608643 751708069 747518692 756748962 750666962 749653702 754830017
3693.5 754830017 755081406 756194229 755887527 755084991 756136551 755715866 758056412 761973419 756633987
3702.2 756633987 753647232 758340073 760253067 760210266 760274200 763549194 768181000 760524216 764694595
3710.9 764694595 769563599 755149536 759066925 762901382 763215027 764063644 766469955 768100891
3718.6G68100891l580093N47485N667114l554077n228576N304260J367187r37271l401642
3727.3G64285278J84021M260865L75366N457840k939301q946762J0734635K889938
3735G76301880j0642471r30024L56217l44925L628311M321747m202576K408753J1974334
3743.7G82871246r155502j7144928R721985N325851N798035k820206j1378708Q102341
3751.4G71320114p802658l395538O096344M095840L382797n190506K534943N998764
3759.1G77040100q740463k957535L980179J418228M12140L674393l247223n621643
3766.8G65958176L513260N778961K46124j0361710J644135L623428O73905M43344r63059
3775.5G70556564R92432J148682L291931O99157q168258J776810K201919O79398J760940
$$ plain form
3718.6 768100891 764520798 765068283 770735397 767181320 761952744 767257004 768624191 767686920 764285278
3727.3 764285278 764469299 768730164 769105530 774563370 771624069 762677307 773411942 776301880
3735 776301880 765659409 764729385 765085602 764740677 768368988 772690735 768488159 770896912 782871246
3743.7 782871246 773715744 756570816 766292801 771618652 777416687 774596481 763217773 771320114
3751.4 771320114 763517456 760121918 766218262 770314102 773696899 768506393 771041336 777040100
3759.1 777040100 768299637 765342102 769322281 770740509 771152649 774827042 771579819 765958176
3766.8 765958176 769471436 775250397 775496521 765134811 766778946 770402374 771076279 771519623 770556564
3775.5 770556564 771548996 772697678 775989609 776688766 768520508 770297318 772499237 773178635 774939575
3784.2G74939575l826217j309128J768036O69326L02582o67114J13449L57590O02875
3792.9G72950974j61973J289978L328476m418716m116440K221375M541092O977081
3800.6G82611847o882248j0935364L271713K733155N090408N926743j0401993n626679
3808.3G65787582M987564K235032K2506Q5297K83737K231827O446457j539536j5881118
3817G64659348N422287O478271M653091J633225j8816757J431427N084991K507019
3824.7G73052902K961502m08783m975662m04053J986008L737030J484985r045181L576584
3833.4G71965332P971344o194687j42670Q904191r399643n074616P450485p988968
3841.1G67490768n86090P155533j680450k743759K307052J491089N70602K026062m59747
$$ plain form
3784.2 774939575 771113358 769804230 771572266 772241592 772544174 771877060 771990509 772348099 772950974
3792.9 772950974 772789001 774078979 777407455 772988739 768872299 771093674 775634766 782611847
3800.6 782611847 775729599 764794235 768065948 770799103 775889511 781816254 771414261 765787582
3808.3 765787582 770775146 773010178 773032684 773117981 773401718 775633545 782080002 780540466 764659348
3817 764659348 770081635 776559906 781212997 782846222 764029465 765460892 770545883 773052902
3824.7 773052902 776014404 775605621 770629959 770225906 772211914 775948944 777433929 768388748 771965332
3833.4 771965332 779936676 773741989 773599319 782503510 773103867 768029251 775479736 767490768
3841.1 767490768 766904678 774060211 772379761 769636002 771943054 773434143 774004745 776030807 775571060
3849.8G75571060J528473N593643m722595J197510j9534302J516495J1179581j191712
3857.5G71138153j295471K376633K435607L277970o040116p19223P483826n291061
3865.2G73366318o224976L800659N359421N494690q432312p716751L528442N275498
3872.9G74450989K529449r954834J799317M337005K59781K450485M222336p039032
3880.6G73055496p342911O883698R15298R43833M208069j3453293J915817M493256
3888.3G71619263J097336M445648j462097r952164K013321M562378p87659R43069R69315
3897G73448410K887650J129989j0788116N523834J696014n093917N455017l408661
3904.7G70850220k170410P4920Q72803K405624l34167j64108j63269P01141O40030
$$ plain form
3849.8 775571060 777099533 782693176 777970581 779168091 759633789 761150284 772329865 771138153
3857.5 771138153 769842682 772219315 774654922 777932892 771892776 771173553 778657379 773366318
3865.2 773366318 767141342 770942001 776301422 781796112 773363800 765647049 769175491 774450989
3872.9 774450989 776980438 767025604 768824921 773161926 773421707 775872192 780094528 773055496
3880.6 773055496 765712585 772596283 773511581 774455414 778663483 765210190 767126007 771619263
3888.3 771619263 772716599 777162247 775700150 765747986 767761307 772323685 771536026 772479095 773448410
3897 773448410 776336060 777466049 766677933 772201767 773897781 768803864 774258881 770850220
3904.7 770850220 768679810 768754730 769627533 772033157 771698990 771534882 771371613 772072754 772712784
3913.4G72712784q59299R23309K940140l664703m951859M472657K50778l584748K926941
3922.1G71166000J787491Q07419k407227l638229J803665K420044J018677k253952
3929.8G70703888o55441K445602k921982j891937K089996Q66242P04574K03553n52750
3938.5G70991745K60849o26221P54853J420059l559189m14963J483917N71289J472321
3947.2G72354660j009445O24618n26046l077546R71756P39823L00903L29361K46658
3955.8G70954742L95813n81665K95411l42560M32968M65164j845093K12403J86233
3964.5G70173416q26721O44302O90613M60510m04358p64083N56106q2321l19901J52512
3974.2G70280075m61578J0910K68478J44272L06320J86081p36923q67081m120K28577
$$ plain form
3913.4 772712784 771853485 772776794 775716934 772052231 767100372 771573029 771823807 768239059 771166000
3922.1 771166000 772953491 773760910 771353683 767715454 769519119 771939163 772957840 770703888
3929.8 770703888 770048447 772494049 769572067 767680130 769770126 770636368 771340942 771544495 770991745
3938.5 770991745 771252594 770626373 771381226 772801285 769242096 768827133 770311050 770882339 772354660
3947.2 772354660 771345215 771969833 771443787 768366241 769337997 770077820 770378723 770708084 770954742
3955.8 770954742 771350555 770768890 771064301 770721741 771154709 771619873 769774780 769987183 770173416
3964.5 770173416 769346695 769990997 770681610 771142120 770737762 769973679 770529785 770447464 770127563 770280075
3974.2 770280075 769818497 769829407 770097885 770242157 770548477 770734558 769997635 769130554 769126434 769355011
3983.8G69355011R87091K18887n26809N0735K59018N59769p52182r13391M59594J091919
3993.5G70789642N04303j244964q19168M58831J87912m12063L66211
4000.2G69830704
$$ plain form
3983.8 769355011 770342102 770560989 770034180 770084915 770343933 770903702 770151520 769238129 769697723 770789642
3993.5 770789642 771293945 770048981 769229813 769688644 769876556 769464493 769830704
4000.2 769830704
##END=$$ End of the data block
