##TITLE=$$ Begin of the data block
##JCAMP-DX=5.00 $$ ACD/SpecManager v 10.08
##SPECTROMETER/DATA SYSTEM=Varian
##DATE=18 Dec 2012 13:33:22
##DATA TYPE=INFRARED SPECTRUM
##DATA CLASS=XYDATA
##ORIGIN=
##OWNER=
##NPOINTS=3735
##FIRSTX=399.26403809
##LASTX=4000.35498047
##MAXX=4000.35498047
##MINX=399.26403809
##MAXY=75.23486328
##MINY=43.79324341
##XFACTOR=1.0000000000
##YFACTOR=0.000000100000000
##FIRSTY=65.10633850
##DELTAX=0.96440572
##XUNITS=1/CM
##YUNITS=TRANSMITTANCE
##XYDATA=(X++(Y..Y))
$$ plain form
399.3 651063385 657097168 656240082 658332062 664800339 661896591 655837326 649803009 646961288 650751266
407.9 650751266 650553513 653538361 659985046 657434692 654318848 654384613 648611526 645013428 647975769
416.6 647975769 641686630 623788033 642201691 655645752 655356522 654124985 652556152 651594543
424.3 651594543 650811691 651945648 652470856 653350601 656205215 656505356 652553711 647776566 646091843
433 646091843 645078506 645224686 650113297 655897217 657298431 655555878 650739899 645142975 643867722
441.7 643867722 647518387 652663269 658062973 659298401 654316940 645215988 644295731 647330475 648419876
450.4 648419876 652005920 651358185 645086441 644423523 645922241 646598816 647133713 648026581 645221176
459.1 645221176 642635956 645253906 648248291 644927216 643096390 642708664 637904434 638320808 640378647
$$ packed form
399.3F51063385O033783q57086K091980O468277k903748o059265o034317k841721L789978
407.9F50751266j97753K984848O446685k550354l115844O5765n773087l598098K962341
416.6F47975769o289139j7898597J8413658J3444061k89230j231537j568833r61609
424.3F51594543p82852J133957N25208Q79745K854614L00141l951645m777145j684723
433F46091843j013337J46180M888611N783920J401214j742553m815979n596924j275253
441.7F43867722L650665N144882N399704J235428m981461r100952r20257L034744J089401
450.4F48419876L586044o47735o271744o62918J498718O76575N34897Q92868k805405
459.1F45221176k585220K617950K994385l321075j830826l87726m804230M16374K057839
$$ plain form
467.7 640378647 635594368 633537140 635190010 640903015 643265305 637947235 638477287 641682358 644109573
476.4 644109573 642811050 643040009 644782791 646664581 647046356 642919617 640490036 643137283 648575363
485.1 648575363 647756500 645497665 648779297 651260529 651058350 647193222 643449936 640920868 640313568
493.8 640313568 643181381 643756943 644921570 644913330 645911102 647607269 644252625 643202209 643133545
502.5 643133545 641576920 642025223 644912415 646762085 645988846 646926498 646296539 645028305 643524475
511.1 643524475 641421814 641987839 641152267 639309349 639557724 641141586 640683441 639814148 640659561
519.8 640659561 639719200 638838158 638002167 637109642 638036575 638170700 638169899 638977242 638768311 638428116
529.5 638428116 638164444 637823181 636567574 635506363 635714722 634562950 634365845 636191406 636792030
$$ packed form
467.7F40378647m784279k057228J652870N713005K362290n318070N30052L205071K427215
476.4F44109573j298523K28959J742782J881790L81775m126739k429581K647247N438080
485.1F48575363q18863k258835L281632K481232k02179l865128l743286k529068o07300
493.8F40313568K867813N75562J164627q240R97772J696167l354644j050416o8664
502.5F43133545j556625M48303K887192J849670p73239R37652o29959j268234j503830
511.1F43524475k102661N66025q35572j842918K48375J583862m58145q69293Q45413
519.8F40659561r40361q81042q35991q92525R26933J34125q01Q07343k08931l40195
529.5F38428116k63672l41263j255607j061211K08359j151772j97105J825561O00624
$$ plain form
538.1 636792030 636459808 636412048 635412598 633720093 635001259 635749626 634483871 635061035 636117287
546.8 636117287 636947517 636540260 637162323 639700775 640016098 637764664 634483185 634048271 636102905
555.5 636102905 637030716 637074471 637707062 638599091 639310837 638675728 636313858 636052742 636306038 635442390
565.1 635442390 635693665 636393585 636519775 635813255 636246910 635617943 635175629 636113815 634854584 634201202
574.8 634201202 634323692 636144218 637672081 636974716 637438927 637175217 636215210 634972801 633332443
583.5 633332443 632803040 633113976 635141220 636807938 636680069 637297096 638889084 638399773 635985909
592.1 635985909 635207481 635152512 634397926 633859787 634174614 635061417 636894569 637119980 635728951 635580368
601.8 635580368 634868698 633569145 631384659 629515839 629445992 628941002 628687935 629199142 629187202 628818932
$$ packed form
538.1F36792030l32222m7760r99450j692505J281166P48367j265755N77164J056252
546.8F36117287Q30230m07257O22063K538452L15323k251434l281479m34914K054634
555.5F36102905R27811M3755O32591Q92029P11746o35109k361870k61116K53296q63648
565.1F35442390K51275O99920J26190p06520M33655o28967m42314R38186j259231o53382
574.8F34201202J22490J820526J527863o97365M64211k63710r60007j242409j640358
583.5F33332443n29403L10936K027244J666718j27869O17027J591988m89311k413864
592.1F35985909p78428n4969p54586n38139L14827Q86803J833152K25411j391029j48583
601.8F35580368p11670j299553k184486j868820o9847n04990k53067N11207j1940l68270
$$ plain form
611.4 628818932 628007355 625812836 623820610 622403297 621675644 622235184 622566490 624034195 624801521
620.1 624801521 624229774 624003868 623638306 623888626 622875290 621994400 623725281 626065483 628586311
628.8 628586311 631640091 634704704 635688553 634933853 635799522 636878738 635866585 634398651 632783699
637.5 632783699 632081451 633253822 635195923 638562927 640945358 641419907 641453323 640987396 640990982 641033249
647.1 641033249 641367569 642048340 643645172 645873489 646113129 646251984 647214737 647028580 645590744
655.8 645590744 645658112 647331238 647015228 646696930 647729187 648597488 648421097 648463287 649885788 650372467
665.4 650372467 651065216 650649567 642432175 644330750 648001328 651389389 652951508 653096085 652494354
674.1 652494354 651803589 652475433 652776718 653469162 653971100 652899017 652796936 654117737 654971848
$$ packed form
611.4F28818932q11577k194519j992226j417313p27653N59540L31306J467705P67326
620.1F24801521n71747k25906l65562K50320j013336q80890J730881K340202K520828
628.8F28586311L053780L064613R83849p54700Q65669J079216j012153j467934j614952
637.5F32783699p02248J172371J942101L367004K382431M74549L3416m65927L586M2267
647.1F41033249L34320O80771J596832K228317K39640J38855R62753j86157j437836
655.8F45590744O7368J673126l16010l18298J032257Q68301j76391M2190J422501M86679
665.4F50372467O92749m15649q217392J898575L670578L388061J562119J44577o01731
674.1F52494354o90765O71844L01285O92444N01938j072083j02081J320801Q54111
$$ plain form
682.8 654971848 654892197 654417191 653765717 653591461 653465729 652692795 652250519 652936859 652968826 652116623
692.4 652116623 652456665 651870193 649930496 649282990 649254990 648665085 648403397 649203644 649694443 649595413
702.1 649595413 649695511 650101318 650595779 650018616 649123993 648787155 648695831 649289093 650710907 652356949
711.7 652356949 653868866 655902939 657386627 657587891 657697067 657684555 657364273 656954117 657142410
720.4 657142410 657902756 658583832 660218735 662497787 663742828 663769608 662902145 661390915 660369644
729.1 660369644 660250473 660143127 660470276 661268616 662222061 664104156 664862213 664403687 664250259 663134689
738.7 663134689 662768021 663748932 664126282 664182816 664592590 665738297 668152390 670525665 671240540
747.4 671240540 671800995 671746216 670886917 671270599 672365799 674037094 675717926 678046036 680610199
$$ packed form
682.8F54971848p9651m75006o51474j74256j25732p72934m42276O86340L1967q52203
692.4F52116623L40042n86472j939697o47506k8000n89905k61688Q00247M90799r9030
702.1F49595413J00098M05807M94461n77163q94623l36838r1324N93262J421814J646042
711.7F52356949J511917K034073J483688K01264J09176j2512l20282m10156J88293
720.4F57142410P60346O81076J634903K279052J245041K6780q67463j511230j021271
729.1F60369644j19171j07346L27149P98340R53445J882095P58057m58526j53428j115570
738.7F63134689l66668R80911L77350N6534M09774J145707K414093K373275P14875
747.4F71240540N60455n4779q59299L83682J095200J671295J680832K328110K564163
$$ plain form
756.1 680610199 681582108 681068192 680142670 681177826 681543274 681250305 681903381 681987839 683041611 683961868
765.7 683961868 684619522 685037689 684738235 683993835 681974716 681062088 681881866 683193893 684030380
774.4 684030380 684415436 685215302 686117554 686703720 687231064 688534393 689247360 689991913 691172791
783.1 691172791 692073593 693569565 694536362 695298233 696051788 696856537 697190018 696388702 695878754 695535507
792.7 695535507 695410461 696674652 698877029 699141693 698312149 698750381 699634018 700108185 699550095
801.4 699550095 698745041 697950821 697974167 699643097 701820526 702528534 702079086 702518463 702733688 703531723
811.1 703531723 704205627 703812180 703933487 703395081 702995453 703347855 704699554 706590271 706784821
819.7 706784821 705997314 705661697 705129395 704256210 704576340 704967422 704575882 704903259 705329895 703779602
$$ packed form
756.1F80610199R71909n13916r25522J035156L65448k92969O53076Q4458J053772R20257
765.7F83961868O57654M18167k99454p44400k019119r12628Q19778J312027Q36487
774.4F84030380L85056P99866R02252N86166N27344J303329P12967P44553J180878
783.1F91172791R00802J495972R66797P61871P53555Q04749L33481q01316n09948l43247
792.7F95535507j25046J264191K202377K64664q29544M38232Q83637M74167n58090
801.4F99550095q05054p94220K3346J668930K177429P08008m49448M39377K15225P98035
811.1G03531723O73904l93447J21307n38406l99628L52402J351699J890717J94550
819.7G06784821p87507l35617n32302q73185L20130L91082l91540L27377M26636j550293
$$ plain form
829.4 703779602 702169647 702044296 700602188 698264618 696187820 694997635 693863144 692165298 691380234
838.1 691380234 690351486 689634933 688659668 686630478 685185852 684011917 683237534 682860413 682651672
846.8 682651672 682304001 682426834 683491287 683717422 683946304 684665680 684860764 686223831 688334579
855.4 688334579 689252701 690525970 692371521 693824234 695355606 696117783 696660309 697758560 698805161
864.1 698805161 699251633 699473495 700105667 701113739 702418747 703105011 703871078 704274826 704073257
872.8 704073257 704562836 705460205 706538925 706985245 707619095 707701492 707038040 706837082 705796127 704300613
882.4 704300613 702266159 699825668 697875824 697096100 697154922 697245026 697508240 697967758 698535995 698079453
892.1 698079453 696957245 695871887 695523224 696122513 696516647 697029800 697743530 698914566 699454422
$$ packed form
829.4G03779602j609955j25351j442108k337570k076798j190185j134491j697846p85064
838.1F91380234j028748p16553r75265k029190j444626j173935p74383l77121k08741
846.8F82651672l47671J22833J064453K26135K28882P19376J95084J363067K110748
855.4F88334579R18122J273269J845551J452713J531372P62177N42526J098251J046601
864.1F98805161M46472K21862O32172J008072J305008O86264P66067M03748k01569
872.8G04073257M89579Q97369J078720M46320O33850Q2397o63452k00958j040955j495514
882.4G04300613k034454k440491j949844p79724N8822R0104K63214M59518N68237m56542
892.1F98079453j122208j085358l48663N99289L94134N13153P13730J171036N39856
$$ plain form
900.8 699454422 699456787 699851532 699336166 698015366 696040497 694529037 694128571 694316101 693833847 692949524
910.4 692949524 693041382 692392044 690677338 688352966 686382294 684794312 682761917 681658554 681206436
919.1 681206436 680484238 679736252 679254379 678299255 677110901 676267395 674444885 672364731 671463089
927.8 671463089 670488586 669216995 669815826 671115646 671600876 672328568 672751389 672944260 673143082
936.4 673143082 673142548 673832855 675573502 677476273 679035645 681177216 683428268 685005341 685956726
945.1 685956726 686350937 686348190 686496124 687547302 688755646 689876709 690225067 690510941 691355286 691439667
954.8 691439667 691530838 691111679 689878769 688401108 687056656 685869522 684505692 683753967 682991791
963.4 682991791 681306839 679686661 679249420 678154984 675990677 674544601 673901596 673791275 673705521
$$ packed form
900.8F99454422K365L94745n15366j320800j974869j511460m00466J87530m82254q84323
910.4F92949524R1858o49338j714706k324372j970672j587982k032395j103363m52118
919.1F81206436p22198p47986m81873r55124j188354q43506j822510k080154r01642
927.8F71463089r74503j271591N98831J299820M85230P27692M22821J92871J98822
936.4F73143082n34O90307J740647J902771J559372K141571K251052J577073R51385
945.1F85956726L94211k747J47934J051178J208344J121063L48358K85874Q44345Q4381
954.8F91439667R1171m19159j232910j477661j344452j187134j363830p51725p62176
963.4F82991791j684952j620178m37241j094436k164307j446076o43005j10321q5754
$$ plain form
972.1 673705521 673856506 673299713 672111588 671165543 669767990 668735886 667499466 666096115 665597916
980.8 665597916 665652618 665359268 664653625 664478455 663502960 661864700 660448990 658404465 656639557
989.5 656639557 655750275 654653778 653173904 652532883 652132339 650273437 647807999 646196365 645508347
998.2 645508347 645109863 643947372 642209015 641708755 642492065 642317657 641173935 640406418 639333115
1006.8 639333115 637665672 636104202 634888153 634000130 633550797 633049202 631843872 631159096 631038246
1015.5 631038246 629786835 627857780 626809349 625343094 622907562 621578102 620793228 620301247 619631004
1024.2 619631004 618207016 617527809 617134361 616501007 615509377 613801689 611848221 610859642 610417328
1032.9 610417328 609497910 608455696 607707100 608333092 609015121 609176254 609330902 608953400 607735901
$$ packed form
972.1F73705521J50985n56793j188125r46045j397553j032104j236420j403351m98199
980.8F65597916N4702k93350p05643j75170r75495j638260j415710k044525j764908
989.5F56639557q89282j096497j479874o41021m00544j858902k465438j611634o88018
998.2F45508347l98484j162491j738357n00260P83310j74408j143722p67517j073303
1006.8F39333115j667443j561470j216049q88023m49333n01595j205330o84776j20850
1015.5F31038246j251411j929055j048431j466255k435532j329460p84874m91981o70243
1024.2F19631004j423988o79207l93448o33354r91630j707688j953468r88579m42314
1032.9F10417328r19418j042214p48596O25992O82029J61133J54648l77502j217499
$$ plain form
1041.6 607735901 606276131 606274300 606656075 607398872 607793236 607733879 609044189 609885864 609684944 608835716
1051.2 608835716 608358536 607904930 606811600 606830597 607537346 607976990 607395325 607254524 607944069 607457237
1060.9 607457237 606228256 605058746 604339828 604744873 605563011 605263290 605360146 606025238 606279411
1069.5 606279411 606009712 604960213 604538689 604105301 604010773 604393959 604130821 603977127 603662949 603610573
1079.2 603610573 604369850 605515137 606009750 605400772 604618530 604589615 604848824 605348892 606091805 606113625
1088.8 606113625 606073837 605732880 606037865 606173897 604811440 603772926 602843437 602496529 601543808
1097.5 601543808 600823708 601448326 601182022 600739594 600013046 599405251 598074837 596307831 595649338
1106.2 595649338 594880714 594395599 594288330 594425011 593718948 592255173 591226349 590882225 590729980
$$ packed form
1041.6F07735901j459770j831L81775P42797L94364n9357J310310Q41675k00920q49228
1051.2F08835716m77180m53606j093330J8997P06749M39644n81665j40801O89545m86832
1060.9F07457237j228981j169510p18918M05045Q18138k99721R6856O65092K54173
1069.5F06279411k69699j049499m21524m33388r4528L83186k63138j53694l14178n2376
1079.2F03610573P59277J145287M94613o08978p82242k8915K59209N00068P42913K1820
1088.8F06113625l9788l40957L04985J36032j362457j038514r29489l46908r52721
1097.5F01543808p20100O24618k66304m42428p26548o07795j330414j767006o58493
1106.2E95649338p68624m85115j07269J36681p06063j463775j028824l44124j52245
$$ plain form
1114.9 590729980 590813599 591205330 590747147 590885429 590903511 591708450 592524376 591854553 592373314 592141151
1124.5 592141151 591828575 591666107 591309509 591084099 591049652 592328796 592455444 592897186 593373337 593261375
1134.1 593261375 593458939 593644333 594403000 594199982 593889694 593550301 594164391 594842377 594175606 593468628
1143.8 593468628 592397194 592328682 591577721 590757561 590273628 589680939 590397987 590510674 590418510 589814453
1153.4 589814453 589547539 589312325 589056396 589869118 590475121 591575928 591827583 592364197 593828888
1162.1 593828888 595209541 596820869 598244324 599698830 600834045 602288971 603870850 605778580
1169.8 605778580 607647552 610032005 612952995 614817352 617206535 619272003 620425911 621534195
1177.5 621534195 623198242 625416603 627402573 629251823 630376358 632164574 634123764 634750671
$$ packed form
1114.9E90729980Q3619L91731m58183J38282J8082Q04939Q15926o69823N18761k32163
1124.5E92141151l12576j62468l56598k25410l4447J279144J26648M41742M76151j11962
1134.1E93261375J97564J85394P58667k03018l10288l39393O14090O77986o66771p06978
1143.8E93468628j071434o8512p50961q20160m83933n92689P17048J12687r2164o04057
1153.4E89814453k66914k35214k55929Q12722O06003J100807K51655N36614J464691
1162.1E93828888J380653J611328J423455J454506J135215J454926J581879J907730
1169.8F05778580J868972K384453K920990J864357K389183K065468J153908J108284
1177.5F21534195J664047K218361J985970J849250J124535J788216J959190O26907
$$ plain form
1185.3 634750671 634836082 634924965 635438690 636038589 637146454 638023834 638686028 639736481 640453110 641354370
1194.9 641354370 641886139 642321930 643034821 643524246 643917542 643953476 643913727 643795242 644444504 645673752
1204.5 645673752 645938568 645858994 645909271 645812454 645480499 645237961 645568924 645580978 644804230 644602280
1214.2 644602280 645277252 645646591 645400391 645195541 644805679 644018631 643772964 643472137 642879944 642747192
1223.8 642747192 642953796 643087540 642517853 642271652 642079697 641571045 641396179 641088028 641273270 641386261
1233.5 641386261 641239090 641531525 642067719 642202530 641706009 641744614 642199478 642652435 642687302 642460327
1243.1 642460327 642579956 642422256 642033997 641733475 641678619 641537933 641353989 641407471 641649399 641834564
1252.8 641834564 641782074 641729813 641362762 641553192 641926727 641975174 642201157 641915512 641834793 642061234
$$ packed form
1185.3F34750671Q5411Q8883N13725N99899J107865Q77380O62194J050453P16629R01260
1194.9F41354370N31769M35791P12891M89425L93296L5934l9749j18485O49262J229248
1204.5F45673752K64816p9574N0277r6817l31955k42538L30963J2054p76748k01950
1214.2F44602280O74972L69339k46200k04850l89862p87048k45667l00827n92193j32752
1223.8F42747192K06604J33744n69687k46201j91955n08652j74866l08151J85242J12991
1233.5F41386261j47171K92435N36194J34811m96521L8605M54864M52957L4867k26975
1243.1F42460327J19629j57700l88259l00522n4856j40686j83944N3482K41928J85165
1252.8F41834564n2490n2261l67051J90430L73535M8447K25983k85645q0719K26441
$$ plain form
1262.4 642061234 642560043 642913513 642913818 643491821 643832245 643902588 644155350 644549103 644826508 644863358
1272 644863358 645343018 646223984 647011108 647594223 648175125 648542023 648682938 648949890 649705124 650516891
1281.7 650516891 650877991 651312256 651959991 652948761 654210205 655331192 655930252 656396637 656992722
1290.4 656992722 657091217 657306213 658296890 659243469 659936600 661224365 662692490 663599854 664058838
1299 664058838 664507675 665303192 665746918 665966415 666470261 666987076 667510605 668098526 668555145 668829880
1308.7 668829880 669350662 670095062 670725708 670863419 670771942 670965576 670995407 671146164 672028122 673141174
1318.3 673141174 673700790 673938828 674566879 675245209 675628052 675762329 675573654 675644989 676313934 676845551
1328 676845551 677330704 677939758 677922058 677646561 677645569 677509460 678166580 679132156 678547897 678093796 678376236
$$ packed form
1262.4F42061234M98809L53470L05N78003L40424P0343K52762L93753K77405L6850
1272F44863358M79660Q80966P87124N83115N80902L66898J40915K66952P55234Q11767
1281.7F50516891L61100M34265O47735R88770J261444J120987N99060M66385N96085
1290.4F56992722R8495K14996R90677R46579O93131J287765J468125R07364M58984
1299F64058838M48837P95517M43726K19497N03846N16815N23529N87921M56619K74735
1308.7F68829880N20782P44400O30646J37711r1477J93634K9831J50757Q81958J113052
1318.3F73141174N59616K38038O28051O78330L82843J34277j88675P1335O68945N31617
1328F76845551M85153O09054j7700k75497r92j36109O57120R65576n84259m54101K82440
$$ plain form
1338.6 678376236 678292923 678210373 678429947 678765717 678403168 678000031 677914124 677948227 678563995 679086990
1348.2 679086990 679162598 678847961 678424149 677970200 677489700 676882629 676324005 676072083 675927353 676161194
1357.9 676161194 676299286 676273193 676312561 676271973 675741425 674539413 674348526 674002838 673305206 673031082
1367.5 673031082 672877274 672633820 672332840 671848297 671392899 671326675 670797958 669749222 669118805 668970032
1377.2 668970032 668763199 668403702 668617706 668745499 668607712 668503418 668417206 668360672 668946838 670390015
1386.8 670390015 670959854 671399689 672396774 673056183 673822861 674617081 675405579 675297852 673731308
1395.5 673731308 673132019 672958069 672685928 671600800 671303024 671615601 671539612 671282272 671511230 670896072
1405.1 670896072 669818268 669942551 669542618 668855438 668278427 668058548 667932434 667355957 667334824 667217789
$$ packed form
1338.6F78376236q3313q2550K19574L35770l62549m03137q5907L4103O15768N22995
1348.2F79086990P5608l14637m23812m53949m80500o07071n58624k51922j44730K33841
1357.9F76161194J38092k6093L9368m0588n30548j202012j90887l45688o97632k74124
1367.5F73031082j53808k43454l00980m84543m55398o6224n28717j048736o30417j48773
1377.2F68970032k06833l59497K14004J27793j37787j04294q6212n6534N86166J443177
1386.8F70390015N69839M39835R97085O59409P66678P94220P88498j07727j566544
1395.5F73731308n99289j73950k72141j085128k97776L12577p5989k57340K28958o15158
1405.1F70896072j077804J24283l99933o87180n77011k19879j26114n76477k1133j17035
$$ plain form
1414.8 667217789 667472305 667814331 667538528 667216949 663589249 663629990 664922409 665465317 666001511
1423.4 666001511 665546494 665283203 665496902 665589294 665778046 665632935 664844360 664824295 665465698 665509491
1433.1 665509491 665463104 666245422 667544403 666637878 665681152 666578522 666845093 667123489 667417068 667274094
1442.7 667274094 667763367 668072128 668554611 669371338 669368973 668541183 668823700 669460449 669657364 669782104
1452.4 669782104 670226974 671871338 673614426 674148560 673254089 670752640 671843414 673158417 674699020
1461.1 674699020 675607376 676256256 678555374 679301834 678270035 678929443 679701767 680349884 681066971
1469.7 681066971 682407990 682891159 682785568 684791870 687451248 689996262 690258408 690615997 692327881
1478.4 692327881 693388824 694446487 694924774 694926071 695995560 697106094 697349854 698452911 699589615
$$ packed form
1414.8F67217789K54516L42026k75803l21579l627700M0741J292419N42908N36194
1423.4F66001511m55017k63291K13699R2392J88752j45111p88575k0065O41403M3793
1433.1F65509491m6387P82318J298981r06525r56726Q97370K66571K78396K93579j42974
1442.7F67274094M89273L08761M82483Q16727k365q27790K82517O36749J96915J24740
1452.4F69782104M44870J644364J743088N34134q94471k501449J090774J315003J540603
1461.1F74699020R08356O48880K299118P46460j031799O59408P72324O48117P17087
1469.7F81066971J341019M83169j05591K006302K659378K545014K62146L57589J711884
1478.4F92327881J060943J057663M78287J297J069489J110534K43760J103057J136704
$$ plain form
1487.1 699589615 698636475 699578781 699017487 696688461 696797943 697234879 697576065 698004837 699096756
1495.8 699096756 695930328 696183395 695914459 692881546 693360596 692737198 691549454 690884018 691713867
1504.5 691713867 693166656 688231888 684355011 685344543 685844345 683666916 683360291 682076797 679626389
1513.1 679626389 679419174 678678513 678278122 676555786 673946991 674880524 677182465 676029892 671397095
1521.8 671397095 671459045 671327515 672467651 670054092 669106979 669752350 668179474 667175293 667124405
1530.5 667124405 667498169 667441635 667283325 662833023 662538452 662995605 663014984 665216675 663768387
1539.2 663768387 657650757 659807892 661159668 660153503 660638809 662118301 659861526 660206680 660759506
1547.9 660759506 661852875 662189026 660225372 661004562 661486588 662700195 662161255 662437286 665340652
$$ packed form
1487.1F99589615r53140R42306n61294k329026J09482M36936L41186M28772J091919
1495.8F99096756l166428K53067k68936l032913M79050o23398j187744o65436Q29849
1504.5F91713867J452789m934768l876877R89532M99802k177429l06625j283494k450408
1513.1F79626389k07215p40661m00391j722336k608795R33533K301941j152573m632797
1521.8F71397095O1950j31530J140136k413559r47113O45371j572876j004181n0888
1530.5F67124405L73764n6534j58310m450302k94571M57153J9379K201691j448288
1539.2F63768387o117630K157135J351776j006165M85306J479492k256775L45154N52826
1547.9F60759506J093369L36151j963654P79190M82026J213607n38940K76031K903366
$$ plain form
1556.5 665340652 667542343 662834015 651568146 661599579 665096970 666283035 666876678 667393570
1564.2 667393570 667509384 667869034 669092407 670031433 671202850 668402863 668006516 668983612 668928223
1572.9 668928223 669035034 669245453 669767151 666795425 667680511 668179932 667573700 667602081 667065735 666871490
1582.6 666871490 665703964 664537125 663582611 662592697 661749649 660766220 660789642 659585266 658500214
1591.2 658500214 656977234 655755920 654829788 652854156 651736221 649887009 648915863 647711563 646455841
1599.9 646455841 644857407 643359146 642455750 640026779 638531075 636499748 635091362 632974167
1607.6 632974167 631283913 630176506 627503815 626557465 624504623 622946739 621158600 620800133 620823593
1616.3 620823593 612762032 612592316 611881981 611315117 608884888 607604294 607230453 603802719 602938004
$$ packed form
1556.5F65340652K201691m708328j1265869J0031433L497391J186065N93643N16892
1564.2F67393570J15814L59650J223373R39026J171417k799987l96347R77096n5389
1572.9F68928223J06811K10419N21698k971726Q85086M99421o06232K8381n36346j94245
1582.6F66871490j167526j166839r54514r89914q43048r83429K3422j204376j085052
1591.2F58500214j522980j221314r26132j975632j117935j849212r71146j204300j255722
1599.9F46455841j598434j498261r03396k428971j495704k031327j408386k117195
1607.6F32974167j690254j107407k672691r46350k052842j557884j788139l58467K3460
1616.3F20823593q061561j69716p10335n66864k430229j280594l73841l427734q64715
$$ plain form
1625 602938004 601142006 601230087 598887253 595660667 594615326 593609352 593010292 591541252 591919899
1633.7 591919899 592001381 588981857 586787338 587867393 587000618 586301765 587063637 586256676 587014656
1642.4 587014656 586324234 586802750 588749771 588901482 589027481 586119156 587331581 587923737 589813461
1651 589813461 591878815 592007370 592838058 590814934 592708702 593494453 594806900 595457268 596218987
1659.7 596218987 597010460 597991982 600166130 599507065 600909386 602109528 603615761 605311127 607256927
1668.4 607256927 608228302 607677574 610301476 610155373 611580544 613931465 615344467 615901566 617717705
1677.1 617717705 620134850 621107826 623155746 623827400 625917282 629617577 631057625 631647758 630552788
1685.8 630552788 633995171 636679916 638023415 639628105 640795822 642748260 644619598 646941299
$$ packed form
1625F02938004j795998Q8081k342834l226586j045341j005974n99060j469040L78647
1633.7E91919899Q1482l019524k194519J080055q66775o98853P61872q06961P57980
1642.4E87014656o90422M78516J947021J51711J25999k908325J212425N92156J889724
1651E89813461K065354J28555Q30688k023124J893768P85751J312447O50368P61719
1659.7E96218987P91473R81522K174148o59065J402321J200142J506233J695366J945800
1668.4F07256927R71375n50728K623902j46103J425171K350921J413002N57099J816139
1677.1F17717705K417145R72976K047920O71654K089882L700295J440048N90133j094970
1685.8F30552788L442383K684745J343499J604690J167717J952438J871338K321701
$$ plain form
1693.5 646941299 649609604 652869492 652211685 654266968 658328934 662973938 667364273 660757828
1701.2 660757828 665020523 668217468 670558701 672238998 673865585 676155930 677629776 680009842
1708.9 680009842 681686554 682902832 684750824 686199646 688153687 689371262 689589691 691666336
1716.6 691666336 693831177 689946136 690372696 691634521 691686172 691891556 691360397 690776443 691460571
1725.3 691460571 692182388 692580338 692999649 694812164 695725937 695291214 697216492 700100861 701381836
1734 701381836 696031342 696956787 699063416 700248337 702171860 703343964 701822815 703513107 705642929
1742.7 705642929 705946503 706335526 708154678 709687881 710720978 712002182 712457199 715149536 717344131
1751.3 717344131 716881256 719058609 720787582 722664261 725430832 725421066 725511398 726807785 728183823
$$ packed form
1693.5F46941299K668305L259888o57807K055283M061966M645004M390335o606445
1701.2F60757828M262695L196945K341233J680297J626587K290345J473846K380066
1708.9F80009842J676712J216278J847992J448822J954041J217575K18429K076645
1716.6F91666336K164841l885041M26560J261825N1651K05384n31159n83954O84128
1725.3F91460571P21817L97950M19311J812515R13773m34723J925278K884369J280975
1734G01381836n350494R25445K106629J184921J923523J172104j521149J690292K129822
1742.7G05642929L03574L89023J819152J533203J033097J281204M55017K692337K194595
1751.3G17344131m62875K177353J728973J876679K766571r766R0332J296387J376038
$$ plain form
1760 728183823 730710297 730777206 730021667 731398544 732112350 732687683 733686829 735077591 733466721
1768.7 733466721 733745041 736332169 737350311 736758957 734682922 736332397 737449341 736182861 737180939
1777.4 737180939 737871246 738643646 739397888 738899078 739161072 740048752 741235428 740896072 740342560
1786 740342560 741212311 741477966 741152496 741921616 742659607 743009644 741824722 740912018 743133011 744382401
1795.7 744382401 743492432 743424301 744349442 744523926 743330917 744053345 744110794 744106750 744961319 745131531
1805.3 745131531 745523071 745991364 745747147 745670776 746252975 745710983 745770569 746476059 746499100 746717453
1815 746717453 746779633 747356339 747234955 747257080 747976837 747861710 748028030 747276611 747282715 748759232
1824.6 748759232 747940598 747389221 748353271 749739761 750380554 747350922 747044373 748333435 748578415
$$ packed form
1760G28183823K526474O6909p55539J376877P13806N75333R99146J390762j610870
1768.7G33466721K78320K587128J018142n91354k076035J649475J116944j266480R98078
1777.4G37180939O90307P72400P54242m98810K61994Q87680J186676l39356n53512
1786G40342560Q69751K65655l25470P69120P37991L50037j184922r12704K220993J249390
1795.7G44382401q89969o8131R25141J74484j193009P22428N7449m044Q54569J70212
1805.3G45131531L91540M68293k44217p6371N82199n41992N9586P05490K3041K18353
1815G46717453O2180N76706j21384K2125P19757j15127J66320p51419O104J476517
1824.6G48759232q18634n51377R64050J386490O40793l029632l06549J289062K44980
$$ plain form
1833.3 748578415 748756943 748842316 749326935 749652023 748971252 749359818 749497147 749549179 749655075 750483246
1842.9 750483246 751791382 748755264 748725662 749967880 750080261 749513321 749573441 750013733 749772186
1851.6 749772186 749944687 750184784 750412369 750310669 750188065 750537033 750556030 750532455 750320969 750491104
1861.3 750491104 750382614 750530777 750914688 750796967 751067505 750679321 750969162 750980835 749980927 750388336
1870.9 750388336 750679703 750844803 750940552 751202621 751369095 751484299 751608124 751606216 751338501 751079712
1880.6 751079712 751567230 751294632 750958176 751062012 751093445 751284790 751136017 751803589 752348633 750997467
1890.2 750997467 750355225 750758133 751100998 751629257 751834641 750865631 751026688 751532211 751491013 751357422
1899.8 751357422 751235886 751337509 751199417 751143799 750906372 750602722 750491943 750614319 750942917 751402969
$$ packed form
1833.3G48578415J78528Q5373M84619L25088o80771L88566J37329N2032J05896Q28171
1842.9G50483246J308136l036118k9602J242218J12381n66940O0120M40292k41547
1851.6G49772186J72501K40097K27585j01700j22604L48968J8997k3575k11486J70135
1861.3G50491104j08490J48163L83911j17721K70538l88184K89841J1673r99908M07409
1870.9G50388336K91367J65100R5749K62069J66474J15204J23825j908k67715k58789
1880.6G51079712M87518k72598l36456J03836L1433J91345j48773O67572N45044j351166
1890.2G50997467o42242M02908L42865N28259K05384r69010J61057N05523m1198j33591
1899.8G51357422j21536J01623j38092n5618k37427l03650j10779J22376L28598M60052
$$ plain form
1909.5 751402969 751469421 750760269 751070328 751170883 750634384 750147858 750022964 751143341 750589371 749569626
1919.1 749569626 749992905 750543442 751457367 750991745 750044250 750333481 750269318 749604874 749449768 749442749
1928.8 749442749 749447327 749760666 750096588 750402603 749899063 749487534 749417801 749427567 749576569 749265518
1938.4 749265518 749238129 749115982 749437332 749834442 748768692 748710480 748981781 748651505 748579788 748814697
1948.1 748814697 748702011 748521729 748722916 748905182 748913956 748778381 748545685 748275223 748361893 748500290
1957.7 748500290 748311539 748124161 748138351 748179321 747934799 747964249 747975082 747828445 748032532 747934723
1967.3 747934723 747498322 747441940 747593155 747442627 747342529 747393723 747362213 746958542 746264725 746193619
1977 746193619 746407013 746550903 746498871 746372604 746417084 746289749 746299591 746239700 745931854 745726471 745775909
$$ packed form
1909.5G51402969O6452p09152L10059J00555n36499m86526j24894J120377n53970j019745
1919.1G49569626M23279N50537R13925m65622r47495K89231o4163o64444j55106p019
1928.8G49442749M578L13339L35922L06015n03540m11529o9733R766J49002l11051
1938.4G49265518k7389j22147L21350L97110j065750n8212K71301l30276p1717K34909
1948.1G48814697j12686j80282K01187J82266Q774j35575k32696k70462Q6670J38397
1957.7G48500290j88751j87378J4190M0970k44522K9450J0833j46637K04087r7809
1967.3G47934723m36401n6382J51215j50528j00098N1194l1510m03671o93817p1106
1977G46193619K13394J43890n2032j26267M4480j27335R842n9891l07846k05383M9438
$$ plain form
1987.6 745775909 745636139 745321655 745734711 746003265 744962769 744401932 744882278 744889832 744604416 744476013
1997.2 744476013 744286346 744191589 743830795 743905334 744308243 744392090 744409332 744451370 744457626 743805389 743317184
2007.8 743317184 743382339 743202591 742840347 742387390 742171173 742280426 742496643 742820663 743067780 742669907
2017.5 742669907 742353668 742438965 742136307 741641998 741290131 741292801 741207733 741273270 741537857 741118546
2027.1 741118546 740840302 740971909 740850067 740519028 740366516 740189209 739992294 740175934 740137634 739898834
2036.8 739898834 739832840 739669952 739454041 739614716 739551620 739124374 739061356 738855743 738658905 738603973
2046.4 738603973 738817520 738916016 738390121 738307343 738340378 738155975 737978363 737842941 738002625 738172760
2056.1 738172760 737949371 737416763 737349091 737326508 737228470 737199097 736976089 737207565 737459717 737162552
$$ packed form
1987.6G45775909j39770l14484M13056K68554j040496n60837M80346P554k85416j28403
1997.2G44476013j89667r4757l60794P4539M02909Q3847J7242M2038O256o52237m88205
2007.8G43317184O5155j79748l62244m52957k16217J09253K16217L24020K47117l97873
2017.5G42669907l16239Q5297l02658m94309l51867K670q5068O5537K64587m19311
2027.1G41118546k78244J31607j21842l31039j52512j77307j96915J83640l8300k38800
2036.8G39898834o5994j62888k15911J60675o3096m27246o3018k05613j96838n4932
2046.4G38603973K13547R8496n25895q2778L3035j84403j77612j35422J59684J70135
2056.1G38172760k23389n32608o7672k2583r8038k9373k23008K31476K52152k97165
$$ plain form
2065.7 737162552 736750183 736714325 736622086 736138916 735956192 735947037 735867996 735966797 736208496 736061020 735810547
2076.3 735810547 735816727 735535278 735310287 735331955 734948349 734369659 734274979 734500046 734968643 735332947
2086 735332947 735322495 735184860 734990463 734825134 733961105 733350067 733581772 733807602 734095001 734021149
2095.6 734021149 734060287 734286575 734462585 734505310 734142532 733935165 733650131 733450775 733300629 733326263
2105.2 733326263 733509293 733470001 733635941 733583374 733367310 733304214 733510056 733477707 733256226 733305054
2114.9 733305054 733088150 733090668 733043671 733071060 733301620 733300781 733333740 733234558 733351059 733089218 732643814
2125.5 732643814 732581482 732468185 732520523 732528534 732487869 732583389 732907333 732848816 732663727 732805176 732544403
2136.1 732544403 732603531 732820740 732519455 732096252 731801224 731791916 731968155 732201157 732401428 732381897
$$ packed form
2065.7G37162552m12369l5858r2239m83170j82724r155p9041R8801K41699j47476k50473
2076.3G35810547O180k81449k24991K1668l83606n78690r4680K25067M68597L64304
2086G35332947j0452j37635j94397j65329q64029o11038K31705K25830K87399p3852
2095.6G34021149L9138K26288J76010M2725l62778k07367k85034j99356j50146K5634
2105.2G33326263J83030l9292J65940n2567k16064o3096K05842l2349k21481M8828
2114.9G33305054k16904K518m6997K7389K30560q39L2959r9182J16501k61841m45404
2125.5G32643814o2332j13297N2338Q011m0665R5520L23944n8517j85089J41449k60773
2136.1G32544403N9128K17209l01285m23203k95028r308J76239K33002K00271j9531
$$ plain form
2145.8 732381897 731981964 731790619 731900711 731952896 731989975 732050629 732058945 731777802 731798706 731953430 732130508
2156.4 732130508 732565613 732469711 732119904 731986694 731974182 731976471 732055054 732115097 732002029 731941986 731918030
2167 731918030 731950073 732133636 732318954 732212906 732390518 732565079 732117386 731740189 731490173 731487503
2176.6 731487503 731457062 731437454 731613922 731981125 732629623 732589264 732231674 731856689 731583710 731690063
2186.3 731690063 731527405 731354904 731534729 731968155 732192307 732394562 732553482 732301331 731903763 731564331
2195.9 731564331 731517639 731260757 730983353 731047134 731464615 731900787 732023544 732222061 731901169 731534653
2205.5 731534653 731521149 731430588 731330109 731221695 731317368 731362686 731464310 731531830 731604080 731657867 731756287
2216.1 731756287 732078629 732025681 731954117 731476288 730723877 730667877 731220779 731486511 731062469 731193695
$$ packed form
2145.8G32381897l99933j91345J10092N2185L7079O0654Q316k81143K0904J54724J77078
2156.4G32130508M35105r5902l49807j33210j2512K289P8583O0043j13068o0043k3956
2167G31918030L2043J83563J85318j06048J77612J74561m47693l77197k50016k670
2176.6G31487503l0441j9608J76468L67203O48498m0359l57590l74985k72979J06353
2186.3G31690063j62658j72501J79825M33426K24152K02255J58920k52151l97568l39432
2195.9G31564331m6692k56882k77404O3781M17481M36172J22757J98517l20892l66516
2205.5G31534653j3504r0561j00479j08414R5673M5318J01624O7520P2250N3787R8420
2216.1G31756287L22342n2948p1564m77829p52411n6000N52902K65732m24042J31226
$$ plain form
2225.8 731193695 731282730 730953445 730977478 731131516 731153564 730733948 730335236 730209579 730322266 730546188
2235.4 730546188 730821915 730989227 730928192 730842667 730529327 730355835 730313339 730323944 730057449 729640656
2245.1 729640656 729537277 729684677 730259247 730343552 730476456 730496674 729951019 729791870 729652710 729904785
2254.7 729904785 729864502 729525604 729313202 729077148 729402924 729743195 730341187 730500641 730074005 729761581
2264.4 729761581 729346542 729287720 729215775 729070053 728818512 728560791 728780212 729199142 729290314 729190216
2274 729190216 729276199 728918076 728439484 728560638 728958511 729000778 729043427 729068680 728763351 729000015 729239655
2284.6 729239655 729318008 729344482 729255829 728954926 728221436 728097305 727973938 727911301 728048935 728012085
2294.3 728012085 728069992 728220444 728654099 728289261 728113937 728417740 728283539 728135834 727838211 728112259
$$ packed form
2225.8G31193695Q9035l29285K4033J54038K2048m19616l98712j25657J12687K23922
2235.4G30546188K75727J67312o1035q5525l13340j73492m2496J0605k66495m16793
2245.1G29640656j03379J47400N74570Q4305J32904K0218n45655j59149j39160K52075
2254.7G29904785m0283l38898k12402k36054L25776L40271N97992J59454m26636l12424
2264.4G29761581m15039n8822p1945j45722k51541k57721K19421M18930R1172j00098
2274G29190216Q5983l58123m78592J21154L97873M2267M2649K5253l05329K36664K39640
2284.6G29239655P8353K6474q8653l00903p33490j24131j23367o2637J37634l6850
2294.3G28012085N7907J50452M33655l64838j75324L03803j34201j47705k97623K74048
$$ plain form
2303.9 728112259 728162155 727907104 727915955 728310852 728793793 728545609 728529053 727951126 727513199 727442398
2313.5 727442398 727144012 727548065 727318268 727272110 728055267 728781128 728728333 728533325 728482285 727140961
2323.2 727140961 726468048 726409683 726593246 727390060 727736664 727770691 727776566 727568512 726785202 727343674
2332.8 727343674 727849960 727407074 727536774 726871109 726164932 726009293 726535721 727108612 727392960 727505798
2342.5 727505798 726913452 727077789 727234116 727754364 728086624 727300262 727493820 728230515 728526840 728609161
2352.1 728609161 727852707 727037506 726668701 726400299 727206726 728489685 728608475 727381134 726893082
2360.8 726893082 726461639 724252625 723813019 724090729 724484863 726987915 727697220 727110977 727238922
2369.5 727238922 727523651 727899704 727600784 727016296 726829453 727196274 727449112 727147675 727331467 727952805
$$ packed form
2303.9G28112259M9896k55051Q851L94897M82941k48184j6556n77927m37927p0801
2313.5G27442398k98386M04053k29797m6158P83157P25861n2795j95008n1040j341324
2323.2G27140961o72913n8365J83563P96814L46604L4027N875k08054p83310N58472
2332.8G27343674N06286m42886J29700o65665p06177j55639N26428N72891K84348J12838
2342.5G27505798n92346J64337J56327N20248L32260p86362J93558P36695K96325Q2321
2352.1G28609161p56454q15201l68805k68402Q06427J282959J18790j227341m88052
2360.8G26893082m31443k209014m39606K77710L94134K503052P09305n86243J27945
2369.5G27238922K84729L76053k98920n84488j86843L66821K52838l01437J83792O21338
$$ plain form
2379.1 727952805 727859955 727520370 727867889 728384094 728496017 728107376 727563629 727747345 728497772 728657990
2388.8 728657990 728418045 728437729 728246536 727983246 727791138 727546539 727522736 727590942 727964630 728161087
2398.4 728161087 727843933 727667389 727495270 727612000 727887726 727725830 727468719 727306442 727419434 727420578
2408.1 727420578 727272491 727313690 727062531 727207794 727560043 727009811 726562347 726601562 726523972 726562576
2417.7 726562576 726662216 726624146 726793289 727030411 726824417 726460266 726471024 726657257 726454391 726178818
2427.3 726178818 726196136 726145554 726135330 726239777 726169586 725971146 725825272 725610275 725429687 725532608
2437 725532608 725618668 725595551 725589294 725569611 725431519 725266724 725039368 724690094 724812012 724957657 724709549
2447.6 724709549 724713593 724891891 725009766 724899750 724569168 724171829 724004669 724186630 724132156 724012070
$$ packed form
2379.1G27952805r2850l39585L47519N16205J11923l88641n43747J83716P50427J60218
2388.8G28657990k39945J9684j91193k63290j92108k44599k3803O8206L73688J96457
2398.4G28161087l17154j76544j72119J16730K75726j61896k57111j62277J12992J144
2408.1G27420578j48087M1199k51159J45263L52249n50232m47464L9215p7590L8604
2417.7G26562576R9640l8070J69143K37122k05994l64151J0758J86233k02866k75573
2427.3G26178818J7318n0582j0224J04447p0191j98440j45874k14997j80588J02921
2437G25532608Q6060k3117o257j9683j38092j64795k27356l49274J21918J45645k48108
2447.6G24709549M044J78298J17875j10016l30582l97339j67160J81961n4474j20086
$$ plain form
2457.2 724012070 724047394 724178467 724380417 724248505 724065475 723925095 723636246 723146515 722586746 722694855
2466.9 722694855 723016129 722844849 722582245 722594070 722801361 722976379 723090515 722761917 722520752 722702408
2476.5 722702408 722408447 721958923 721699219 721746750 721802750 721707458 722005768 721983795 721914520 721860123 721152191
2487.1 721152191 720859222 721125641 720997086 720518570 720531235 720907288 721010208 720893936 720564423 720197144
2496.8 720197144 720035248 720029755 719864273 719736786 719899902 719922485 719690399 719670639 719942398 719853516
2506.4 719853516 719832001 719978409 719597626 719113846 718769913 718651581 718706512 718926239 719020615 718717194
2516.1 718717194 718662643 718645935 718423920 717988663 717745514 718077011 717929001 717695770 718109436 718263092
2525.7 718263092 718113480 718087769 718084412 718024292 717746811 717455750 717283707 717127991 717272034 717506027
$$ packed form
2457.2G24012070L5324J31073K01950j31912j83030j40380k88849m89731n59769J08109
2466.9G22694855L21274j71280k62604J1825K07291J75018J14136l28598k41165J81656
2476.5G22702408k93961m49524k59704M7531N6000r5292K98310k1973o9275n4397p07932
2487.1G21152191k92969K66419j28555m78516J2665L76053J02920j16272l29513l67279
2496.8G20197144j61896n493j65482j27487J63116K2583k32086j9760K71759q8882
2506.4G19853516k1515J46408l80783m83780l43933j18332N4931K19727R4376l03421
2516.1G18717194n4551j6708k22015m35257k43149L31497j48010k33231M13666J53656
2525.7G18263092j49612k5711l357o0120k77481k91061j72043j55716J44043K33993
$$ plain form
2535.4 717506027 717579269 717539597 717307510 716973648 716711807 716614761 716523514 716389389 716149063 715971985
2545 715971985 716088867 716458282 716766968 716352844 715905838 715937805 715781784 715593872 715432053 715027084
2554.6 715027084 714711380 714813461 715057602 715285568 715473099 715344086 714983978 714677658 714464951 714429779
2564.3 714429779 714439850 714144363 714164200 714525757 714656372 714605408 714121246 713888931 714093018 713987732
2573.9 713987732 713658752 713508224 713717117 713732529 713442154 713059006 712950745 713086853 712901001 712618561
2583.6 712618561 712143631 711976242 712348862 712272263 711722107 711373138 711620026 712026215 712198944 712236633
2593.2 712236633 711904144 711168289 710832138 710944138 710811462 710697479 710745621 710807800 710599213 710092545
2602.9 710092545 709758148 709682312 709700775 709570236 709442139 709191360 709055023 709251709 709152374 708852997
$$ packed form
2535.4G17506027P3242l9672k32087l33862k61841r7046r1247j34125k40326j77078
2545G15971985J16882L69415L08686m14124m47006L1967j56021j87912j61819m04969
2554.6G15027084l15704J02081K44141K27966J87531j29013l60108l06320k12707l5172
2564.3G14429779J0071k95487J9837L61557J30615n0964m84162k32315K04087j05286
2573.9G13987732l28980j50528K08893J5412k90375l83148j08261J36108j85852k82440
2583.6G12618561m74930j67389L72620p6599n50156l48969K46888M06189J72729L7689
2593.2G12236633l32489p35855l36151J12000j32676j13983M8142O2179k08587n06668
2602.9G10092545l34397p5836J8463j30539j28097k50779j36337J96686r9335k99377
$$ plain form
2612.5 708852997 708681335 708831177 708516159 707646942 707459335 707610779 707516785 707219315 707183685 707577057
2622.1 707577057 707639999 707121811 706466293 706098709 705899124 705795059 705880890 705856094 705550385 705346069
2631.8 705346069 705392914 705494080 705430908 705153275 705086136 704950256 704652405 704387436 704086533 704131851
2641.4 704131851 704007492 703573837 703290863 703212433 703146515 702651672 702358932 702365189 702307129 702454681
2651.1 702454681 702218323 701542969 701203613 701202469 701280823 701320038 701004486 700572128 700867157 701154861
2660.7 701154861 700463409 700204926 700553818 700339355 699997406 699591293 699170380 698991623 698711777 698445816
2670.4 698445816 698490601 698847427 699110565 699001846 698556519 698008575 697499619 697230377 697334290 697428513
2680 697428513 697307816 696795807 696676025 697138519 697227173 697060242 696599121 696307373 696318512 696114883
$$ packed form
2612.5G08852997j71662J49842l15018q69217j87607J51444r3994k97470l5630L93372
2622.1G07577057O2942n18188o55518l67584j99585j04065Q5831k4796l05709k04316
2631.8G05346069M6845J01166o3172k77633o7139j35880k97851k64969l00903M5318
2641.4G04131851j24359m33655k82974p8430o5918m94843k92740O257n8060J47552
2651.1G02454681k36358o75354l39356j144P8354L9215l15552m32358K95029K87704
2660.7G01154861o91452k58483L48892k14463l41949m06113m20913j78757k79846k65961
2670.4F98445816M4785L56826K63138j08719m45327n47944n08956k69242J03913R4223
2680F97428513j20697n12009j19782M62494Q8654j66931m61121k91748J1139k03629
$$ plain form
2689.6 696114883 695921173 695435486 695210037 695389175 694862213 694422989 694769669 694991989 694830399 694618378
2699.3 694618378 694403000 693801727 693437576 693688660 693406067 693120041 693186569 693142242 693118210 693118134 693142166
2709.9 693142166 692436295 691783371 691705093 691785049 692044373 691709976 691433563 691455460 691623154 691463776
2719.5 691463776 690750732 690660400 690524673 690332565 689999771 689455185 689469833 689279099 689078293 689126205
2729.2 689126205 688884354 688327255 688249054 688400879 687891541 687620850 687692184 687545929 687293701 687312622
2738.8 687312622 687451859 687505493 687581787 687092819 686540298 686169662 685670395 685748520 686259460 686480026
2748.5 686480026 686434479 686176834 685695724 685277100 684793701 684451828 684428406 684550858 684325256 683676987
2758.1 683676987 683768311 683893051 683489685 683215408 683220139 683384476 682734222 682008057 681956940 681938019
$$ packed form
2689.6F96114883j93710m85687k25449J79138n26962m39224L46680K22320j61590k12021
2699.3F94618378k15378o01273l64151K51084k82593k86026O6528m4327k4032p6K4032
2709.9F93142166p05871o52924p8278P9956K59324l34397k76413K1897J67694j59378
2719.5F91463776p13044r0332j35727j92108l32794n44586J4648j90734k00806M7912
2729.2F89126205k41851n57099p8201J51825n09338k70691P1334j46255k52228J8921
2738.8F87312622J39237N3634P6294m88968n52521l70636m99267P8125N10940K20566
2748.5F86480026m5547k57645m81110m18624m83399l41873k3422J22452k25602o48269
2758.1F83676987R1324J24740m03366k74277M731J64337o50254p26165n1117j8921
$$ plain form
2767.8 681938019 681782990 681456680 681401443 681451721 681068573 680660019 680701141 680657349 680277786 679888992
2777.4 679888992 679453583 679024429 678785400 678834534 678793182 678811340 678615036 678144989 678191986 678038788
2787 678038788 677492523 676801910 676382446 676312485 675972214 675807953 675472412 674913254 674740067 674773026
2796.7 674773026 674571686 674149170 673615723 672892914 672620621 672491379 672435684 672460022 671955261 671471176
2806.3 671471176 671053925 670793610 670721130 670510025 670086517 669493790 669061584 668663559 668306198 667975464
2816 667975464 667729187 667439651 667040176 666848450 666537933 666080704 665669861 665253143 664462738 663676453
2825.6 663676453 663529892 663561249 663523788 662956238 662091904 661728058 661544266 661367493 661114655 660517883
2835.3 660517883 659960251 659267883 658023300 657158508 656416092 655340347 654678879 653831711 652480392
$$ packed form
2767.8F81938019j55029l26310n5237N0278l83148m08554M1122m3792l79563l88794
2777.4F79888992m35409m29154k39029M9134m1352J8158j96304m70047M6997j53198
2787F78038788n46265o90613m19464o9961l40271j64261l35541n59158j73187L2959
2796.7F74773026k01340m22516n33447p22809k72293j29242n5695K4338n04761m84085
2806.3F71471176m17251k60315p2480k11105m23508n92727m32206l98025l57361l30734
2816F67975464k46277k89536l99475j91726l10517m57229m10843m16718p90405p86285
2825.6F63676453j46561L1357l7461n67550q64334l63846j83792j76773k52838n96772
2835.3F60517883n57632o92368j244583q64792p42416j075745o61468q47168j351319
$$ plain form
2843.9 652480392 650960007 649442139 648391953 647465668 645923615 644260330 643180847 642522278 642298584
2852.6 642298584 641874390 641206818 640934143 640516129 640305405 640687561 641034241 641055222 640967484 640877151
2862.3 640877151 640636520 640243912 639836273 639696655 639379463 638670158 637924767 637334213 636945686 636401711
2871.9 636401711 636312256 636442719 635902710 635732460 635919838 635632973 635082626 634254723 633668900 633492775
2881.6 633492775 633131065 633003883 632762070 632021141 631795502 632021103 631723709 630781403 629966316 629673462
2891.2 629673462 629275932 628318977 627907791 628032532 627276077 626470413 626153030 625732231 625084114 624360695
2900.8 624360695 623650208 622932739 622747383 622236137 621428337 621165047 620884895 620851288 620760727 620170250
2910.5 620170250 619244652 618189354 617048302 616032028 615351677 614496918 613811302 612995605 612288132
$$ packed form
2843.9F52480392j520385j517868j050186r26285j542053j663285j079483o58569k23694
2852.6F42298584m24194o67572k72675m18014k10724L82156L46680K0981q7738r0333
2862.3F40877151k40631l92608m07639j39618l17192p09305p45391n90554l88527n43975
2871.9F36401711q9455J30463n40009j70250J87378k86865n50347q27903n85823j76125
2881.6F33492775l61710j27182k41813p40929k25639K25601k97394r42306q15087k92854
2891.2F29673462l97530r56955m11186J24741p56455q05664l17383m20799o48117p23419
2900.8F24360695p10487p17469j85356n11246q07800k63290k80152l3607r0561n90477
2910.5F20170250r25598j055298j141052j016274o80351q54759o85616q15697p07473
$$ plain form
2919.2 612288132 611939735 610922394 609726715 609251556 609961586 610316010 609656944 609204597 609251251
2927.8 609251251 609817505 610074272 610242844 610345116 610224342 610373878 610776024 611322746 611308098 611350517
2937.5 611350517 611657982 612123833 613021431 613546257 613830910 614048767 614310074 614598541 614450760 613949127
2947.1 613949127 613503075 613375816 613469353 613541718 613168411 612683105 612265282 611995850 611874161 611331291
2956.8 611331291 611176147 611667023 611828918 611486092 611410332 611688423 611696892 611558418 611635056 612281303
2966.4 612281303 612875595 612918320 612930984 613446121 614113693 614244537 614946671 616097260 616325607 616249580
2976.1 616249580 616704483 617213669 617304916 617494164 617873344 618240242 618360901 618507919 619041634 619311447
2985.7 619311447 619566994 619731407 619678612 620237122 620810318 620707130 620368462 620146217 620062370 620390053
$$ packed form
2919.2F12288132l48397j017341j195679m75159P10030L54424o59066m52347M6654
2927.8F09251251N66254K56767J68572J02272j20774J49536M02146N46722j4648M2419
2937.5F11350517L07465M65851Q97598N24826K84653K17857K61307K88467j47781n01633
2947.1F13949127m46052j27259R3537P2365l73307m85306m17823k69432j21689n42870
2956.8F11331291j55144M90876J61895l42826p5760K78091Q469j38474P6638O46247
2966.4F12281303N94292M2725J2664N15137O67572J30844P02134J150589K28347p6027
2976.1F16249580M54903N09186R1247J89248L79180L66898J20659J47018N33715K69813
2985.7F19311447K55547J64413n2795N58510N73196j03188l38668k22245q3847L27683
$$ plain form
2995.3 620390053 621098251 621424408 621270409 620962029 620625687 620717163 620843658 620492783 620350342 620420990
3005 620420990 620222778 619869995 619861450 620091553 619523621 618897629 619172058 619214745 618938904 618917809 618742714
3015.6 618742714 618395882 618020630 617701797 617485085 617088318 616526756 615936737 615322037 614939957 614959106
3025.2 614959106 614646645 614081802 613723946 613066597 612995567 613318863 612917366 612613602 612317810 611723824
3034.9 611723824 611168518 610605659 610027618 609785423 609644356 609135628 608669891 608189659 607898712 607781105
3044.5 607781105 607250595 606377182 605701027 605580215 605102501 604402504 603935661 603439903 603173294 602887878
3054.2 602887878 602800560 602516479 601557541 600966644 600642014 599943619 599359779 599012794 598679390 598400078
3063.8 598400078 597942352 597716064 597743950 597595444 597058525 596287842 595715866 594941940 594570198 594594994
$$ packed form
2995.3F20390053P08198L26157j53999l08380l36342R1476J26495l50875j42441P0648
3005F20420990j98212l52783q545K30103n67932o25992K74429M2687k75841k1095j75095
3015.6F18742714l46832l75252l18833k16712l96767n61562n90019o14700l82080J9149
3025.2F14959106l12461n64843l57856o57349p1030L23296m01497l03764k95792n93986
3034.9F11723824n55306n62859n78041k42195j41067n08728m65737m80232k90947j17607
3044.5F07781105n30510q73413o76155j20812m77714o99997m66843m95758k66609k85416
3054.2F02887878q7318k84081r58938n90897l24630o98395n83840l46985l33404k79312
3063.8E98400078m57726k26288K7886j48506n36919p70683n71976p73926l71742K4796
$$ plain form
3073.5 594594994 594409256 594356041 594050064 593234787 592191429 592002869 592055779 591443024 590865059 590580330
3083.1 590580330 590654297 590128250 589319115 588873940 588830605 588877716 588304062 587770500 587113037 586862488
3092.7 586862488 586618538 586054230 586177177 585732841 584924278 584199142 583865623 583913269 583354683 582583618
3102.4 582583618 581796799 581491890 581240959 580727539 580301247 580051575 580177460 579778366 579207535 578919334
3112 578919334 578338470 577726440 577313576 576694717 576113091 576282043 576364059 575388222 574137383 573504868
3121.7 573504868 572931824 572301369 571759377 571150703 571002121 570867844 570557327 569953423 569310760 569159431
3131.3 569159431 568868675 568170815 567088318 566568680 566291046 565602150 565476570 565294495 564317970
3140 564317970 563594894 563494911 562898331 562021294 561527901 561339149 560738144 559772072 559719658 559242363
$$ packed form
3073.5E94594994j85738n3215l05977q15277j043358j88560N2910o12755n77965k84729
3083.1E90580330P3967n26047q09135m45175m3335M7111n73654n33562o57463k50549
3092.7E86862488k43950n64308J22947m44336q08563p25136l33519M7646n58586p71065
3102.4E82583618p86819l04909k50931n13420m26292k49672J25885l99094n70831k88201
3112E78919334n80864o12030m12864o18859n81626J68952Q2016r75837j250839o32515
3121.7E73504868n73044o30455n41992o08674j48582j34277l10517o03904o42663j51329
3131.3E69159431k90756o97860j082497n19638k77634o88896j25580j82075r76525
3140E64317970p23076r9983n96580q77037m93393j88752o01005r66072n2414m77295
$$ plain form
3149.6 559242363 558407631 557918434 557158356 556980667 556475677 555511284 554997635 554534607 553917007 553175392
3159.3 553175392 552255707 551529617 551441154 551050034 550523186 550283318 549749146 549061356 548337173 547376213
3168.9 547376213 546507835 546534576 546530762 545730553 544594765 544041710 544120407 543657913 542946091 541863556
3178.6 541863556 541104012 540898933 540336571 539569550 538718529 538490791 537887573 536943665 536668892 536702538
3188.2 536702538 536817894 535982399 534890785 534079971 533248100 532453690 531810455 531521721 530943031
3196.9 530943031 530453873 530283470 530112190 529574966 529062080 528536186 527348480 526743622 526506233
3205.6 526506233 526186256 525787582 525253639 524799232 523990326 523384018 522889290 522590523 522155838 521192474
3215.2 521192474 520660515 520470047 520305901 519529381 518619728 518313560 517793007 517277374 516912193 516095085
$$ packed form
3149.6E59242363q34732m89197p60078j77689n04990r64393n13649m63028o17600p41615
3159.3E53175392r19685p26090q8463l91120n26848k39868n34172o87790p24183r60960
3168.9E47376213q68378K6741l814q00209j135788n53055P8697m62494p11822j082535
3178.6E41863556p59544k05079n62362p67021q51021k27738o03218r43908k74773L3646
3188.2E36702538J15356q35495j091614q10814q31871p94410o43235k88734n78690
3196.9E30943031m89158j70403j71280n37224n12886n25894j187706o04858k37389
3205.6E26506233l19977l98674n33943m54407q08906o06308m94728k98767m34685r63364
3215.2E21192474n31959j90468j64146p76520r09653l06168n20553n15633l65181q17108
$$ plain form
3224.9 516095085 515471382 515345497 514994354 514607849 514118996 513902359 513907089 513133621 512272720 511671295
3234.5 511671295 511105232 510681496 510341263 509919968 509324760 508562164 507980652 507787590 507397957 507367134
3244.2 507367134 507323303 506681633 506343307 505945129 505298347 504916344 504985008 504419403 503730545 503818970
3253.8 503818970 503213921 502570724 502518120 502104454 501277657 500721359 500421028 499882584 499509087 499395142
3263.4 499395142 499203339 498595657 498155746 498157349 498074265 497841072 497427025 496831474 496075325 495834618
3273.1 495834618 495531197 495029221 494864807 494272537 493750648 493377457 493018074 492353325 491563187 491325493
3282.7 491325493 491021461 490880699 490629387 490249290 490229607 490115662 489462090 488829384 488749809 488219261
3292.4 488219261 487610168 487195129 486779175 486726761 486098709 485050621 484751968 484962540 484927635 484859390
$$ packed form
3224.9E16095085o23703j25885l51143l86505m88853k16637M730p73468q60901o01425
3234.5E11671295n66063m23736l40233m21295n95208p62596n81512j93062l89633l0823
3244.2E07367134m3831o41670l38326l98178o46782l82003O8664n65605o88858Q8425
3253.8E03818970o05049o43197n2604m13666q26797n56298l00331n38444l73497j13945
3263.4D99395142j91803o07682m39911J603q3084k33193m14047n95551p56149k40707
3273.1D95834618l03421n01976j64414n92270n21889l73191l59383o64749p90138k37694
3282.7D91325493l04032j40762k51312l80097j9683j13945o53572o32706p9575n30548
3292.4D88219261o09093m15039m15954n2414o28052j048088k98653K10572l4905o8245
$$ plain form
3302 484859390 484373283 483527603 483240814 482949028 482351189 481733322 481204224 480554161 480171585 479996490
3311.7 479996490 479346390 478794899 478296432 477713852 477200813 476888199 476700287 476153755 475381699 475058670
3321.3 475058670 475258560 474910088 474412117 474039383 473557053 472912102 471708908 470928459 470268555
3330 470268555 469597206 469410172 469456024 469412384 468938904 468470039 467464714 466565285 466630554 466728134
3339.6 466728134 466210251 465339203 464948769 464561119 464282074 463932991 463138657 462637939 462254829 461987457
3349.3 461987457 461636848 461084518 460573425 460190811 459811401 459392738 458994789 458195572 457324066 456675262
3358.9 456675262 456484413 456449165 455860252 455192146 454993744 454886322 454467697 453964348 453264427 453161507
3368.6 453161507 453135948 452398682 451804924 450907097 450342140 449818382 449196320 449372025 449252014 449177399
$$ packed form
3302D84859390m86107q45680k86789k91786n97839o17867n29098o50063l82576j75095
3311.7D79996490o50100n51491m98467n82580n13039l12614j87912n46532p72056l23029
3321.3D75058670J99890l48472m97971l72734m82330o44951j203194p80449o59904
3330D70268555o71349j87034M5852m3640m73480m68865j005325q99429O5269R7580
3339.6D66728134n17883q71048l90434l87650k79045l49083p94334n00718l83110k67372
3349.3D61987457l50609n52330n11093l82614l79410m18663l97949p99217q71506o48804
3358.9D56675262j90849l5248n88913o68106j98402j07422m18625n03349o99921j02920
3368.6D53161507k5559p37266n93758q97827n64957n23758o22062J75705j20011p4615
$$ plain form
3378.2 449177399 449216576 448828545 448283882 447696114 447358780 447504768 447318611 446346436 446016388 445719604
3387.8 445719604 445180779 445087433 444934158 445009575 444642105 443759918 443213806 443357162 443751602 443343163
3397.5 443343163 443149376 443135109 442745094 442558479 442250671 441820145 441430397 441186256 441169357 441206474
3407.1 441206474 441285095 441205635 441177559 441053696 440841103 440922394 440530853 439946175 439514999 439512138 439945030
3417.7 439945030 439515305 439377060 439555435 438700066 438163033 438201904 438088799 437932434 438574371 439470634
3427.4 439470634 439589539 439684868 439920807 439622879 438944321 438698311 439266930 439949417 440002403 439959488
3437 439959488 439700546 439436493 439702911 439938698 440191917 439659386 439501686 440252953 440893517 441815491
3446.7 441815491 441063881 440022812 440623741 441534729 441777916 441393242 441480408 441990967 442988434 443361511
$$ packed form
3378.2D49177399L9177l88031n44663n87768l37334J45988j86157r72175l30048k96784
3387.8D45719604n38825r3346j53275P5417l67470q82187n46112J43356L94440m08439
3397.5D43343163j93787j4267l90015j86615l07808m30526l89748k44141j6899L7117
3407.1D41206474P8621p9460k8076j23863k12593Q1291l91541n84678m31176k861M32892
3417.7D39945030m29725j38245J78375q55369n37033L8871j13105j56365O41937Q96263
3427.4D39470634J18905R5329K35939k97928o78558k46010N68619O82487N2986m2915
3437D39959488k58942k64053K66418K35787K53219n32531j57700P51267O40564R21974
3446.7D41815491p51610j041069O00929R10988K43187l84674Q7166N10559R97467L73077
$$ plain form
3456.3 443361511 443161507 443868866 444264679 443697166 443083572 443739510 444571114 444530983 444508018 444728813
3466 444728813 445065193 445199242 445655136 446073074 446602325 447237053 447193031 447258911 447793427 448330040
3475.6 448330040 448457260 448745155 449026146 449376259 450354843 451458969 451764069 450847893 450840912 451716614
3485.2 451716614 452546043 453169136 453009033 452376671 452500572 453823128 454103813 454309464 455209770
3493.9 455209770 455409966 456005325 456268044 456622925 457504044 458108292 458723145 459609375 459937630 459254723
3503.6 459254723 459285088 459392128 459506035 460072746 461759300 463028831 461984215 462139511 462765808
3512.2 462765808 463595047 464177017 464043312 465035095 466195755 467030220 466856804 466303711 466582909
3520.9 466582909 467951660 469509888 469278374 469144363 469575462 470122986 470105553 470247765 471177368
$$ packed form
3456.3D43361511k00004P07359L95813n67513o13594O55938Q31604m0131k2965K20795
3466D44728813L36380J34049M55894M17938N29251O34728m4022O5880N34516N36613
3475.6D48330040J27220K87895K80991L50113R78584J104126L05100r16176o981Q75702
3485.2D51716614Q29429O23093j60103o32362J23901J322556K80685K05651R00306
3493.9D55209770K00196N95359K62719L54881Q81119O04248O14853Q86230L28255o82907
3503.6D59254723L0365J07040J13907N66711J686554J269531j044616J55296O26297
3512.2D62765808Q29239N81970j33705R91783J160660Q34465j73416n53093K79198
3520.9D66582909J368751J558228k31514j34011M31099N47524j7433J42212R29603
$$ plain form
3529.6 471177368 472329788 473321800 473443222 474158897 474613380 475866432 477123146 476018410 476336861
3538.3 476336861 476990776 477341080 477694054 478170891 478978424 480048370 481176071 480871658 481695938
3547 481695938 481980820 482266846 482941132 483829918 486086235 485662270 485686684 485774040 485800209 487449913
3556.6 487449913 487400017 488014641 489601631 490642357 490464554 491106758 491725464 491863441 496147957
3565.3 496147957 497394943 495598335 495810013 494266586 496165161 496988335 497234879 498377762 499895592
3574 499895592 501031189 501217842 502459145 502769814 503557625 504423637 504750175 505878944 507373466
3582.6 507373466 508404999 507218628 509648514 513115768 511623993 511703262 510092773 511806602 514252243
3591.3 514252243 515855904 516366692 516131363 519040146 517403374 517489891 520526047 520431290 522274323
$$ packed form
3529.6D71177368J152420R92012J21422P15675M54483J253052J256714j104736L18451
3538.3D76336861O53915L50304L52974M76837Q07533J069946J127701l04413Q24280
3547D81695938K84882K86026O74286Q88786K256317m23965K4414Q7356K6169J649704
3556.6D87449913m9896O14624J586990J040726j77803O42204O18706J37977M284516
3565.3D96147957J246986j796608K11678j543427J898575Q23174K46544J142883J517830
3574D99895592J135597J86653J241303L10669P87811Q66012L26538J128769J494522
3582.6E07373466J031533j186371K429886L467254j491775P9269j610489J713829K445641
3591.3E14252243J603661N10788k35329K908783j636772Q6517L036156r4757J843033
$$ plain form
3600 522274323 523392181 523455582 524662895 524917259 525261726 527514191 529812622 527937813 530920105
3608.7 530920105 531972122 528732605 533620796 536179886 533883247 537203865 535708504 536804314
3616.4 536804314 541394463 542209129 542824440 541477661 540793533 543038216 544752197 545770264 547245789
3625.1 547245789 548708191 549666100 555387573 560972137 551412888 551994972 554323616 558726044 560784416
3633.8 560784416 558121834 559015236 561494713 564117928 564314041 564854279 566892281 568421822 569046974
3642.4 569046974 568867264 570263290 572992630 579200935 581500397 577066650 582399750 584216919
3650.1 584216919 580925674 577365723 579800186 582261963 584621696 590854149 585857391 585025063
3657.9 585025063 588725090 589724884 590815773 590723991 592285767 593414688 594067383 594988785 595028419
$$ packed form
3600E22274323J117858O3401J207313K54364L44467K252465K298431j874809K982292
3608.7E30920105J052017l239517M888191K559090k296639L320618j495361J095810
3616.4E36804314M590149Q14666O15311j346779o84128K244683J713981J018067J475525
3625.1E47245789J462402R57909N721473N584564r559249N82084K328644M402428K058372
3633.8E60784416k662582Q93402K479477K623215J96113N40238K038002J529541O25152
3642.4E69046974j79710J396026K729340O208305K299462m433747N333100J817169
3650.1E84216919l291245l559951K434463K461777K359733O232453m996758q32328
3657.9E85025063L700027R99794J090889r1782J561776J128921O52695R21402L9634
$$ plain form
3666.5 595028419 598476524 601532059 601770897 603052177 597930527 597420921 602917633 612004814 617910767
3675.2 617910767 601354866 599015579 604426994 609571419 608424072 607054367 608340187 609763031
3682.9 609763031 610915909 610591125 610105667 613037834 620674591 616690445 609490967 616322594 612267952
3691.6 612267952 609457893 613450127 614266167 614809761 614472580 614366074 615342636 615096703 617206841
3700.3 617206841 621177406 618245087 614694405 617285347 618215103 618292656 618682632 620659714 625071526
3709 625071526 619470444 622696266 631790009 619076042 618551216 621797028 621659660 621315994 623450356
3717.7 623450356 625685997 622662621 622381172 628290558 627679100 621370621 624805527 627275200 627618828
3726.3 627618828 624236031 621960182 624761353 626013031 631416206 631085777 622947960 630516624
$$ packed form
3666.5E95028419L448105L055535K38838J281280n121650n09606N496712R087181N905953
3675.2F17910767j6555901k339287N411415N144425j147347j369705J285820J422844
3682.9F09763031J152878l24784m85458K932167P636757l984146p199478O831627m054642
3691.6F12267952k810059L992234Q16040N43594l37181j06506R76562k45933K110138
3700.3F17206841L970565k932319l550682K590942R29756P7553L89976J977082M411812
3709F25071526n601082L225822R093743j2713967n24826L245812j37368l43666K134362
3717.7F23450356K235641l023376k81449N909386o11458o308479L434906K469673L43628
3726.3F27618828l382797k275849K801171J251678N403175l30429q137817P568664
$$ plain form
3734 630516624 633949165 624261093 622765503 625285530 625863457 627389107 630057526 625795059 626817207
3742.7 626817207 638445015 636683502 616470985 623208199 628390999 635120468 636976509 624764748
3750.4 624764748 632662926 630165024 621382790 624990349 628519783 631674461 626782227 628044701
3758.2 628044701 635720215 630121918 625285454 627666588 628156776 628068047 632228355 631752968 626023407
3766.8 626023407 627366905 632927170 636188622 626741905 625751648 628703880 629245987 630005798 629422340
3775.5 629422340 629268456 629300117 632304764 634813347 626929893 627296486 629483948 629577904 631504097
3784.2 631504097 629656487 628941193 629708862 629427872 630262794 630254097 629771805 628955154 629352341 629637642
3793.8 629637642 630802193 634884338 632129364 627218895 627870369 630788689 637894211 637417374 626453285
$$ packed form
3734F30516624L432541r688072j495590K520027N77927J525650K668419m262467J022148
3742.7F26817207J1627808j761513k0212517O737214N182800O729469J856041j2211761
3750.4F24764748P898178k497902q782234L607559L529434L154678m892234J262474
3758.2F28044701P675514n598297m836464K381134M90188q8729M160308m75387n729561
3766.8F26023407J343498N560265L261452r446717r90257K952232N42107P59811n83458
3775.5F29422340j53884L1661L004647K508583p883454L66593K187462R3956J926193
3784.2F31504097j847610p15294P67669k80990Q34922q697m82292q16651L97187K85301
3793.8F29637642J164551M082145k754974m910469O51474K918320P105522m76837j0964089
$$ plain form
3802.5 626453285 626508560 627562485 630700264 636986923 631429672 625111275 627947502 629379501 629459496
3811.2 629459496 629550896 629434891 630331459 635618172 637559891 624214935 626633873 630925369 634480782
3819.9 634480782 638749580 624865952 623576355 627188225 628926430 631287804 632106667 627930069
3827.6 627930069 626878090 628702202 632732124 636470146 626953049 626044579 633329506 630184059
3835.3 630184059 627692642 635252953 630418320 623920822 631412163 627265930 625532379 632681122
3843 632681122 631860123 626836090 627891273 628654671 628421669 629679108 628599014 630444870 638475914
3851.7 638475914 636749802 639050484 626070633 619835930 627338028 627768173 625069351 625827332
3859.4 625827332 627772102 631725311 628336868 626120071 633878555 632706909 624358444 625438118
$$ packed form
3802.5F26453285N5275J053925L137779O286659n557251o318397K836227J431999P9995
3811.2F29459496R1400j16005Q96568N286713J941719j3344956K418938M291496L555413
3819.9F34480782M268798j3883628j289597L611870J738205K361374Q18863m176598
3827.6F27930069j051979J824112M029922L738022r517097r08470P284927l145447
3835.3F30184059k491417P560311m834633o497498P491341m146233j733551P148743
3843F32681122q20999n024033J055183P63398k33002J257439j080094J845856Q031044
3851.7F38475914j726112K300682j2979851o234703P502098M30145k698822P57981
3859.4F25827332J944770L953209l388443k216797P758484j171646q348465J079674
$$ plain form
3867.1 625438118 629690628 637985840 634962158 622797432 623381500 628628273 634750290 626139832
3874.8 626139832 624064178 626756477 626424217 628094177 633393555 630676003 620820618 624739914
3882.6 624739914 626736031 628543739 635530243 624985962 622751160 625498543 625850182 630120087
3890.3 630120087 631849670 623367310 623107109 626171112 624692307 625442772 626342087 628054085 631828690
3898.9 631828690 623885841 626588020 630269699 624072647 626906548 625924263 624100685 624387360 624018250
3907.6 624018250 625622711 626192665 626223183 625719566 625154724 624739380 624378395 626004791 628693123
3916.3 628693123 626683006 622200203 625043221 626207085 622173386 623480492 625051117 626340828
3924 626340828 625083694 621560974 622838821 624337959 626385345 625840607 624007034 626456642 624393082
$$ packed form
3867.1F25438118M252510Q295212l023682j2164726N84068N246773O122017q610458
3874.8F26139832k075654K692299l32260J669960N299378k717552r855385L919296
3882.6F24739914J996117J807708O986504j0544281k234802K747383L51639M269905
3890.3F30120087J729583q482360k60201L064003j478805P50465Q99315J711998L774605
3898.9F31828690p942849K702179L681679o197052K833901r82285j823578K86675l69110
3907.6F24018250J604461N69954L0518n03617n64842m15344l60985J626396K688332
3916.3F28693123k010117m482803K843018J163864m033699J307106J570625J289711
3924F26340828j257134l522720J277847J499138K047386n44738j833573K449608k063560
$$ plain form
3932.7 624393082 622034187 623685989 624164162 624253426 624597359 624409027 623373070 622425728 624123535
3941.4 624123535 626674500 623427200 621261749 621903114 622582626 624300842 622477951 622881126 624509392
3950.1 624509392 621541328 621599541 621797676 621425591 622201157 622264481 622646904 622585449 622491379 621941795
3959.7 621941795 622031670 622821007 621389618 620696259 621197128 621331711 622089005 622721291 622957535 622263069
3969.3 622263069 620565300 620859032 622083664 621996384 621974335 622670517 623041878 621787415 620731049
3978 620731049 621140518 621950645 622099228 621186943 620703468 620878143 620805931 620316696 620041237 620211449
3987.7 620211449 620766373 621264038 620213318 619580307 620520592 621104774 620363541 619175301 619444427
3996.3 619444427 620292244 620888977 620661583 620068703
$$ packed form
3932.7F24393082k358895J651802M78173Q9264L43933j88332j035957r47342J697807
3941.4F24123535K550965l247300k165451O41365O79512J718216j822891M03175J628266
3950.1F24509392k968064N8213J98135l72085P75566O3324L82423o1455r4070n49584
3959.7F21941795Q9875P89337j431389o93359N00869J34583P57294O32286K36244o94466
3969.3F22263069j697769K93732J224632q7280k2049O96182L71361j254463j056366
3978F20731049M09469Q10127J48583r12285m83475J74675p2212m89235k75459J70212
3987.7F20211449N54924M97665j050720o33011R40285N84182p41233j188240K69126
3996.3F19444427Q47817N96733k27394n92880
$$ plain form
4000.2 620068703
$$ packed form
4000.2F20068703
##END=$$ End of the data block
