##TITLE=$$ Begin of the data block
##JCAMP-DX=5.00 $$ ACD/SpecManager v 10.08
##SPECTROMETER/DATA SYSTEM=Varian
##DATE=18 Dec 2012 13:33:16
##DATA TYPE=INFRARED SPECTRUM
##DATA CLASS=XYDATA
##ORIGIN=
##OWNER=
##NPOINTS=3735
##FIRSTX=399.26403809
##LASTX=4000.35498047
##MAXX=4000.35498047
##MINX=399.26403809
##MAXY=75.44646454
##MINY=43.86426544
##XFACTOR=1.0000000000
##YFACTOR=0.000000100000000
##FIRSTY=63.25432205
##DELTAX=0.96440572
##XUNITS=1/CM
##YUNITS=TRANSMITTANCE
##XYDATA=(X++(Y..Y))
$$ plain form
399.3 632543221 651600952 665946426 666119232 658971710 650846481 658205032 671082535 670403748
407 670403748 660835190 655073700 654060974 654258728 653010101 647470245 644946976 646793518 645234680
415.7 645234680 643040543 637826958 622507019 633696518 644178238 642394257 646099548 649031830
423.4 649031830 648987503 647608109 639887810 643065109 651696014 655381622 655632706 651574173 645371475
432.1 645371475 643047562 646239700 646266479 644359741 647480240 651337433 651143341 646580658 644802780
440.7 644802780 644896393 646638718 648139038 647615814 646351929 642488327 641972427 641801605 642466965
449.4 642466965 644267120 643705750 642480545 639564590 643129578 647624512 649797363 652818451 649081879
458.1 649081879 645539169 644023972 644897385 646915207 643338928 639686775 639080315 638106613 634637871
$$ packed form
399.3F32543221J9057731J4345474J72806p147522q125229P358551J2877503o78787
407F70403748r568558n761490j012726J97754j248627n539856k523269J846542j558838
415.7F45234680k194137n213585j5319939J1189499J0481720j783981L705291K932282
423.4F49031830m4327j379394p720299L177299Q630905L685608K51084m058533o202698
432.1F45371475k323913L192138K6779j906738L120499L857193j94092m562683j777878
440.7F44802780R3613J742325J500320n23224j263885l863602n15900j70822O65360
449.4F42466965J800155n61370j225205k915955L564988M494934K172851L021088l736572
458.1F49081879l542710j515197Q73413K017822l576279l652153o06460r73702l468742
$$ plain form
466.8 634637871 630966492 631950989 636281319 638973999 643272934 645096130 641731567 640803223 637849197
475.5 637849197 636123543 635674438 637376137 639707794 641016312 641926193 637549820 635106468 638106041
484.1 638106041 644567566 647205124 643892822 643715439 645035858 646032181 644215088 640914459 641489029
492.8 641489029 641234665 638915634 638135033 641667480 644380188 645879822 646084137 644711990 644395142
501.5 644395142 639692574 636831932 638520851 641444702 641603775 640995026 644911270 644692078 642437744
510.2 642437744 640823517 637174034 637056961 639604988 640388718 637413483 633716240 635136185 637843132
518.9 637843132 639046478 638915977 637775497 635560150 634190788 635057602 634573097 634401016 636414146
527.5 636414146 636372566 636269531 635057106 633300056 634508209 635142288 633669586 631649094 632573280
$$ packed form
466.8F34637871l671379R84497M330330K692680M298935J823196l364563r28344k954026
475.5F37849197j725654m49105J701699K331657J308518R09881m376373k443352K999573
484.1F38106041O461525K637558l312302j77383J320419R96323j817093l300629N74570
492.8F41489029k54364k319031p80601L532447K712708J499634K04315j372147l16848
501.5F44395142m702568k860642J688919K923851J59073o08749L916244k19192k254334
510.2F42437744j614227l649483j17073K548027P83730k975235l697243J419945K706947
518.9F37843132J203346j30501j140480k215347j369362Q66814m84505j72081K013130
527.5F36414146m1580j03035j212425j757050J208153O34079j472702k020492R24186
$$ plain form
536.2 632573280 634157524 634592247 635859909 635669403 635438843 635186272 635555038 635211525 633373375
544.9 633373375 634813194 636481094 637150383 636910439 635467300 636017456 636661873 635887184 634839706
553.6 634839706 633678818 633313751 634548454 634856606 634279327 634521065 635884018 636161194 633742943
562.3 633742943 633744431 635036964 634350357 633566093 633507767 634132195 634822922 636158218 636652679 637007637
571.9 637007637 636397667 634704628 634152794 633481293 634773140 636000633 636455345 636976089 636525917
580.6 636525917 636038780 634230881 632802124 632259827 632746544 634038010 634890823 636106682 635932579
589.3 635932579 635273399 634719162 634147453 633901825 633283119 633925323 635638657 636550636 635777779 635410767
598.9 635410767 635331421 633850136 632377357 631527443 631433640 630203819 627499123 626526489 628286247
$$ packed form
536.2F32573280J584244M34723J267662j90506k30560k52571L68766l43513j838150
544.9F33373375J439819J667900O69289k39944j443139N50156O44417p74689j047478
553.6F34839706j160888l65067J234703L08152n77279K41738J362953K77176k418251
562.3F33742943J488J292533o86607p84264n8326O24428O90727J335296M94461L54958
571.9F37007637o09970j693039n51834o71501J291847J227493M54712N20744m50172
580.6F36525917m87137j807899j428757n42297M86717J291466Q52813J215859j74103
589.3F35932579o59180n54237n71709k45628o18706O42204J713334R11979p72857l67012
598.9F35410767p9346j481285j472779q49914r3803j229821k704696r72634J759758
$$ plain form
607.6 628286247 629345322 628952293 628622780 627982674 627056046 625112000 623464851 621884422 620579414
616.3 620579414 619867897 620195465 623622246 623958206 622181053 622651367 622441063 621970711 621601562
624.9 621601562 621608582 622947655 625265274 627605400 630278397 632717209 634701385 636408081 636429520
633.6 636429520 635980644 634079323 631724205 631235390 631222115 631706619 632733841 635340881 638544846
642.3 638544846 640473099 640683441 640448685 641057892 641233368 641418610 642346954 643666840 644448013
651 644448013 645149689 646497803 647253036 646472168 644552155 644536591 645135269 644548950 645054550 646318588
660.6 646318588 647451019 647144012 647379990 648605194 648667068 649665375 650229034 644138718 646466522
669.3 646466522 649780731 650817413 650383148 650400009 651668243 651468811 650213394 651297760 652102509
$$ packed form
607.6F28286247J059075l93029l29513o40106r26628j944046j647149j580429j305008
616.3F20579414p11517L27568L426781L35960j777153M70314k10304m70352l69149
624.9F21601562P020J339073K317619K340126K672997K438812J984176J706696K1439
633.6F36429520m48876j901321k355118m88815j3275M84504J027222K607040L203965
642.3F38544846J928253K10342k34756O09207J75476J85242R28344J319886P81173
651F44448013P01676J348114P55233p80868j920013j5564N98678n86319N05600J264038
660.6F46318588J132431l07007K35978J225204O1874R98307N63659o090316K327804
669.3F46466522L314209J036682m34265J6861J268234j99432j255417J084366Q04749
$$ plain form
678 652102509 652447968 653445663 653994293 654793167 654600830 653967514 653955078 654473190 654562378 653076553
687.6 653076553 651737900 651686783 651793213 650946579 651445160 652455902 651190491 649363022 648355637
696.3 648355637 648433380 648048401 647558899 648234940 649117355 649345856 649207458 650674896 651822433 650750198
705.9 650750198 649611282 648741837 648395996 649419479 650936508 652215347 653850250 655808792 656843033
714.6 656843033 656204681 655951920 656716156 656519928 656180725 656580124 657965851 659522400 660590515
723.3 660590515 661859283 662989502 663848877 663507233 662219391 660486526 658868103 659290543 660075531
732 660075531 660506287 662570114 664821014 664410706 664199295 665399017 665052032 664022446 662745590
740.7 662745590 662919693 664381638 664894028 666042557 668060989 669980011 670673294 670917664 670968399
$$ packed form
678F52102509L45459R97695N48630P98874j92337o33316j2436N18112Q9188j485825
687.6F53076553j338653n1117J06430q46634M98581J010742j265411j827469j007385
696.3F48355637P7743l84979m89502O76041Q82415K28501j38398J467438J147537j072235
705.9F50750198j138916q69445l45841J023483J517029J278839J634903J958542J034241
714.6F56843033o38352k52761P64236j96228l39203L99399J385727J556549J068115
723.3F60590515J268768J130219Q59375l41644j287842j732865j618423M22440P84988
732F60075531M30756K063827K250900m10308k11411J199722l46985j029586j276856
740.7F62745590J74103J461945N12390J148529K018432J919022O93283K44370N0735
$$ plain form
749.3 670968399 670937195 672355881 673428955 674348602 675857391 677249069 678270187 679715042 681314316
758 681314316 681387177 681362610 681127548 681921387 683029861 682625198 683153534 683669586 684348755 684475784
767.7 684475784 683745041 683830414 682740936 680890884 680791550 682350845 683110733 683914185 685471573
776.4 685471573 686284027 687697906 688756104 688367767 688441925 689851379 690922241 691655884 693465424
785 693465424 695307541 695675812 695055161 696483994 697724991 696702194 696536865 696565018 696625671 697271423
794.7 697271423 697685776 698800430 699904099 699984283 700217667 699926758 699408264 699210587 698090744
803.4 698090744 698959427 701441574 701805801 701296158 701725311 701789703 701613541 702321625 701875992 701652145
813 701652145 702570114 703076859 703723068 704530869 705387726 705462036 705931320 706410217 706031647 705607224
$$ packed form
749.3F70968399l1204J418686J073074R19647J508789J391678J021118J444855J599274
758F81314316P2861k4567k35062P93839J108474m04663N28336N16052O79169J27029
767.7F84475784p30743Q5373j089478j850052r9334J559295P59888Q03452J557388
776.4F85471573Q12454J413879J058198l88337P4158J409454J070862P33643J809540
785F93465424J842117L68271o20651J428833J240997j022797j65329K8153O0653O45752
794.7F97271423M14353J114654J103669Q0184K33384k90909n18494j97677j119843
803.4F98090744Q68683K482147L64227n09643M29153O4392j76162P08084m45633k23847
813G01652145R17969N06745O46209Q07801Q56857P4310M69284M78897l78570m24423
$$ plain form
822.6 705607224 704922409 705342789 705678635 705852356 706645813 706667709 705506058 704265213 702845688
831.3 702845688 699907379 698083725 696955795 695935516 695522461 694060364 692726440 691307373 690071335
840 690071335 688685837 686243591 684648361 683975143 683446808 683129730 683073196 682881165 682846832 683356476
849.6 683356476 683443375 683654633 684551468 685646286 687440414 688721542 689725266 692275543 693446960
858.3 693446960 693241730 694318924 695753708 697112503 697920914 698693619 699200592 699555130 700783997
867 700783997 702456589 703959503 704265594 705010376 705492401 705114670 704934387 704949265 705998611 706000748
876.7 706000748 705990982 706701965 707267990 707346497 706219788 705427170 703006363 700131073 698927536 697776108
886.3 697776108 697433929 698183594 698638611 698943863 699545288 699039536 697910538 696683121 696024094
$$ packed form
822.6G05607224o84815M20380L35846J73721P93457K1896j161651j240845j419525
831.3G02845688k938309j823654j127930j020279m13055j462097j333924j419067j236038
840F90071335j385498k442246j595230o73218n28335l17078n6534j92031l4333N09644
849.6F83356476Q6899K11258Q96835J094818J794128J281128J003724K550277J171417
858.3F93446960k05230J077194J434784J358795Q08411P72705N06973L54538J228867
867G00783997J672592J502914L06091P44782M82025l77731j80283J4878J049346K137
876.7G06000748r766P10983N66025P8507j126709p92618k420807k875290j203537j151428
886.3F97776108l42179P49665M55017L05252O01425n05752j128998j227417o59027
$$ plain form
895 696024094 696352463 696545181 697376633 698206329 698928070 699180679 699385147 700312576 699174500 697372131
904.6 697372131 696800308 695842438 694467087 694012299 693827820 693418579 692714386 691167603 689941254
913.3 689941254 688573380 687256546 685475693 682779541 681275330 680398407 680267868 680581284 679641037
922 679641037 678047028 676982422 676738586 675720062 673458099 671492767 670097809 669739075 670578461
930.7 670578461 671233673 671900482 672398376 672316513 672144089 671896515 672723236 673960419 675145187 677576752
940.3 677576752 680013809 681781311 683282471 684692993 686200409 686821976 686844101 687906494 689160080
949 689160080 689972916 690947876 690896301 691242828 691762390 691207581 691075287 690447006 689595795 688424072
958.6 688424072 686754303 685505219 684667740 684037018 682947617 681951218 680970459 679355316 676873474
$$ packed form
895F96024094L28369J92718Q31452Q29696P21741K52609K04468R27429j138076j802369
904.6F97372131n71823r57870j375351m54788j84479m09241p04193j546783j226349
913.3F89941254j367874j316834j780853k696152j504211q76923j30539L13416r40247
922F79641037j594009j064606k43836j018524k261963j965332j394958l58734Q39386
930.7F70578461O55212O66809M97894q1863j72424k47574Q26721J237183J184768K431565
940.3F77576752K437057J767502J501160J410522J507416O21567K2125J062393J253586
949F89160080Q12836R74960n1575L46527N19562n54809j32294o28281q51211j171723
958.6F88424072j669769j249084q37479o30722j089401r96399r80759j615143k481842
$$ plain form
967.3 676873474 675078506 674378738 673671646 673517838 673313828 673438416 673293304 672340622 671768036 670670090
976.9 670670090 668787003 667163849 666790466 666456375 665869751 665660400 665420074 665649643 664731827
985.6 664731827 662292633 659936218 658178940 657172318 656047440 654260025 652865067 652360687 651734238
994.3 651734238 650343323 648155289 646230774 645589523 645530701 644467850 642365417 641397858 641646194
1003 641646194 641466293 640790329 640089951 639019852 637843819 636825562 635151062 633856354 633322830
1011.7 633322830 632528648 631786194 631178856 630982704 630479965 628916740 627716675 626160583 623616295
1020.3 623616295 621846390 620908546 620331192 619714546 618584404 617332268 616912918 616938438 615928116
1029 615928116 614235611 611958122 610174370 609886360 609472351 608639450 608774376 609605255 609547195 609442101
$$ packed form
967.3F76873474j794968o99768p07092j53808k04010J24588j45112r52682n72586j097946
976.9F70670090j883087j623154l73383l34091n86624k09351k40326K29569r17816
985.6F64731827k439194k356415j757278j006622j124878j787415j394958n04380o26449
994.3F51734238j390915k188034j924515o41251n8822j062851k102433r67559K48336
1003F41646194j79901o75964p00378j070099j176033j018257j674500j294708n33524
1011.7F33322830p94182p42454o07338j96152n02739j563225j200065j556092k544288
1020.3F23616295j769905r37844n77354o16646j130142j252136m19350K5520j010322
1029F15928116j692505k277489j783752k88010m14009q32901J34926Q30879n8060j05094
$$ plain form
1038.7 609442101 609013329 608274117 608057785 607617874 607390099 607460213 607836609 607465706 607839432 609706268
1048.3 609706268 609774590 608352089 607381821 607910118 608341255 607554665 606644707 606612358 607073021 606706238
1058 606706238 607046852 607634201 607508698 606695366 605945129 605577583 604978714 605873070 606494522 606214523
1067.6 606214523 605845833 605792999 606244240 605684242 605522232 604861679 604124489 604570084 604653206 604690018
1077.2 604690018 604597969 604689178 605184135 605578346 605331345 604798965 604864426 605537529 605665359 605473099
1086.9 605473099 605868683 606157379 606593513 606569481 607140541 606780357 605119820 605082817 603980560 602842216
1096.5 602842216 602180977 601582565 601173401 599566536 599748535 599862671 598678932 597656631 596401367
1105.2 596401367 595652008 595666847 595397034 594274292 594407959 594179840 592862053 592061005 591507797
$$ packed form
1038.7F09442101m28772p39212k16332m39911k27775P0114L76396l70903L73726J866836
1048.3F09706268O8322j422501r70268N28297M31137p86590r09958l2349M60663l66783
1058F06706238L40614N87349j25503q13332p50237l67546n98869Q94356O21452k79999
1067.6F06214523l68690n2834M51241n59998j62010o60553p37190M45595Q3122L6812
1077.2F04690018r2049R1209M94957L94211k47001n32380O5461O73103J27830j92260
1086.9F05473099L95584K88696M36134k4032N71060l60184j660537l7003j102257j138344
1096.5F02842216o61239n98412m09164j606865J81999J14136j183739j022301j255264
1105.2E96401367p49359J4839k69813j122742J33667k28119j317787q01048n53208
$$ plain form
1113.9 591507797 591160889 591497955 592192841 591334076 591110840 591389771 591580505 592338867 592625122 593033829
1123.5 593033829 592696495 592310600 591355286 590632401 590458565 590575333 591874695 592318611 593370857
1132.2 593370857 593972511 594290047 594299850 594082031 595144043 594167480 593772163 594487495 594921837 594696884
1141.9 594696884 593981895 594262352 593179131 592370110 591809082 591099930 590684204 590366364 590519905
1150.5 590519905 589989052 590019875 589771805 589992294 590172119 590198059 590704460 590583229 591655464 592166405
1160.2 592166405 592945557 594234085 595578423 597578583 598566437 600106430 601672516 602668495 603881493
1168.9 603881493 605969200 608226166 610564232 613681412 615578003 617168694 619041901 620644226
1176.6 620644226 622263641 624013329 626001740 627920914 629826622 631230888 632666397 633937149
$$ packed form
1113.9E91507797l46908L37066O94886q58765k23236K78931J90734P58362K86255M08707
1123.5E93033829l37334l85895r55314p22885j73836J16768J299362M43916J052246
1132.2E93370857O01654L17536R803k17819J062012r76563l95317P15332M34342k24953
1141.9E94696884p14989K80457j083221q09021n61028p09152m15726l17840J53541
1150.5E90519905n30853L0823k48070K20489J79825K5940N06401j21231J072235N10941
1160.2E92166405P79152J288528J344338K000160R87854J539993J566086R95979J212998
1168.9F03881493K087707K256966K338066L117180J896591J590691J873207J602325
1176.6F20644226J619415J749688J988411J919174J905708J404266J435509J270752
$$ plain form
1184.3 633937149 634486847 635091286 635876350 636173248 636452446 637725105 638583069 639405899 640625153
1193 640625153 641558304 642507935 642704849 643193970 644059143 644275742 644161530 644232864 644731979 644757385
1202.6 644757385 645156097 645877609 645983582 646401520 646844940 646615372 646236267 646183167 646121521 646060257
1212.3 646060257 645840912 645614853 646095352 646533813 646213684 645631790 645029755 644472427 644551544 644294662
1221.9 644294662 643634262 643626022 643519058 643636856 643721848 643311234 642868729 642640762 642489700 641946793
1231.5 641946793 641825027 641785660 641494675 641723480 642181244 642265625 642286453 642683945 643051147 643087997
1241.2 643087997 642635193 642556763 642893524 642892151 642798843 642834244 642767181 642216721 642285233 642462769 642437744
1251.8 642437744 642607117 642207413 642250519 642388306 642346268 642372742 642508240 642608948 642148666 642154236
$$ packed form
1184.3F33937149N49698O04439P85064K96898K79198J272659Q57964Q22830J219254
1193F40625153R33151R49631J96914M89121Q65173K16599j14212P1334M99115K5406
1202.6F44757385L98712P21512J05973M17938M43420k29568l79105n3100o1646o1264
1212.3F46060257k19345k26059M80499M38461l20129n81894o02035n57328P9117k56882
1221.9F44294662o60400q240j06964J17798Q4992m10614m42505k27967j51062n42907
1231.5F41946793j21766l9367k90985K28805M57764Q4381K0828L97492L67202L6850
1241.2F43087997m52804p8430L36761j373r3308L5401o7063n50460O8512J77536k5025
1251.8F42437744J69373l99704M3106J37787m2038K6474J35498J00708m60282N570
$$ plain form
1261.4 642154236 642501526 643194122 643442001 643513794 644236679 644385910 644474182 644694443 645126419 645392075
1271.1 645392075 645446548 646071014 646753616 647207031 647546768 648695679 649672241 649578552 649579697 650147247
1280.7 650147247 650883560 651283569 651804276 652665100 653977509 655221405 656021729 656697845 657178726
1289.4 657178726 657858582 658540955 659011383 659542923 659868927 660066147 661241455 662982941 664065704
1298.1 664065704 665074387 665668259 665881424 666293259 666740875 667284470 667653809 668233032 668938599
1306.8 668938599 669516068 670183563 670597916 671170807 671788788 671797867 671603012 671674194 672077179 672623978
1316.4 672623978 673186111 673910980 674453659 674819489 675647202 676050568 676037598 676342926 676872711 677997894
1326 677997894 677998962 677214508 677791138 678556824 679072418 679142227 678856125 678540726 678740921 679513550
$$ packed form
1261.4F42154236L47290O92596K47879P1793P22885J49231Q8272K20261M31976K65656
1271.1F45392075N4473O24466O82602M53415L39737J148911R76562r3689J145N67550
1280.7F50147247P36313M00009N20707Q60824J312409J243896Q00324O76116M80881
1289.4F57178726O79856O82373M70428N31540L26004J97220J175308J741486J082763
1298.1F64065704J008683N93872K13165M11835M47616N43595L69339N79223P05567
1306.8F68938599N77469O67495M14353N72891O17981R079j94855P1182M02985N46799
1316.4F72623978N62133P24869N42679L65830Q27713M03366j2970L05328N29785J125183
1326F77997894J068p84454N76630P65686N15594O9809k86102l15399K00195P72629
$$ plain form
1335.7 679513550 679442444 679540405 679212418 678469315 678798599 678945084 679463272 679645157 679428253 679155655
1345.3 679155655 679022293 679230042 679144516 679271545 679014282 678763962 678962555 678733978 677982941 677237854
1355 677237854 677205048 677483521 677617416 677307587 677393112 677535706 677160568 676938782 675620956 675098953
1364.6 675098953 674793091 673998032 673753052 673369751 673066406 673068619 672662964 672464676 672481232 671536865
1374.3 671536865 670392075 669929581 669628448 669165802 669342270 669888687 669581146 669345322 669426575 669415817
1383.9 669415817 669491806 670172501 671231155 671199570 671820984 673012924 674075623 675140152 675532990
1392.6 675532990 675967255 675714111 674432068 674263153 674150467 673869247 672596359 672454224 673010330
1401.3 673010330 673018341 672962341 672965927 671958008 670716705 670494843 670106277 669679718 669092941 668515930
$$ packed form
1335.7F79513550p1106R7961l27987p43103L29284J46485N18188J81885k16904k72598
1345.3F79155655j33362K07749q5526J27029k57263k50320J98593k28577p51037p45087
1355F77237854l2806K78473J33895l09829Q5525J42594l75138k21786j317826n22003
1364.6F75098953l05862p95059k44980l83301l03345K213m05655j98288J6556r44367
1374.3F71536865j144790m62494l01133m62646J76468N46417l07541k35824Q1253j0758
1383.9F69415817P5989O80695J058654l1585O21414J191940J062699J064529L92838
1392.6F75532990M34265k53144j282043j68915j12686k81220j272888j42135N56106
1401.3F73010330Q011n6000L586j007919j241303k21862l88566m26559n86777n77011
$$ plain form
1410.9 668515930 668475571 668364792 668417282 668331985 668458786 668665543 667968903 667309265 665048370 665193939
1420.6 665193939 666270981 666539764 666717911 666266327 666102829 666810532 667186813 667132263 666801834 665792160
1430.2 665792160 665479431 666333008 666817169 666428070 666945953 667873306 665945969 665832672 667232208
1438.9 667232208 667567902 667713470 668295517 668730621 669532318 669821701 669863586 670427399 670409088 669454041
1448.5 669454041 669576645 670224609 670450592 670655212 671148300 672002411 673133850 673669968 671901398
1457.2 671901398 671609573 673529587 674460602 675604477 676185379 676924896 679155502 679456787 678602524
1465.9 678602524 679770355 680961151 681521225 681959305 683515625 684968109 684996719 686108627 688466568
1474.6 688466568 691095123 692005005 692171478 693586655 694692612 695702591 696186371 696283798 696806717
$$ packed form
1410.9F68515930m0359j10779N2490q5297J26801K06757o96640o59638k260895J45569
1420.6F65193939J077042K68783J78147m51584j63498P07703L76281n4550l30429j009674
1430.2F65792160l12729Q53577M84161l89099N17883R27353j927337j13297J399536
1438.9F67232208L35694J45568N82047M35104Q01697K89383M1885N63813j8311r55047
1448.5F69454041J22604O47964K25983K04620M93088Q54111J131439N36118j768570
1457.2F71901398k91825J920014R31015J143875N80902P39517K230606L01285q54263
1465.9F78602524J167831J190796N60074M38080J556320J452484K8610J111908K357941
1474.6F88466568K628555R09882J66473J415177J105957J009979M83780R7427N22919
$$ plain form
1483.2 696806717 697478561 698292160 699804764 700896530 700280609 700941925 699257050 697241592 697971802
1491.9 697971802 698453598 698534012 698503113 698991699 695710144 696468048 697071609 694328461 694297791 693629456
1501.6 693629456 692584076 691834717 692667236 694176712 688815231 684935608 685482330 685422363 683748474
1510.2 683748474 684299622 683233185 680626297 680448990 679488068 679029846 677956085 675423050 676293793
1518.9 676293793 678756409 678193970 673795929 672857590 672197876 672975693 670412750 669523544 670136719
1527.6 670136719 669095459 668487854 668264008 668446884 668191528 667451935 663659515 663767395 664383698
1536.3 664383698 664842300 667805786 668857727 661591187 662096710 663017654 661827698 662126846 663238068
1545 663238068 661271820 661750641 661923523 662486954 663267059 661949387 662504120 663447418 664766693
$$ packed form
1483.2F96806717O71844Q13599J512604J091766o15921O61316j684875k015458P30210
1491.9F97971802M81796Q0414l0899M88586l281555P57904O03561k743148l0670o68335
1501.6F93629456j045380p49359Q32519J509476n361481l879623N46722n9967j673889
1510.2F83748474N51148j066437k606888j77307r60922m58222j073761k533035Q70743
1518.9F76293793K462616n62439m398041r38339o59714P77817k562943q89206O13175
1527.6F70136719j041260o07605k23846J82876k55356p39593l792420J07880O16303
1536.3F64383698M58602K963486J051941p266540N05523R20944j189956K99148J111222
1545F63238068j966248M78821J72882N63431P80105j317672N54733R43298J319275
$$ plain form
1553.6 664766693 663464584 663535690 666058121 668175964 662636871 650599823 662281418 665581207
1561.4 665581207 667080688 668078613 669114532 669349365 668953018 669915390 671050262 672540817 670041351
1570 670041351 669563599 670654144 670723801 670869064 671489792 672021332 666932297 667957382 668948212 669030609
1579.7 669030609 669345856 668085022 667322464 666455154 665606537 664763107 663902435 662969742 661858597
1588.4 661858597 661753159 660589981 659728088 658228760 657047882 656065292 653765564 652443314 650739059
1597 650739059 649845200 648548584 647611160 646247864 644528580 643389053 640726242 638898544 636618271
1605.7 636618271 635246811 633135796 631428032 630375633 627925186 627236214 625195045 623652344
1613.4 623652344 621891861 621488686 621921921 614139557 613087120 611520500 610566902 608552895 607928963
$$ packed form
1553.6F64766693j302109P1106K522431K117843n539093j2037048J1681595L299789
1561.4F65581207J499481R97925J035919K34833l96347R62372J134872J490555k499466
1570F70041351m77752J090545O9657J45263O20728N31540n089035J025085R90830Q2397
1579.7F69030609L15247j260834p62558q67310q48617q43430q60672r32693j111145
1588.4F61858597j05438j163178q61893j499328j180878r82590k299728j322250j704255
1597F50739059q93859j296616r37424j363296j719284j139527k662811j827698k280273
1605.7F36618271j371460k111015j707764j052399k450447o88972k041169j542701
1613.4F23652344j760483m03175M33235p782364j052437j566620r53598k014007o23932
$$ plain form
1622.1 607928963 607428780 602879181 601902657 600361023 600490074 598151855 595626755 594545517 593175888
1630.8 593175888 592525826 591359634 592112770 592193451 589276314 586522408 587412148 587070007 586515083
1639.5 586515083 587132607 586023941 586692581 586411629 587290192 588817558 586719093 587186623 586666718
1648.1 586666718 588229904 588827286 590970039 593323479 590417175 588588219 589996490 592663574
1655.9 592663574 593711395 595420189 596196365 597191811 598038750 598800468 600860748 600221825 601819038
1664.5 601819038 602967987 604087486 605526695 607705727 608908310 608315468 611348267 611133194 612538338
1673.2 612538338 615335426 617311134 616899147 618396721 621101456 622320671 624774246 625149078 626934357
1681.9 626934357 631127701 630655594 629791908 631697311 635200500 637621346 639188423 641368103 642595978
$$ packed form
1622.1F07928963n00183m549599r76524j541634J29051k338219k525100j081238j369629
1630.8E93175888o50062j166192P53136Q0681k917137k753906Q89740l42141n54924
1639.5E86515083O17524j108666O68640k80952Q78563J527366k098465M67530n19905
1648.1E86666718J563186N97382K142753K353440k906304j828956J408271K667084
1655.9E92663574J047821J708794P76176R95446Q46939P61718K060280o38923J597213
1664.5F01819038J148949J119499J439209K179032J202583n92842L032799k15073J405144
1673.2F12538338K797088J975708m11987J497574K704735J219215K453575L74832J785279
1681.9F26934357M193344m72107q63686J905403L503189K420846J567077K179680J227875
$$ plain form
1690.6 642595978 644216080 645984955 648423843 650865936 652497101 651381836 655040817 659661942
1698.3 659661942 664531097 668032532 661755447 666303177 669359055 671518097 673672562 675513382
1706 675513382 677011719 678794403 681715927 683704071 684862137 686199265 687551041 689248734 689961090
1714.7 689961090 690926666 693071747 695127487 691265030 691659698 693124390 692907715 692930222 692694397
1723.4 692694397 692126007 692745361 693681946 694221649 694626694 696680603 697815018 697131805 699153595
1732 699153595 701912842 701110153 696336517 698547897 701084442 702580414 704233322 704300156 702802887
1740.7 702802887 705025482 707570877 707800598 707612991 709411774 711150208 712354355 713765182 714404831
1749.4 714404831 717068710 718435211 717961960 720869675 722867279 724041748 726135941 726454544 726540451
$$ packed form
1690.6F42595978J620102J768875K438888K442093J631165j115265L658981M621125
1698.3F59661942M869155L501435o277085M547730L055878K159042K154465J840820
1706F75513382J498337J782684K921524J988144J158066J337128J351776J697693P12356
1714.7F89961090R65576K145081K055740l862457L94668J464692k16675K2507k35825
1723.4F92694397n68390O19354R36585N39703M05045K053909J134415o83213K021790
1732F99153595K759247q02689m773636K211380K536545J495972J652908O6834j497269
1740.7G02802887K222595K545395K29721j87607J798783J738434J204147J410827O39649
1749.4G14404831K663879J366501m73251K907715J997604J174469K094193L18603Q5907
$$ plain form
1758.1 726540451 727867966 729618530 732394333 732452087 731307983 732770309 733618622 734262085 735198517
1766.8 735198517 736181259 734685287 735285645 738078079 739125900 738006516 736132050 738021545 739457703
1775.4 739457703 738418198 739358063 740099869 740775070 741146774 740449829 740597382 741401825 742727509
1784.1 742727509 742733307 742221909 742617493 743132935 743482590 743824234 743788376 744077988 743020172 742212296
1793.8 742212296 744678574 746018066 744994583 745006638 746066818 746541214 745310822 746006165 746222916
1802.4 746222916 746099396 746999588 747027740 747191086 747525482 747384567 747759781 748526077 747777634 747466049
1812.1 747466049 748062057 748286743 748665771 748753128 749428253 749479752 749284286 749799576 749553909 749622803
1821.7 749622803 749256516 749708862 750936813 749158936 748508377 749826889 751739807 752598495 749319534
$$ packed form
1758.1G26540451J327515J750564K775803N7754j144104J462326Q48313O43463R36432
1766.8G35198517R82742j495972O00358K792434J047821j119384j874466J889495J436158
1775.4G39457703j039505R39865P41806O75201L71704o96945J47553Q04443J325684
1784.1G42727509N798n11398L95584N15442L49655L41644l5858K89612j057816q07876
1793.8G42212296K466278J339492j023483J2055J060180M74396j230392O95343K16751
1802.4G46222916j23520R00192K8152J63346L34396j40915L75214P66296p48443l11585
1812.1G47466049N96008K24686L79028Q7357O75125N1499j95466N15290k45667O8894
1821.7G49622803l66287M52346J227951j777877o50559J318512J912918Q58688l278961
$$ plain form
1830.4 749319534 749187088 750335770 750312042 750435410 750708084 751069260 751202240 751155167 751636658 751709976
1840.1 751709976 752067719 751955032 752463989 753573990 750325012 750430603 751788635 751863632 751306458
1848.7 751306458 751417847 751930771 751983490 752103577 752010574 752336655 752466431 752082520 752092896 752261200
1858.4 752261200 752551422 752443390 752359543 752205124 752507706 752832336 752882690 753269424 753128738 753937836
1868 753937836 753708191 752069702 752380295 752886505 753147812 753225098 753352890 753214111 753302841 753461227
1877.7 753461227 753655472 753730469 753266907 753263474 752955093 753053894 753137741 752911987 753200684 753034973
1887.3 753034973 753805618 754464645 753182068 752898331 753292999 753242111 753432236 753365936 752406616 752867966
1896.9 752867966 753559036 753482208 753289948 753128738 753219910 752999496 753001633 752935638 752757339 752809296 752678299
$$ packed form
1830.4G49319534j32446J148682k3728J23368K72674L61176J32980m7073M81491P3318
1840.1G51709976L57743j12687N08957J110001l248978J05591J358032P4997n57174
1848.7G51306458J11389N12924N2719J20087r3003L26081J29776l83911J0376J68304
1858.4G52261200K90222j08032q3847j54419L02582L24630N0354L86734j40686Q09098
1868G53937836k29645j638489L10593N06210K61307P7286J27792j38779Q8730J58386
1877.7G53461227J94245P4997m63562l433l08381R8801Q3847k25754K88697j65711
1887.3G53034973P70645O59027j282577k83737L94668n0888J90125o6300r59320M61350
1896.9G52867966O91070p6828j92260j61210R1172k20414K137o5995j78299N1957j30997
$$ plain form
1907.6 752678299 752746582 753175049 753206329 752901688 753330994 753232880 752690048 752336884 752402878 753286209
1917.2 753286209 752443848 751554489 751912689 752450867 753359070 752916489 752098007 752383728 752488403 752187271
1926.8 752187271 752093201 751851883 751848450 752085266 751959534 752101669 751997833 751888657 751801834 751742172
1936.5 751742172 751776810 751497269 751222610 750713577 751553116 752332001 750907211 750860062 751135941 750964584
1946.1 750964584 751081772 751303864 751191254 751052856 750902100 750463715 750549164 750925598 751112518 750729752
1955.8 750729752 750460205 750613022 750516052 750499649 750391388 750316925 750161362 750142059 750144577 749700394 749791183
1966.4 749791183 749744339 749308319 749469528 749666367 749564285 749638901 749817429 749641876 749348068 748752823
1976 748752823 748326721 748632431 748916855 749142838 749237366 748854904 748661575 749065552 749246445 748575363
$$ packed form
1907.6G52678299O8283M28467L1280l04641M29306r8114n42832l53164O5994Q83331
1917.2G53286209q42361q89359L58200N38178R08203m42581q18482K85721J04675l01132
1926.8G52187271r4070k41318l433K36816j25732J42135j03836j09176q6823n9662
1936.5G51742172L4638k79541k74659n09033Q39539P78885j424790m7149K75879j71357
1946.1G50964584J17188K22092j12610j38398j50756m38385Q5449L76434J86920l82766
1955.8G50729752k69547J52817r6970j6403j08261p4463j55563j9303K518m44183R0789
1966.4G49791183m6844m36020J61209J96839j02082P4616J78528j75553k93808n95245
1976G48752823m26102L05710K84424K25983R4528l82462j93329M03977J80893o71082
$$ plain form
1985.7 748575363 747975159 748083344 747790146 747159119 747446747 747881317 747462997 747358551 747614746 747237320
1995.3 747237320 746628494 746390152 746601105 746697540 746237488 746010437 746212921 746456985 746588516 746813278
2005 746813278 746780396 746084900 745601425 745356522 745059509 744973221 744912338 744745178 744696426 744910202 745378036
2015.6 745378036 745472488 744705963 744443817 744503098 744164124 743766708 743481903 743538742 743504486 743487549
2025.2 743487549 743402481 743241730 743132553 742995300 743171768 742886658 742603149 742584076 742379074 742332230
2034.9 742332230 742126541 742105255 742405701 742399521 741942596 741763153 741550598 741288071 741506958 741337128
2044.5 741337128 741110992 740863342 740831070 740760498 740424805 740943298 740974960 740417480 740291824 740520096
2054.1 740520096 740691833 740474777 740225143 739726639 739499817 739569168 739594269 739433823 739214859 739502335
$$ packed form
1985.7G48575363o00204J08185k93198o31027K87628M34570m18320j04446K56195l77426
1995.3G47237320o08826k38342K10953R6435m60052k27051K02484K44064J31531K24762
2005G46813278l2882o95496m83475k44903k97013q6288o0883j67160m8752K13776M67834
2015.6G45378036R4452p66525k62146N9281l38974l97416k84805N6839l4256j6937
2025.2G43487549q5068j60751j09177j37253J76468k85110k83509j9073k05002m6844
2034.9G42332230k05689k1286L00446o180m56925j79443k12555k62527K18887j69830
2044.5G41337128k26136k47650l2272p0572l35693N18493L1662n57480j25656K28272
2054.1G40520096J71737k17056k49634m98504k26822O9351K5101j60446k18964K87476
$$ plain form
2063.8 739502335 739761276 739741898 739432526 739162369 738919754 738579788 738195572 737974854 738429413 738601685
2073.4 738601685 738511734 738387680 738342819 738247375 737556915 737455978 737472305 737310562 737409515 737156143
2083.1 737156143 736888885 737148437 737638168 737591934 737317352 737288513 737303543 736920166 736609344 736524582
2092.7 736524582 736199265 736373672 736592255 736621246 736581650 736656036 737020569 736568146 736109467 736161041
2102.4 736161041 736099930 735742950 735567551 736042709 736320343 736427460 736390381 736150513 736114044 736121063
2112 736121063 735821152 735523148 735542984 735488968 735527954 735342102 735419464 735961075 736084824 736273956 736269226
2122.6 736269226 736082993 735861053 735521851 735405273 735190811 735009995 734919052 734900208 735102310 735413818
2132.3 735413818 735234604 734806976 735032120 735249557 735238647 735175705 734977875 734852753 734727402 734848175
$$ packed form
2063.8G39502335K58941j9378l09372k70157k42615l39966l84216k20718M54559J72272
2073.4G38601685q9951j24054m4861r5444o90460j00937J6327j61743R8953k53372
2083.1G37156143k67258K59552M89731m6234k74582k8839J5030l83377l10822q4762
2092.7G36524582l25317J74407K18583K8991l9596P4386L64533m52423m58679N1574
2102.4G36161041o1111l56980j75399M75158K77634J07117l7079k39868l6469P019
2112G36121063k99911k98004J9836n4016L8986j85852P7362N41611J23749J89132m730
2122.6G36269226j86233k21940l39202j16578k14462j80816r0943j8844K02102L11508
2132.3G35413818j79214m27628K25144K17437j0910o2942j97830j25122j25351J20773
$$ plain form
2141.9 734848175 735003815 734812012 734674759 734798508 734737625 734341660 734081421 734253006 734787292 735120010
2151.5 735120010 734890289 734577255 734419937 734529037 734774628 734785309 734876862 734901886 734807358 734671478
2161.2 734671478 734369049 734327469 734311295 734361420 734525604 734734955 734896164 734818878 734923553 734744034
2170.8 734744034 734777679 735085754 734784470 734459915 734286423 734080505 733762817 734001312 734549026 734811935
2180.5 734811935 734964523 734686203 734387512 734021683 734114914 734397583 734015579 733911057 734123459 734557571
2190.1 734557571 734793549 734803467 735078964 735159073 734916840 734548950 734301834 734113312 734112701 734157944 734145355
2200.7 734145355 734335175 734779129 735025940 734794922 734770050 734352951 733845520 733934555 733997650 734043732
2210.4 734043732 733993683 734252777 734405975 734294662 734434128 734388580 734240875 734415283 734702988 734178848
$$ packed form
2141.9G34848175J55640j91803j37253J23749o0883l95965k60239J71585N34286L32718
2151.5G35120010k29721l13034j57318J09100K45591J0681R1553K5024r4528j35880
2161.2G34671478l02429m1580j6174N0125J64184K09351J61209p7286J04675j79519
2170.8G34744034L3645L08075l01284l24555j73492k05918l17688K38495N47714K62909
2180.5G34811935J52588k78320k98691l65829R3231K82669l82004j04522K12402M34112
2190.1G34557571K35978R918K75497Q0109k42233l67890k47116j88522o11M5243j2589
2200.7G34145355J89820M43954K46811k31018k4872m17099n07431Q9035O3095M6082
2210.4G34043732n0049K59094J53198j11313J39466m5548j47705J74408K87705n24140
$$ plain form
2220 734178848 733513489 733316574 733314743 733472061 733567429 734078140 734294662 734130020 734135056 733927917 733644791
2230.6 733644791 733315811 733235779 733198090 733193207 733487854 733536453 733395844 733537216 733697433 733646317 733680267
2241.2 733680267 733611679 733447647 733050613 732417984 732054520 732129135 732511139 732799301 732924728 732837524
2250.9 732837524 733121490 733351364 733011856 732708054 732250214 732325058 732459488 732309418 732334137 732423477
2260.5 732423477 732711945 732459106 732399139 732550354 732423248 732251587 731989746 732194443 731940384 731565781
2270.2 731565781 731753235 731846542 731910858 732060089 732191620 731936264 731646423 731493835 731405182 731416931
2279.8 731416931 731566086 731668930 731584549 731762009 731916046 732081833 732136078 732065811 731751099 731227264
2289.4 731227264 731259537 731046143 730954895 731042633 730965042 731185837 731420441 731745377 731589661 731264801
$$ packed form
2220G34178848o65359j96915j831J57318R5368N10711K16522j64642N036k07139k83126
2230.6G33644791l28980q0032l7689m883K94647M8599j40609J41372J60217n1116L3950
2241.2G33680267o8588j64032l97034o32629l63464P4615L82004K88162J25427q7204
2250.9G32837524K83966K29874l39508l03802m57840P4844J34430j50070K4719Q9340
2260.5G32423477K88468k52839n9967J51215j27106j71661k61841K04697k54059l74603
2270.2G31565781J87454R3307O4316J49231J31531k55356k89841j52588q8653J1749
2279.8G31416931J49155J02844q4381J77460J54037J65787N4245p0267l14712n23835
2289.4G31227264L2273k13394r1248Q7738p7591K20795K34604L24936j55716l24860
$$ plain form
2299.1 731264801 730974579 730708389 730680008 730493622 730711594 730891418 730667648 730493317 730758209 730951767
2308.7 730951767 730994339 730969696 730447845 730793076 730512161 729479599 729626083 730114899 730525131 730762177
2318.4 730762177 731658173 731646881 730861130 730827179 730117874 729813614 729463501 729417877 729765778 729306641
2328 729306641 729514694 730481796 731042786 730209808 729312820 728932571 728923569 729506073 729233475 729181900
2337.7 729181900 729871674 729678040 729113998 729404602 729428024 729577484 730390091 729857178 729628296 729651947
2347.3 729651947 729520111 730823898 731673279 731396255 731447220 730792542 730692062 730178604 728827820
2356 728827820 729229202 729947891 730931702 730937271 729401627 727746124 727151489 728425064 728840637 728997345
2365.6 728997345 729979019 730753860 731303329 731027451 729843826 729087219 729327240 729362488 729623337 730008774
$$ packed form
2299.1G31264801k90222k66190k8381j86386K17972J79824k23770j74331K64892J93558
2308.7G30951767M2572k4643n21851L45231k80915j032562J46484M88816M10232K37046
2318.4G30762177Q95996j1292p85751l3951p09305l04260l50113m5624L47901m59137
2328G29306641K08053R67102N60990q32978q96988l80249r002N82504k72598n1575
2337.7G29181900O89774j93634n64042K90604K3422J49460Q12607n32913k28882K3651
2347.3G29651947j31836J303787Q49381k77024N0965o54678j00480n13458j350784
2356G28827820M01382P18689R83811N569j535644j655503n94635J273575M15573J56708
2365.6G28997345R81674P74841N49469k75878j183625p56607K40021L5248K60849L85437
$$ plain form
2375.3 730008774 730180664 730533218 730557785 730918121 731106644 730784531 731071930 731326065 730953751 730631332
2384.9 730631332 730737610 731271591 731902542 731954727 731619644 731383514 731524353 731699371 731121063 730744324
2394.6 730744324 730956573 730985565 730862885 730696335 730586777 730600662 730679092 730724258 730835495 730813446
2404.2 730813446 730520325 730211945 730142136 730372543 730436172 730307465 730207748 730464401 730343475 729745865
2413.8 729745865 730118637 730231857 729650574 729535980 729571533 729708786 730020523 730230713 729997864 729845963
2423.5 729845963 729990387 730004654 729974060 729866562 729873962 729593735 729049377 729031677 729080353 728918304 728956757
2434.1 728956757 728877869 728521652 728415451 728624954 728864975 728927307 728754807 728472137 728429947 728435059
2443.7 728435059 727982254 727856445 728150406 728052139 727846069 727894745 728113251 728232193 727957382 727458496
$$ packed form
2375.3G30008774J71890L52554K4567L60336J88523l22113K87399K54135l72314l22419
2384.9G30631332J06278N33981O30951N2185l35083k36130J40839J75018n78308l76739
2394.6G30744324K12249K8992j22680j66550j09558J3885P8430M5166J11237k2049
2404.2G30813446k93121l08380o9809K30407O3629j28707r9717K56653j20926n97610
2413.8G29745865L72772J13220n81283j14594L5553J37253L11737K10190k32849j51901
2423.5G29845963J44424J4267l0594j07498P400k80227n44358j7700M8676j62049L8453
2434.1G28956757p8888l56217j06201K09503K40021O2332j72500k82670m2190N112
2443.7G28435059m52805j25809K93961r8267k06070M8676K18506J18942k74811m98886
$$ plain form
2453.4 727458496 727243805 727412796 727496185 727143326 727021255 727513123 727758484 727489929 727213821 727088242
2463 727088242 726768188 726546021 726530075 726453629 726623154 726538773 726216431 726141205 726223068 726371384 726370850
2473.6 726370850 725927887 725290070 725495605 725674591 725212097 725001526 724795227 724746094 724997635 725322723
2483.3 725322723 725468292 725435410 725253296 724701996 724301910 724225845 724095154 723779526 723867493 724043655
2492.9 724043655 723948898 724007797 724015121 724138794 723875732 723482056 723345871 723222656 723340988 723189697
2502.6 723189697 723198166 723198471 723020172 723058853 723091736 723177185 722871552 722402954 722027054 722034912 722167053
2513.2 722167053 722199936 722359009 721975632 721904678 721975021 721799698 721683884 721278992 721308823 721251831
2522.8 721251831 721100540 721400223 721679001 721846466 721661606 721400146 721369400 721307297 720984955 720619431
$$ packed form
2453.4G27458496k14691J68991Q3389l52859j22071M91868K45361k68555k76108j25579
2463G27088242l20054k22167j5946p6446J69525q4381l22342p5226Q1863J48316n34
2473.6G26370850m42963o37817K05535J78986m62494k10571k06299m9133K51541L25088
2483.3G25322723J45569l2882j82114n51300m00086p6065j30691l15628Q7967J76162
2492.9G24043655r4757N8899P324J23673k63062l93676j36185j23215J18332j51291
2502.6G23189697Q469L05j78299L8681L2883Q5449l05633m68598l75900P858J32141
2513.2G22167053L2883J59073l83377p0954P0343j75323j15814m04892K9831n6992
2522.8G21251831j51291K99683K78778J67465j84860k61460l0746o2103l22342l65524
$$ plain form
2532.5 720619431 720465012 720710983 721067886 721071243 720890121 720467224 720297928 720195007 719918900 720122528
2542.1 720122528 720162811 719910355 719821625 719856491 720040817 720232010 720097198 719543839 719035645 718848648
2551.7 718848648 718795242 718675079 718854752 719182205 719018631 718785400 718718796 718562775 718606262 718698273
2561.4 718698273 718196487 717836609 718123398 718268738 718159485 717935867 717727890 717842178 718137360 718136215
2571 718136215 717924957 717634048 717209091 717000809 716982574 717159348 717158966 716949539 716894989 716682510 716831665
2581.6 716831665 717052155 716596909 715993729 715832748 716045303 715844421 715311279 714854584 714755554 715312729
2591.3 715312729 715808792 715732880 715231476 714932098 714843216 714337769 714128876 714300613 714142609 713981552
2600.9 713981552 714095840 714288330 713895035 713420715 713558731 713129501 712431870 712551727 712907028 712949448
$$ packed form
2532.5G20619431j54419K45971L56903L357j81122m22897j69296j02921k76107K03628
2542.1G20122528M0283k52456q8730L4866J84326J91193j34812n53359n08194j86997
2551.7G18848648n3406j20163J79673L27453j63574k33231o6604j56021M3487R2011
2561.4G18698273n01786l59878K86789J45340j09253k23618k07977J14288K95182j145
2571G18136215k11258k90909m24957k08282j8235J76774l82k09427n4550k12479J49155
2581.6G16831665K20490m55246o03180j60981K12555k00882n33142m56695r9030N57175
2591.3G15312729M96063p5912n01404k99378q8882n05447k08893J71737j58004j61057
2600.9G13981552J14288J92490l93295m74320J38016m29230o97631J19857L55301M2420
$$ plain form
2610.6 712949448 712822800 712536621 712310257 712500076 712207184 711585922 711649170 711824341 711594620 711072540
2620.2 711072540 710807724 710869827 710863266 710800629 710599976 710091095 709617615 709809570 710019760 709675751
2629.9 709675751 709261169 709086609 708977509 708792191 708836975 708735962 708333740 707979965 707746201 707782288
2639.5 707782288 707963104 707890625 707625351 707327728 706458588 706034317 706361465 706233749 706172562 706006012
2649.1 706006012 705823364 705793228 705341797 705073929 705180511 705209122 705146790 705442657 705155869 704198151
2658.8 704198151 704025116 704279861 704297562 703941956 703762817 703774490 703689575 703730469 703560944 703504791
2668.4 703504791 703168793 702518311 702355347 702247086 702243195 702525940 702578506 702229691 701744766 701249084
2678.1 701249084 701075974 701182632 700974579 700570831 700268860 700358505 700679855 700568924 700097733 699885025
$$ packed form
2610.6G12949448j26648k86179k26364J89819k92892o21262O3248J75171k29721n22080
2620.2G11072540k64816O2103o561o2637k00653n08881m73480J91955K10190l44009
2629.9G09675751m14582j74560j09100j85318M4784j01013m02222l53775k33764L6087
2639.5G07782288J80816p2479k65274k97623q69140m24271L27148j27716o1187j66550
2649.1G06006012j82648l0136m51431k67868J06582K8611o2332K95867k86788r57718
2658.8G04198151j73035K54745J7701l55606j79139J1673q4915M0894j69525n6153
2668.4G03504791l35998o50482j62964j08261l891K82745N2566l48815m84925m95682
2678.1G01249084j73110J06658k08053m03748l01971Q9645L21350j10931m71191k12708
$$ plain form
2687.7 699885025 699947662 699782333 699478302 699209595 699013672 699088898 699040756 698649368 698485489 698317032
2697.4 698317032 698036423 698031845 697816010 697596359 697395477 697010117 696966095 697193146 697506332 697277985
2707 697277985 696616516 696626892 696898117 696399994 695578537 695178986 695134201 695370026 695366058 695096817 694920807
2717.6 694920807 694958572 695039749 694575577 694216309 693949051 693525620 693316422 693294678 693412476 693058395
2727.3 693058395 692924271 692976379 692666473 692565765 692199783 691995773 691967163 691707764 691572342 691183472
2736.9 691183472 690922852 691128693 691292953 691183472 690971985 690666733 690347214 690243301 689930267 689637756
2746.5 689637756 689866257 689973984 689716492 689573593 689473724 688992081 688526535 688703537 688660965 687921829
2756.2 687921829 687425766 687489853 687761154 687631378 687434998 687545319 687364120 686980515 686518860 686206436
$$ packed form
2687.7F99885025O2637j65329l04031k68707j95923P5226m8142l91388j63879j68457
2697.4F98317032k80609m578k15835k19651k00882l85360m4022K27051L13186k28347
2707F97277985o61469J0376K71225m98123q21457l99551m4785K35825l968k69241j76010
2717.6F94920807L7765Q1177m64172l59268k67258m23431k09198k1744J17798l54081
2727.3F93058395j34124N2108l09906j00708l65982k04010k8610k59399j35422l88870
2736.9F91183472k60620K05841J64260j09481k11487l05252l19519j03913l13034k92511
2746.5F89637756K28501J07727k57492j42899r9869m81643m65546J77002m2572p39136
2756.2F87921829m96063O4087K71301j29776j96380J10321j81199l83605m61655l12424
$$ plain form
2765.8 686206436 685934830 685533447 685478668 685599823 685667953 685644302 685389938 684809113 684624557 684679337
2775.5 684679337 684026947 683418961 683199081 683076019 682744370 682674637 682963028 682554321 682008209 681620865
2785.1 681620865 681606522 681631012 681153030 680968018 680482788 680004730 679984970 679754562 679503250 679268875
2794.8 679268875 679195480 679160461 678816605 678013229 677282410 677132568 677020340 676902161 676675873 676075516
2804.4 676075516 675640564 675627213 675388641 674960022 674710770 674215240 673676605 673409424 673304291 673022461
2814 673022461 672707672 672709274 672163010 671299057 671031799 670927048 670489883 669856491 669238358 668700943
2823.7 668700943 668374176 668167419 668009338 667644501 667266846 667059174 666469574 665957947 665448074 664820099
2833.3 664820099 664491196 663951874 663433304 662971954 662398682 661603622 660282745 659105911 658167953
$$ packed form
2765.8F86206436k71606m01383n4779J21155O8130k3651k54364n80825j84556N4780
2775.5F84679337o52390o07986k19880j23062l31649o9733K88391m08707n46112l87344
2785.1F81620865j4343K4490m77982j85012m85230m78058j9760k30408k51312k34375
2794.8F79268875p3395l5019l43856q03376p30819j49842j12228j18179k26288o00357
2804.4F76075516m34952j3351k38572m28619k49252m95530n38635k67181j05133k81830
2814F73022461l14789J602n46264q63953k67258j04751m37165o33392o18133n37415
2823.7F68700943l26767k06757j58081l64837l77655k07672n89600n11627n09873o27975
2833.3F64820099l28903n39322n18570m61350n73272p95060j320877j176834r37958
$$ plain form
2842 658167953 657199936 656178284 655046997 653779602 652584991 651548386 650006027 648456268 647122803
2850.7 647122803 646133270 646170273 645876999 645287170 645235214 644993973 644777374 644928589 645019836 644670792
2860.3 644670792 644494400 644395981 644227982 644512405 644179840 643652954 643400574 642573547 641856232 641534729
2870 641534729 641235962 640752640 640504074 640214539 639631653 639531937 639113045 638735924 638751297 638398094
2879.6 638398094 638099442 637219276 636423302 636753044 636922302 636584435 636147003 635641060 635088501 634437637
2889.3 634437637 633714600 633268433 633034439 632450523 631742363 631222458 630990868 630769234 630130615 629296951
2898.9 629296951 628500023 628075027 627600021 627082291 626982956 626396446 625742722 625473251 625223885 625239716
2908.6 625239716 624913445 624154968 623016281 621605415 620713005 620116196 619414330 618756218 618031883
$$ packed form
2842F58167953r68017j021652j131287j267395j194611j036605j542359j549759j333465
2850.7F47122803r89533L7003k93274n89829n1956k41241k16599J51215R1247l49044
2860.3F44670792j76392r8419j67999K84423l32565n26886k52380q27027p17315l21503
2870F41534729k98767m83322k48566k89535n82886r9716m18892l77121J5373l53203
2879.6F38398094k98652q80166p95974L29742J69258l37867m37432n05943n52559o50864
2889.3F34437637p23037m46167k33994n83916p08160n19905k31590k21634o38619q33664
2898.9F29296951p96928m24996m75006n17730r9335n86510o53724k69471k49366J5831
2908.6F25239716l26271p58477j138687j410866q92410n96809p01866o58112p24335
$$ plain form
2917.2 618031883 616858482 615814514 615162964 614488907 614090691 613786011 613705368 613756676 613500938 613212471
2926.9 613212471 613161621 613635025 614050980 613997040 613802757 613789101 614091415 614490471 614685135 614721069
2936.5 614721069 615203362 615825386 616083488 616176147 616984787 618343887 618481178 618173523 618478508 618624763
2946.2 618624763 618404961 618251572 618358765 618169022 617930527 617913208 617759399 617344894 616775017 616114922
2955.8 616114922 615278053 615233917 615779076 615809975 615457191 615040474 614979286 615039215 615018082 615220413
2965.5 615220413 616009254 617067795 617484093 617811279 618290977 618401718 618680840 619344826 619872932
2974.1 619872932 620049210 620193024 620640221 621269760 621845856 622097740 622135239 622320023 622324219 622375679
2983.8 622375679 622902107 623519363 624128456 624284515 623991241 624023018 624259338 624696198 625189056 625209808
$$ packed form
2917.2F18031883j173401j043968o51550o74057l98216l04680q0643N1308k55738k88467
2926.9F13212471n0850M73404M15955n3940j94283j3656L02314L99056J94664L5934
2936.5F14721069M82293O22024K58102R2659Q08640J359100J37291l07655L04985J46255
2946.2F18624763k19802j53389J07193j89743k38495j7319j53809m14505n69877o60095
2955.8F16114922q36869m4136N45159L0899l52784m16717o1188N9929k1133K02331
2965.5F15220413P88841J058541M16298L27186M79698J10741K79122O63986N28106
2974.1F19872932J76278J43814M47197O29539N76096K51884L7499J84784M196N1460
2983.8F22375679N26428O17256O09093J56059k93274L1777K36320M36860M92858K0752
$$ plain form
2993.4 625209808 625088730 625186539 625460625 625369873 624838982 624728584 624844170 625099525 625409508 624903030
3003.1 624903030 624381180 624514389 624634781 624642334 624570465 624299889 623858337 623573265 623678665 623670044
3012.7 623670044 623190727 622947540 623174667 623040161 622321854 621394005 620797043 620876617 620929565 620439491
3022.4 620439491 619797783 619267921 619026985 618914261 618597679 618192787 617572975 617153206 617075386 616835785
3032 616835785 617097511 617066803 615871429 615308075 615462723 614963226 613978233 613281441 613193016 613008728
3041.6 613008728 612493744 612084465 611520500 610888405 610512009 610192032 609503250 608705902 608647308 608615990
3051.3 608615990 607733154 606983528 606816521 606718979 606658058 605876274 604571419 604026146 603991928 603867264
3060.9 603867264 603219070 602745781 602890854 602660980 602279320 601827621 601118660 600339584 599997253 600005035
$$ packed form
2993.4F25209808j21078R7809K74086r0752n30891j10398J15586K55355L09983n06478
3003.1F24903030n21850J33209J20392P553p1869k70576m41552k85072J05400q621
3012.7F23670044m79317k43187K27127j34506p18307r27849n96962P9574N2948m90074
3022.4F20439491o41708n29862k40936j12724l16582m04892o19812m19769p7820k39601
3032F16835785K61726l0708j195374n63354J54648m99497r84993o96792q8425j84288
3041.6F13008728n14984m09279n63965o32095l76396l19977o88782p97348n8594l1318
3051.3F08615990q82836p49626j67007r7542o0921p81784j304855n45273l4218j24664
3060.9F03867264o48194m73289J45073k29874l81660m51699p08961p79076l42331P782
$$ plain form
3070.6 600005035 599498749 599149857 598783569 598412781 598550377 598366737 597510681 596496620 596351242
3079.2 596351242 596238632 595753860 595489311 595127525 594796028 594174805 593795509 593695679 593634071 593554344
3088.9 593554344 592770691 592088051 591576118 591120872 590629234 589894333 589401436 589018593 589067192 589162178
3098.5 589162178 588793449 588109894 587191505 586426048 586046600 585989380 585880394 585673981 585075378 584290352
3108.2 584290352 583857231 583392601 582987061 582821045 582620392 582273331 581791344 580795822 579782600
3116.9 579782600 579490280 579327888 578773003 578196182 577945671 577143517 576397362 576581535 576413918 575622292
3126.5 575622292 574697037 574110298 573857346 573722115 573507996 572885818 572056427 571221428 570812378 570290947
3136.1 570290947 569547234 569431381 569102249 567961082 567330055 567554665 567020569 565982513 565487633
$$ packed form
3070.6F00005035n06286l48892l66288l70788J37596j83640q56056j014061j45378
3079.2E96351242j12610m84772k64549l61786l31497o21223l79296r9830o1608p9727
3088.9E93554344p83653o82640n11933m55246m91638p34901m92897l82843M8599R4986
3098.5E89162178l68729o83555r18389p65457l79448n7220j08986k06413n98603p85026
3108.2E84290352m33121m64630m05540j66016k00653l47061m81987r95522j013222
3116.9E79782600k92320j62392n54885n76821k50511q02154p46155J84173j67617p91626
3126.5E75622292r25255n86739k52952j35231k14119o22178q29391q34999m09050n21431
3136.1E70290947p43713j15853l29132j141167o31027K24610n34096j038056m94880
$$ plain form
3144.8 565487633 565040245 564490700 564102669 563505249 562720451 562528801 561902809 560837746 560519257
3153.5 560519257 560333824 560059700 559357643 558452454 558026581 557658501 556715012 555591011 555082283
3162.2 555082283 554658394 554299049 554140320 553656044 552871323 552131386 551272469 550603447 550582848 550145836
3171.8 550145836 549598694 549145775 548354912 547666321 546982422 546529884 545848045 545314674 544949188 544041862
3181.5 544041862 543458214 543018913 542432480 541851692 541285019 540485077 539675522 539496002 539274673 538667831
3191.1 538667831 537712021 536805687 536454468 536182365 535392189 534430084 533964806 533857460 533623886 532901001
3200.8 532901001 532501450 532428894 531659622 530652161 530167465 530026436 529518433 529030075 528578758 528038101
3210.4 528038101 527535439 526564064 525962105 525692520 524941292 524050865 523377762 523111343 522733269 521790390
$$ packed form
3144.8E65487633m47388n49545l88031n97420p84798j91650o25992j065063l18489
3153.5E60519257j85433k74124p02057r05189m25873l68080r43489j124001n08728
3162.2E55082283m23889l59345j58729m84276p84721p39937q58917o69022k0599m37012
3171.8E50145836n47142m52919p90863o88591o83899m52538o81839n33371l65486r07326
3181.5E44041862n83648m39301n86433n80788n66673p99942q09555j79520k21329o06842
3191.1E38667831r55810r06334l51219k72103p90176r62105m65278j07346k33574p22885
3200.8E32901001l99551p2556p69272j007461m84696j41029n08003m88358m51317n40657
3210.4E28038101n02662r71375o01959k69585p51228q90427o73103k66419l78074r42879
$$ plain form
3220 521790390 521188736 521011848 520444031 520059357 519557610 519040031 519012337 518869400 518603668 517779579
3229.7 517779579 517328720 517106438 516279869 515893555 515414314 514606972 513947945 513420944 512653694 511844635
3239.3 511844635 511437607 511311226 511256409 511066513 511186066 510581169 509690704 509584999 509336205 509144897
3249 509144897 508667030 508017960 507334862 506803741 506546783 505751076 505227928 504961166 504252243 503637314
3258.6 503637314 503418159 503066330 503023529 502910614 502262726 502160988 501676369 501243706 501407242 501410103
3268.3 501410103 501164665 500546646 499924965 499066811 499044456 498867149 497941399 497683449 496953926 496431580
3277.9 496431580 495914116 495377960 495237350 494734459 494804726 494924927 494542198 493736610 493149529 493111839
3287.5 493111839 492497864 491972237 492127876 491918640 490897942 490229301 490285492 490219727 489814491 489178886
$$ packed form
3220E21790390o01654j76888n67817l84674n01747n17579k7694j42937k65732q24089
3229.7E17779579m50859k22282q26569l86314m79241q07342o59027n27001p67250q09059
3239.3E11844635m07028j26381n4817j89896J19553o04897q90465j05705k48794j91308
3249E09144897m77867o49070o83098n31121k56958p95707n23148k66762p08923o14929
3258.6E03637314k19155l51829m2801j12915o47888j01738m84619m32663J63536K861
3268.3E01410103k45438o18019o21681q58154k2355j77307r25750k57950p29523n22346
3277.9D96431580n17464n36156j40610n02891P0267J20201l82729q05588n87081l7690
3287.5D93111839o13975n25627J55639k09236j020698o68641N6191o5765m05236o35605
$$ plain form
3297.2 489178886 488215446 487602463 487894821 487585068 486632004 486177444 485959435 485696640 485260124 484903793
3306.8 484903793 484655342 484241104 483454399 482686539 482686920 482883644 481989517 480784531 480578651 480436897
3316.5 480436897 479957771 479291954 478475800 477870369 477578697 477313957 476829681 476804352 476609688 476111488
3326.1 476111488 475377579 474034081 473277779 472790604 472188187 471888809 472185135 472222748 471284714 470450211
3335.8 470450211 469661789 468982735 468536453 468336868 467953835 467332382 467206154 466674194 465959358 465496483
3345.4 465496483 465005455 464139938 463574524 464082069 463984184 463180161 462647552 462390747 461768036 460912361
3355.1 460912361 460379066 459685516 459243660 458956223 458567162 458138084 457653275 457271233 456869469 456146240
3364.7 456146240 455383530 455109978 454490547 454068871 453521461 452810745 452949638 452474289 451863403 451372261
$$ packed form
3297.2D89178886r63440o12983K92358l09753r53064m54560k18009k62795m36516l56331
3306.8D84903793k48451m14238p86705p67860L81J96724q94127j204986k05880j41754
3316.5D80436897m79126o65817q16154o05431k91672k64740m84276k5329j94664m98200
3326.1D76111488p33909j343498p56302m87175o02417k99378K96326L7613r38034q34503
3335.8D70450211p88422o79054m46282j99585l83033o21453j26228n31960p14836m62875
3345.4D65496483m91028q65517n65414N07545r7885q04023n32609k56805o22711q55675
3355.1D60912361n33295o93550m41856k87437l89061m29078m84809l82042m01764p23229
3364.7D56146240p62710k73552o19431m21676n47410p10716J38893m75349o10886m91142
$$ plain form
3374.3 451372261 451122704 450953712 449953575 449737053 449883308 449717026 449289131 448421822 447855568
3383 447855568 447779808 447787399 447293434 446675072 446049080 446170959 446793671 446527214 446076355 445169373
3392.7 445169373 443842659 443388786 443882790 444661636 444174118 442613869 442024841 442232780 442265854
3401.3 442265854 442499619 442964630 442880363 441987000 441221924 440942192 441110725 441184616 440980988 441604080
3411 441604080 441957321 441349487 440728874 440515785 440123215 439824715 440183411 439655762 439556465 440077896
3420.6 440077896 440187378 440730553 440284538 439500275 438823357 438642654 439207230 439079247 439093361 439379807
3430.3 439379807 439479523 439276314 438979721 439175644 439637566 439825172 439502945 439335289 439645081 439990997
3439.9 439990997 439884224 439853210 439732780 439822273 440618935 440995483 441239052 440494652 439724007 440531502
$$ packed form
3374.3D51372261k49557j68992j000137k16522J46255j66282m27895q67309n66254
3383D47855568p5760P591m93965o18362o25992J21879O22712k66457m50859r06982
3392.7D45169373j326714m53873M94004P78846m87518j560249n89028K07939L3074
3401.3D42265854K33765M65011q4267q93363p65076k79732J68533P3891k03628O23092
3411D41604080L53241o07834o20613k13089l92570k98500L58696n27649r9297N21431
3420.6D40077896J09482N43175m46015p84263o76918j80703N64576j27983J4114K86446
3430.3D39379807R9716k03209k96593J95923M61922J87606l22227j67656L09792L45916
3439.9D39990997j06773l1014j20430Q9493P96662L76548K43569p44400p70645Q07495
$$ plain form
3449.6 440531502 441179352 441129646 441099052 441705742 442592506 443062248 442892189 442660408 443130417 443921394
3459.2 443921394 444541664 444467659 444044952 443957710 444505463 445164261 445713387 446240349 446094818 446113358
3468.8 446113358 446762733 447510605 447606697 447721100 448383331 448730392 449030380 448869133 448870506 449493294
3478.5 449493294 450241928 450583611 450348625 450833206 451212540 451627541 452326965 453000832 453769455 453709335
3488.1 453709335 453462029 454008865 455019188 455273323 455615349 456177521 456244278 457013474 457368393 457403526
3497.8 457403526 457789764 458089218 458785782 460443153 461941681 461476784 460934601 461017113 461012039 460972099
3507.4 460972099 462361488 463859825 462885933 463008080 464174271 465321083 465825729 465729828 466339264
3516.1 466339264 467018661 467755814 467835579 468066597 468859520 469480553 469991493 470123482 470607758 470904160
$$ packed form
3449.6D40531502O47850m9706l0594O06690Q86764M69742j70059k31781M70009P90977
3459.2D43921394O20270p4005m22707q7242N47753O58798N49126N26962j45531J8540
3468.8D46113358O49375P47872R6092J14403O62231L47061K99988j61247J373O22788
3478.5D49493294P48634L41683k34986M84581L79334M15001O99424O73867P68623o0120
3488.1D53709335k47306N46836J010323K54135L42026N62172O6757P69196L54919L5133
3497.8D57403526L86238K99454O96564J657371J498528m64897n42183Q2512n074l9940
3507.4D60972099J389389J498337r73892J22147J166191J146812N04646r5901O09436
3516.1D66339264O79397P37153P9765K31018P92923O21033N10940J31989M84276K96402
$$ plain form
3525.7 470904160 471558418 472456245 473011246 473746719 474692802 474951248 475175247 476485023 476284790
3534.4 476284790 476865273 478233147 477481613 477867622 478313484 478520508 479281349 480771828 481828728
3543.1 481828728 482411118 483132668 482446327 483425293 483671494 484079857 485243988 486123962 488214264
3551.8 488214264 487376785 487487755 488428955 488437920 489738045 489856911 490453949 491923180 492949142
3560.5 492949142 492732506 493896332 495582352 495347099 498219261 499650307 499408989 499138756 496439743
3569.1 496439743 498662910 500503922 501159058 501936569 502784958 503763657 504188347 505282936 504933548
3577.8 504933548 505610313 507002144 507510834 508729553 509907913 510553398 510056610 513079147 516684799
3586.5 516684799 515479279 516204376 514776039 515708694 517219391 518986740 520529022 520262260 522775459
$$ packed form
3525.7D70904160O54258Q97827N55001P35473R46083K58446K23999J309776k00233
3534.4D76284790N80483J367874p51534L86009M45862K07024P60841J490479J056900
3543.1D81828728N82390P21550o86341R78966K46201M08363J164131Q79974K090302
3551.8D88214264q37479J10970R41200Q965J300125J18866N97038J469231J025962
3560.5D92949142k16636J163826J686020k35253K872162J431046k41318k70233k699013
3569.1D96439743K223167J841012O55136P77511Q48389R78699M24690J094589l49388
3577.8E04933548O76765J391831N08690J218719J178360O45485m96788L022537L605652
3586.5E16684799j205520P25097j428337R32655J510697J767349J542282k66762K513199
$$ plain form
3595.2 522775459 521231079 521885262 525128098 524377213 525591736 526110229 526421432 527937622 528683434
3603.9 528683434 529907341 532159195 534628639 533282127 535648651 535828323 532949181 538641853
3611.6 538641853 541700706 538881226 541680679 540098381 540793304 544625549 545030212 545969696 545385284
3620.3 545385284 545333786 548319244 550239830 550983429 552383041 554355774 555879593 561082726 566212616
3628.9 566212616 555525970 555608521 558255577 562823067 565287666 562804527 563972626 566870117
3636.6 566870117 569699669 569745979 569506302 571494141 573666840 574452629 574040947 575911980 579358444
3645.3 579358444 584979362 586291771 581754303 586332970 589060555 586455994 582225571 584727097
3653 584727097 587878609 590975189 597115135 591408844 590527039 594290009 595399895 596626129 596971664
$$ packed form
3595.2E22775459j544380O54183L242836p50885J214523N18493L11203J516190P45812
3603.9E28683434J223907K251854K469444j346512K366524J79672k879142N692672
3611.6E38641853L058853k819480K799453j582298O94923L832245M04663R39484n84412
3620.3E45385284n1498K985458J920586P43599J399612J972733J523819N203133N129890
3628.9E66212616j0686646Q2551K647056M567490K464599k483139J168099K897491
3636.6E66870117K829552M6310k39677J987839K172699P85789m11682J871033L446464
3645.3E79358444N620918J312409m537468M578667K727585k604561m230423K501526
3653E84727097L151512L096580O139946n706291q81805L762970J109886J226234L45535
$$ plain form
3661.7 596971664 598516006 599067039 599980164 601248245 601229210 604894218 607558746 606795921 607899513
3670.4 607899513 602693367 602674675 608771248 618215370 623398247 605548668 604333496 610129051
3678.1 610129051 615373154 614173508 612333527 614031029 615906677 616969833 616467133 615717621 619182243
3686.8 619182243 626761856 621219597 615876999 624437790 619315681 615231705 619388428 620303497
3694.5 620303497 621302986 621595573 620852814 621132164 620628586 622703629 627631836 624917793 620060310
3703.2 620060310 622949944 624434586 624546776 625008621 626902924 632477798 627026520 627967186 635559044
3711.9 635559044 624067535 624751282 628067703 628503914 628500328 630041237 632375107 629549446 628663330
3720.5 628663330 633855591 633284798 627863998 631484871 633628311 633994865 630751152 627786713 630476952
$$ packed form
3661.7E96971664J544342N51033R13125J268081j9035L665008K664528p62825J103592
3670.4F07899513n206146j8692O096573R444122N182877j7849579j215172N795555
3678.1F10129051N244103j199646j839981J697502J875648J063156n02700p49512L464622
3686.8F19182243P579613n542259n342598Q560791n122109m083976M156723R15069
3694.5F20303497R99489K92587p42759K79350n03578K075043M928207k714043m857483
3703.2F20060310K889634J484642J12190M61845J894303N574874n451278R40666P591858
3711.9F35559044j1491509O83747L316421M36211l586J540909K333870k825661q86116
3720.5F28663330N192261n70793n420800L620873K143440L66554l243713k964439K690239
$$ plain form
3729.2 630476952 631731834 636981926 636719513 627391701 634412270 638828354 631426201 630247688
3736.9 630247688 631854973 631756592 632843056 635978737 632811356 633863335 646400757 648470154
3744.7 648470154 624304428 629507065 634897690 640864029 640971146 630313568 638953133 637343826
3752.4 637343826 628540039 631338921 635167809 638458366 633041725 634230385 640775833 634567261
3760.1 634567261 630439949 633360710 635234108 635600319 638930397 637915497 632678032 634073410
3767.8 634073410 638872490 642386627 634158401 632440681 634849014 635428505 636033287 635737419 636186943
3776.5 636186943 636645966 639542084 641005783 633221893 633788185 635821419 636584167 638923149 636349182
3785.2 636349182 634938774 636120110 636392136 636821136 636213684 635791092 635658531 636470642 636500740
$$ packed form
3729.2F30476952J254882N250092k62413r327812P020569M416084p402153j178513
3736.9F30247688J607285r8381J086464L135681l167381J051979J2537422K069397
3744.7F48470154k4165726N202637N390625N966339J07117j0657578Q639565j609307
3752.4F37343826q803787K798882L828888L290557n416641J188660O545448o208572
3760.1F34567261m127312K920761J873398L66211L330078j014900n237465J395378
3767.8F34073410M799080L514137q228226j717720K408333N79491O04782k95868M49524
3776.5F36186943M59023K896118J463699p783890N66292K033234P62748K338982k573967
3785.2F36349182j410408J181336K72026M29000o07452m22592j32561Q12111L0098
$$ plain form
3793.8 636500740 637373619 641388474 638823547 633871613 634366150 637732506 645128708 643841019 632558289
3802.5 632558289 632228928 634016037 638171692 644663162 638866234 631886253 634548149 635392876 635178223
3811.2 635178223 635973892 635600548 635977516 641456146 644753265 631797714 633250809 637433281 640824585
3819.9 640824585 644980621 631379242 630326118 634465637 636214104 638585510 638922539 634328880
3827.6 634328880 633738708 634976845 637900352 640989456 632579498 632843323 639945068 636563530 634767876
3836.3 634767876 643322220 640332642 633378868 640114059 634552422 631426277 638195572 638006554
3844 638006554 633671265 634485664 634642334 634611588 637091103 636246643 636478233 642645416 640640793
3852.7 640640793 643214188 629148445 625817108 635108185 635315704 631873741 632923317 635076485
$$ packed form
3793.8F36500740Q72879M014855k564927m951934M94537L366356P396202j287689j1282730
3802.5F32558289l29361J787109M155655O491470n796928o979981K661896Q44727k14653
3811.2F35178223P95669l73344L76968N478630L297119j2955551J453095M182472L391304
3819.9F40824585M156036j3601379j053124M139519J748467K371406L37029m593659
3827.6F34328880n90172J238137K923507L089104q409958K63825P101745l381538j795654
3836.3F34767876Q554344k989578o953774O735191n561637l126145O769295j89018
3844F38006554m335289Q14399J56670l0746K479515q44460K31590O167183k004623
3852.7F40640793K573395j4065743l331337R291077K07519l441963J049576K153168
$$ plain form
3860.4 635076485 638774529 635595131 633469772 640934525 638838425 629847221 631333923 635455055
3868.1 635455055 642841187 639274483 628081284 630288887 636617889 642280731 632454796 630728226
3875.8 630728226 633641930 632893944 633934097 639396935 638349991 628724327 632514877 633619614
3883.5 633619614 634360733 642571640 633284683 630276031 632720261 633207321 637342606 638764343 630646896
3892.2 630646896 629918442 632556877 631171608 632278137 633501129 634840698 637317467 628531342
3899.9 628531342 631737289 635759354 630344200 633703384 632509422 630429726 630740662 630921898 632387962
3908.6 632387962 632184563 632302971 632487144 632643890 632318344 631161842 632246017 634790306 632278976
3917.3 632278976 628311386 632577705 634211998 629313660 630360413 631858978 633373566 633265953
$$ packed form
3860.4F35076485L698044l179398k125359P464753k096100q991204J486702M121132
3868.1F35455055P386132l566704j1193199K207603O329002N662842r825935j726570
3875.8F30728226K913704p47986J040153N462838j046944r625664L790550J104737
3883.5F33619614P41119Q210907r286957l008652K444230M87060M135285J421737q117447
3892.2F30646896p28454K638435j385269J106529J222992J339569K476769q786125
3899.9F28531342L205947M022065n415154L359184j193962k079696L10936J81236J466064
3908.6F32387962k03399J18408J84173J56746l25546j156502J084175K544289k511330
3917.3F32278976l967590M266319J634293m898338J046753J498565J514588j07613
$$ plain form
3925 633265953 629918098 630895615 631871300 632678108 632132835 631091194 633404961 631014252 628745880
3933.7 628745880 630446434 630283890 630315208 631581879 631861382 630755577 629524193 631072655 633570862
3942.3 633570862 629962997 627814293 628891983 630236320 632520256 630311127 629416695 629926071 627099609
3951 627099609 628418312 629894333 629191017 629384193 629841576 630068703 629826088 630020866 629170227 628665466
3960.7 628665466 629376945 628672447 628325768 628772659 628835258 629086227 629420662 629756126 629365501 627935028
3970.3 627935028 628151741 629256401 629256859 629201126 628954582 628774376 628481216 628316803 628760834 629277534
3980 629277534 629757156 629032784 627742081 627514610 627636604 627254753 627128220 627793007 628607979 628911018
3989.6 628911018 628305855 627929726 628237495 628372993 628428268 628349991 627488213 627420616 628634911 628217049
$$ packed form
3925F33265953l347855R77517R75685Q06808n45273j041641K313767k390709k268372
3933.7F28745880J700554j62544L1318J266671K79503j105805j231384J548462K498207
3942.3F33570862l607865k148704J077690J344337K283936k209129q94432N09376k826462
3951F27099609J318703J476021p03316J93176M57383K27127k42615J94778q50639n04761
3960.7F28665466P11479p04498l46679M46891O2599K50969L34435L35464l90625j430473
3970.3F27935028K16713J104660M58n5733k46544j80206k93160j64413M44031N16700
3980F29277534M79622p24372j290703k27471J21994l81851j26533O64787Q14972L03039
3989.6F28911018o05163l76129L07769J35498N5275p8277q61778o7597J214295m17862
$$ plain form
3999.2 628217049 627543526
4000.2 627543526
$$ packed form
3999.2F28217049o73523
4000.2F27543526
##END=$$ End of the data block
