##TITLE=$$ Begin of the data block
##JCAMP-DX=5.00 $$ ACD/SpecManager v 10.08
##SPECTROMETER/DATA SYSTEM=Varian
##DATE=18 Dec 2012 10:29:44
##DATA TYPE=INFRARED SPECTRUM
##DATA CLASS=XYDATA
##ORIGIN=
##OWNER=
##NPOINTS=3735
##FIRSTX=399.26403809
##LASTX=4000.35498047
##MAXX=4000.35498047
##MINX=399.26403809
##MAXY=76.45935059
##MINY=43.04663849
##XFACTOR=1.0000000000
##YFACTOR=0.000000100000000
##FIRSTY=67.46873474
##DELTAX=0.96440572
##XUNITS=1/CM
##YUNITS=TRANSMITTANCE
##XYDATA=(X++(Y..Y))
399.3F74687347J1967926j0802612p387314R702912R846954m588928q185654k626419
$$ 674687347 686655273 675852661 668465347 678168259 688015213 683426285 675240631 672614212
407F72614212J907501R276047J158447K188492l304138j1291962p19528M324875O453781
$$ 672614212 674521713 683797760 684956207 687144699 683840561 672548599 671829071 676153946 682607727
415.7F82607727K044678M112091k305374j2721939R699554J06125L16238M273l20282
$$ 682607727 684652405 688764496 686459122 673737183 683436737 683542862 683859100 683863373 683543091
424.3F83543091j425476K465973m53568n105286q7280q23669L811340K605820J539688
$$ 683543091 682117615 684583588 684130020 679024734 678937454 678113785 681925125 684530945 686070633
433F86070633o56433l843308L533860L42102m31137m045411j624984L727264K724686
$$ 686070633 685414200 681570892 685104752 685446854 685015717 680970306 679345322 683072586 685797272
441.7F85797272K681961q449555l625869K10647l697967k30332M549027N929870k501983
$$ 685797272 688479233 680029678 676403809 676614456 672916489 672686157 677235184 683165054 680663071
450.4F80663071k229462j49078j077881J262893j944809n094070p40509N275497m986953
$$ 680663071 678433609 678284531 677206650 678469543 676524734 671430664 670690155 675965652 670978699
459.1F70978699J493606P616501J734696k384720l795777J933747J661606p268906
$$ 670978699 672472305 680088806 681823502 679438782 675643005 677576752 679238358 671969452
466.8F71969452m538956L098221o54983K638778J327973j0026322P03888L317795K691803
$$ 671969452 667430496 670528717 669873734 672512512 673840485 663814163 664518051 667835846 670527649
475.5F70527649N88608l74375L179169K992172L920975k861481l372040j880035l332062
$$ 670527649 671116257 670741882 673921051 676913223 680834198 677972717 674600677 672720642 669388580
484.1F69388580L117524L261032q51822m67224N985488K087708k813873m531861n029525
$$ 669388580 672506104 675767136 674915314 674448090 680433578 682521286 679707413 675175552 670146027
492.8F70146027K235031L23028j884308N22309J628723M04358j236267J645126J5183
$$ 670146027 672381058 672704086 670819778 671342087 672970810 673375168 672138901 673784027 673799210
501.5F73799210m04816L219147K085571l344116p325592q39081O954269K882157l352356
$$ 673799210 673394394 676613541 678699112 675354996 668029404 667190323 674144592 677026749 673674393
510.2F73674393j177903K105484O53000k359085k378845j522217k058639J283493j185227
$$ 673674393 672496490 674601974 675254974 672895889 670517044 668994827 666936188 668219681 667034454
518.9F67034454k821655p74612j130677P58133J649857J686478N98754j280670n41916
$$ 667034454 664212799 663438187 662307510 663065643 664715500 666401978 667000732 665720062 665178146
527.5F65178146L39356L62320q50525j16272K48337j280136j525040n82581R59778
$$ 665178146 665517502 665879822 665029297 664913025 665161362 663881226 662356186 661773605 662733383
536.2F62733383K875061J90430k852173L74756J907959Q14667n01404j477204j755981
$$ 662733383 665608444 665798874 662946701 663321457 665229416 666044083 665542679 664065475 662309494
544.9F62309494p62711J181488p44552M77218J608887J41297J075058N67703O54297
$$ 662309494 661546783 662728271 661983719 662460937 664069824 664211121 665286179 665853882 666508179
553.6F66508179k23923K36893J45187k560043j105957J95007K61459J529999P86667
$$ 666508179 666284256 666521149 666666336 664106293 663000336 663195343 663456802 664986801 665773468
562.3F65773468p39975J090164J055222j629257p02973P03201j27258j273422N56946
$$ 665773468 665033493 666123657 667178879 665549622 664846649 665549850 665422592 664149170 664706116
570.9F64706116K084884Q66547j383362l060989q43888n9814n91431J041489J674271
$$ 664706116 666791000 667657547 666274185 663213196 662369308 662309494 661718063 662759552 664433823
579.6F64433823P43560o76651L27530p20443k846070m76150R61151k02332o71386P8888
$$ 664433823 665177383 664500732 664828262 664107819 661261749 660785599 661746750 661544418 660873032 660951920
589.3F60951920K151565J661682k30026M07410l32795N64270Q45566k093658j425934
$$ 660951920 663103485 664765167 664535141 664942551 664609756 665174026 666019592 663925934 662500000
597.9F62500000p18536j633149j425094j19400O29654n58090j444169m06723q19702
$$ 662500000 661781464 660148315 658723221 658603821 659233475 658675385 657231216 656824493 656004791
606.6F56004791l316574k412796k421646m482727n674820o508064n681114n878106
$$ 656004791 652688217 650275421 647853775 643371048 637696228 631188164 625507050 619628944
614.3F19628944n965538n956611n997696l853302j294480o33163J87149N36614P91778
$$ 619628944 613663406 607706795 601709099 597855797 596561317 595928154 596115303 596651917 597443695
623E97443695J964111L340722N457229P102089P322655P020378O536217M785194L583984
$$ 597443695 599407806 602748528 608205757 615307846 622630501 629650879 636187096 640972290 644556274
631.7F44556274L103714K287674K21558m22974l58657k224350k488404j94931R65119
$$ 644556274 647659988 649947662 650169220 649746246 649387589 647163239 644674835 644479904 645445023
640.4F45445023K045745M494400M288254M408646M788437K353973L036652K778244
$$ 645445023 647490768 651985168 656273422 660682068 665470505 667824478 670861130 673639374
648.1F73639374J934051J514130o75659r95713M18778M54941j35498Q03833P73925
$$ 673639374 675573425 677087555 676411896 675416183 675834961 676289902 676154404 676958237 677732162
656.8F77732162P54548L06930J034622K362519R10186N18876k02561j40457L85742
$$ 677732162 678486710 678793640 679828262 682190781 683100967 683619843 683417282 683276825 683662567
665.4F83662567N02930l370819j3044586R092636N935363L138581K104034Q7891n59387
$$ 683662567 684165497 680794678 667750092 676842728 682778091 685916672 688020706 688108597 687549210
674.1F87549210k15302P87048k93579l99322m92401n52597N65643N81131J618881J390534
$$ 687549210 687333908 688120956 687827377 687428055 686935654 686383057 686948700 687529831 689148712 690539246
683.8F90539246N63812r37958j455994o16912q47626m22211j346664j800690j547241
$$ 690539246 691103058 690165100 688709106 688092194 687244568 686822357 685475693 683675003 682127762
692.4F82127762j451187r87854j165924k8382J102753J64490j239548n60303N02320
$$ 682127762 680676575 679688721 678522797 678494415 679597168 679761658 678522110 677961807 678464127
701.1F78464127L26232k60314o45676m71497j096573l41262J057663J188278J326751
$$ 678464127 678790359 678530045 677884369 677412872 676316299 675975037 677032700 678220978 679547729
709.8F79547729J597672K170334J304169J039047J394195J55335q3542M51736Q50144
$$ 679547729 681145401 683315735 684619904 685658951 687053146 687208481 687124939 687576675 688426819
718.5F88426819J075973L26996K51770J028214J346283J361847N01709N63278P26852
$$ 688426819 689502792 689829788 690081558 691109772 692456055 693817902 694319611 694882889 695609741
727.2F95609741p37381j800155j798096K64969P21740j040115j108932R9029O92978
$$ 695609741 694872360 693072205 691274109 691539078 692260818 691220703 690111771 690210800 690903778
735.8F90903778M37012R31549L44848k20489N39246R33609O71615k73437J00326Q88748
$$ 690903778 691340790 692272339 692617187 692396698 692935944 693869553 694541168 694267731 694368057 695256805
745.5F95256805Q54798J15814J605453L227692J919098K306824K137451J668625J275558
$$ 695256805 696111603 696227417 697832870 701060562 702979660 705286484 707423935 709092560 710368118
754.2G10368118J139756K330932R01566p81098n99365J189499J162415K024536L209686
$$ 710368118 711507874 713838806 714740372 713959274 713359909 714549408 715711823 717736359 720946045
762.8G20946045J69830j011581q16879J83563J00555r00574j315002j990890m41514
$$ 720946045 721115875 720104294 719287415 719470978 719571533 718670959 717355957 715365067 714923553
771.5G14923553L0671M04129J044464K220459K903900J023025J035614J193695J087418
$$ 714923553 714954224 715358353 716402817 718623276 721527176 722550201 723585815 724779510 725866928
780.2G25866928R09653Q80661J05285J72501K469482J761170Q88367R11483O88324
$$ 725866928 726776581 727657242 727762527 727935028 730404510 732165680 733054047 733965530 734653854
788.9G34653854K38800J141205J185837j232834q7662Q33970q1559p44781m13895k59323
$$ 734653854 734892654 736033859 737219696 735986862 735899200 736733170 736651611 735906830 735492935 735233612
798.5G35233612N34Q09250j79672P23037J68992l43247N28793J15281N47943l22342
$$ 735233612 735234146 736043396 735863724 736586761 736755753 736412506 736941299 737056580 737604523 737282181
808.2G37282181j7929L35922N05066K91443j54038j4572j16882K252197P30286q31757
$$ 737282181 737264252 737600174 738105240 738396683 738242645 738228073 738111191 740363388 741093674 740261917
817.8G40261917N16281L9139j86005o44912n4245L17688R88159J72500j899719j358261
$$ 740261917 740778198 740817337 740631332 739986420 739932175 740249863 741238022 741410522 739510803 738152542
827.5G38152542j268844k106476k020188q16116j798706k591400k514191l308258k099152
$$ 738152542 736883698 734777222 732757034 731940918 730142212 727550812 725036621 721728363 719629211
836.1G19629211k027816k451706k239456k763749k195053k036667k335357j735153
$$ 719629211 717601395 715149689 712910233 710146484 707951431 705914764 703579407 701844254
843.9G01844254j563263j573563o81915K80151Q16345Q72345P56760Q15506O93054
$$ 701844254 700280991 698707428 698025513 698305664 699122009 699994354 700751114 701566620 702259674
852.5G02259674J948090K768478K049789K008057J763230J410217K181167K740937
$$ 702259674 704207764 706976242 709026031 711034088 712797318 714207535 716388702 719129639
860.3G19129639J483307J126632J432038J428909J545486J004639M11835l74756K58942
$$ 719129639 720612946 721739578 723171616 724600525 726146011 727150650 727562485 727187729 727446671
868.9G27446671R63897J684494J808319J11390J80587J244126J685333R94034J34735
$$ 727446671 728410568 730095062 731903381 732014771 732195358 733439484 735124817 736118851 736253586
877.6G36253586j385193j880264n61829j382523j713943j301575k069626k264099r61380
$$ 736253586 734868393 732988129 732426300 731043777 729329834 728028259 725958633 723694534 722733154
886.3G22733154n81360j159668q87832p50961l21503m91944m46014K08740L36533N62439
$$ 722733154 722151794 720992126 720104294 719353333 719031830 718539886 718093872 718302612 718639145 719201584
895.9G19201584Q74557J008683m89502l30277J509934J397171K17056j311874j492615
$$ 719201584 720076141 721084824 720595322 720265045 721774979 723172150 723389206 722077332 720584717
904.6G20584717j147080q00476q40683j970596k038193j405945j889038k156830j824493
$$ 720584717 719437637 718637161 717796478 715825882 713787689 712381744 710492706 708335876 706511383
913.3G06511383k108841k244873k113800j239777j943435l410950k463913j733932
$$ 706511383 704402542 702157669 700043869 698804092 696860657 693449707 690985794 689251862
921F89251862j503907j675033j958542j995163j505585n32532q09631p34711m55780
$$ 689251862 687747955 686072922 684114380 682119217 680613632 680081100 679271469 678536758 678080978
929.7F78080978r60693q91647K17895P98111N90973J814270K592850J904678J908493
$$ 678080978 677120285 676228638 676446533 677244644 677835617 679649887 682242737 684147415 686055908
938.4F86055908K710571L022156J873627J917114K881241K913513K726517J926193
$$ 686055908 688766479 691788635 693662262 695579376 698460617 701374130 704100647 706026840
946.1G06026840J254044J689758K204590J268082J306076J627884L79028k25601m8066
$$ 706026840 707280884 708970642 711175232 712443314 713749390 715377274 715756302 715530701 715482635
954.8G15482635k2201m12521l67966j425705k508545j841125r16138j096039k648087
$$ 715482635 715460434 715047913 714679947 713254242 710745697 708904572 707988434 706892395 704244308
963.4G04244308k716522j734009j147689p08924q60214j635055j408387n54046q31604
$$ 704244308 701527786 699793777 698646088 697937164 697076950 695441895 694033508 693479462 692647858
972.1F92647858m13285n32150j332016q48999J54648L08533p53708o77567m54788k71530
$$ 692647858 692234573 691702423 690370407 689521408 689676056 689984589 689230881 688553314 688098526 687826996
981.8F87826996k71454j278992r41848j070557k514114l130417k043229j600646k402573
$$ 687826996 687555542 686276550 685334702 684264145 681750031 678619614 676576385 674975739 672573166
990.5F72573166k232361j520615j399993l053666l772964k321167p90405J579208K588120
$$ 672573166 670340805 668820190 667420197 664366531 660593567 658272400 657481995 659061203 661649323
999.1F61649323J231079l0518q87909n82352m56390q10318n69763n44510q16574j304703
$$ 661649323 662880402 662849884 661961975 661379623 660923233 660112915 659543152 658998642 658182068 656877365
1008.8F56877365q64944k16141p56760j874542j906662m58832j057586k017136j843567
$$ 656877365 656012421 655796280 655039520 653164978 651258316 650799484 649741898 647724762 645881195
1017.5F45881195j726303j085587j427688j150818j284103k087059k333184k301330
$$ 645881195 644154892 643069305 641641617 640490799 639206696 637119637 634786453 632485123
1025.2F32485123q96302j071739j883049j496124j133156j707954j590996l09639r75838
$$ 632485123 631588821 630517082 628634033 627137909 626004753 624296799 622705803 622396164 621420326
1033.8F21420326j712303j418075r88732j080398o14167L6698o71616p80334q20427
$$ 621420326 619708023 618289948 617301216 616220818 615606651 615643349 614971733 614191399 613370972
1042.5F13370972o32096k48680j20353j75477P20559J192283m70810m05960O94962
$$ 613370972 612738876 612490196 612369843 612194366 612914925 614107208 613636398 613230438 613925400
1051.2F13925400J003380N3062p29332m54979k83890J74752J65519r460j163254p71904
$$ 613925400 614928780 614981842 614252510 613797531 613513641 613688393 613853912 613844452 612681198 611909294
1060.9F11909294K24342n81436r39293j615448q87527n00565o98738n24368m71344
$$ 611909294 612133636 611552200 610612907 608997459 608109932 607609367 606910629 606386261 605914917
1069.5F05914917k82555j264419l47748J25885n40886l11890n05371p94754k49786
$$ 605914917 605632362 604367943 604020195 604146080 603605194 603293304 602787933 601993179 601743393
1078.2F01743393L59459m90494q44154j373177n70907l5859n89447J32523r84039j384468
$$ 601743393 602102852 601612358 600768204 599395027 598824120 598788261 598198814 598331337 597347298 595962830
1087.9E95962830j109085r17054j944427l387718l446541l979798l086700m363632
$$ 595962830 594853745 593936691 591992264 588604546 585158005 581178207 578091507 573727875
1095.6E73727875m849777m075661m499016m208565m194603l424835n249252n132103
$$ 573727875 568878098 564802437 560303421 556094856 551900253 548475418 543226166 538094063
1103.3E38094063m922371m905624l915406m901199m203682n327148m384919m790001
$$ 538094063 533171692 528266068 524350662 519449463 515245781 509918633 505533714 500743713
1111E00743713m208870k263183k839584p91741j582222q80737k33155M42429J62811
$$ 500743713 496534843 494271660 491432076 490640335 489058113 488177376 487944221 488386650 488549461
1119.7D88549461k17285J542893J047516K296524K24762M47349J758080J426544J562805
$$ 488549461 488332176 489875069 490922585 493219109 493443871 493891220 495649300 497075844 498638649
1128.4D98638649N51605K673874K109337J831322P72934N88493J210747L08265J079979
$$ 498638649 499190254 501864128 503973465 505804787 506577721 507166214 508376961 508685226 509765205
1137E09765205p94296P59201R31816O79817J082116l63045P73277l37639k09922r37310
$$ 509765205 508970909 509730110 510661926 511341743 512423859 512060814 512834091 512496452 512286530 511349220
1146.7E11349220p94449m79698j051903k32467j291084k04926l59688P48673N51300
$$ 511349220 510554771 510075073 509023170 508790703 507499619 507294693 506935005 507683678 508234978
1155.4E08234978M02946J688614L23601J377525Q58002K166481J844253P57676K292976
$$ 508234978 508637924 510326538 510650139 512027664 512885666 515052147 516896400 517654076 519947052
1164E19947052K318535L056183K413597L087959L036881L687591L575897K846947M185677
$$ 519947052 522265587 525321770 527735367 530823326 533860207 537547798 541123695 543970642 548156319
1172.7E48156319L002433L223076K915421K793274K311325J829262L057022K485122
$$ 548156319 551158752 554381828 557297249 560090523 562401848 564231110 567288132 569773254
1180.4E69773254K344056J572685K279663K431793J757317J637954K29187N45464M15421
$$ 569773254 572117310 573689995 575969658 578401451 580158768 581796722 582025909 582571373 582986794
1189.1E82986794O69326J087609J213836J264191J569710K388229J839829K114143
$$ 582986794 583656120 584743729 585957565 587221756 588791466 591179695 593019524 595133667
1196.8E95133667J591301K176361K502136J817894K589798K002182J374932J147537
$$ 595133667 596724968 598901329 601403465 603221359 605811157 607813339 609188271 610335808
1204.5F10335808K051201K118034J645165K070770J851959K090454J513596J471748
$$ 610335808 612387009 614505043 616150208 618220978 620072937 622163391 623676987 625148735
1212.3F25148735J221542O30837P61680P19719P18651l87764M0779Q55904P56912R68628
$$ 625148735 626370277 627001114 627762794 628482513 629201164 628813400 628854179 629710083 630466995 631435623
1221.9F31435623M69093M51127O61773L43323J12381O84509O2409n56107O4278J20926
$$ 631435623 631904716 632355843 633017616 633360939 633473320 634157829 634220238 633664131 633728409 633849335
1231.5F33849335N03387K81944L74032M40063M82788P41272J75705K97241R5673J37901
$$ 633849335 634352722 634634666 635008698 635448761 635931549 636672821 636848526 637145767 637241440 637379341
1241.2F37379341J57929K3689O3133k24113O1531M39377P74612J33209K95525N76858
$$ 637379341 637537270 637560959 637624092 637399979 637461510 637900887 638675499 638808708 639104233 639681091
1250.8F39681091K23809J17530m74395L25851J04485m63829K40249K58255j54915k9335
$$ 639681091 639904900 640022430 639548035 639873886 639978371 639514542 639754791 640013046 639858131 639828796
1260.5F39828796P17621J91040M29688Q80356O87561N26886M19845O00815j36719K32010
$$ 639828796 640546417 640737457 641167145 642047501 642735062 643261948 643681793 644282608 644145889 644377899
1270.1F44377899M31366N15137R28421P21283R42688Q97827J541367J221923R11789
$$ 644377899 644809265 645324402 646252823 646974106 647916794 648814621 650355988 651577911 652489700
1278.8F52489700J056290R85336J186829M86298Q93249R65576R33228J122055P82242
$$ 652489700 653545990 654531326 655718155 656204453 657097702 658063278 658996506 660118561 660900803
1287.5F60900803J488189J600342J529617J191178J058807J229172R16519J133576
$$ 660900803 662388992 663989334 665518951 666710129 667768936 668998108 669914627 671048203
1295.2F71048203Q33206N22232Q17947R04389Q12912Q82034J081390R96704R96094
$$ 671048203 671881409 672403641 673221588 674125977 674938889 675820923 676902313 677899017 678895111
1303.9F78895111J121368Q08030J09481M38309N82047j72272M07181M62646k34527
$$ 678895111 680016479 680824509 680933990 681372299 681954346 681782074 682189255 682651901 682417374
1312.5F82417374L45001J276932R78469J50834O47430O87943k2736L70865P65533L45917
$$ 682417374 682762375 684039307 685017776 685168610 685816040 686503983 686481247 686852112 687617645 687963562
1322.2F87963562j15280K73666M69589L17994K25219L87268P20597P59430O23703J54648
$$ 687963562 687848282 688121948 688591537 688909531 689134750 689522018 690242615 691002045 691625748 691780396
1331.8F91780396L66516K55508j96152k2201k85187j13068m04510r39560k88239R62677
$$ 691780396 692146912 692402420 692206268 692184067 691898880 691785812 691381302 690441742 690153503 691116180
1341.5F91116180Q78525j03683j26496J76468M59671Q9722k90604n10940r49784n51834
$$ 691116180 691994705 691891022 691764526 691940994 692400665 692490387 692199783 691688843 690739059 690187225
1351.1F90187225m75158N417j35193n42221k99988L46985Q11538Q2550J60752p83463
$$ 690187225 689712067 689717484 689582291 689040070 688740082 689087067 689898605 689981155 690141907 689358444
1360.8F89358444r82666p15637k276230M66995L64151p51876k50702r55735j024322
$$ 689358444 688375778 687660141 685383911 685850906 686215057 685463181 685212479 684256744 683232422
1369.4F83232422N00641P86361K66266r02252l078155j260834N78766L12652l92837
$$ 683232422 683733063 684519424 684785690 683883438 680805283 679544449 680123215 680435867 680043030
1378.1F80043030q57544p06711n45578J22070l62625l66363O08749J812134J035461
$$ 680043030 679185486 678478775 677933197 678055267 677692642 677326279 677935028 679747162 680782623
1386.8F80782623j642608J714096J862488P3394p7820L41950J174011n59006j764679
$$ 680782623 679140015 680854111 682716599 682789993 682712173 683054123 684228134 683669128 681904449
1395.5F81904449K78550P70263M81186k030639n02549P63550m36935m40674k09427
$$ 681904449 682182999 682953262 683434448 681403809 680901260 681664810 681227875 680787201 680577774
1404.2F80577774k315826q44345R97314J31607M36096L13339k24075l64227l45001
$$ 680577774 678261948 677417603 678414917 678546524 678982620 679295959 679071884 678707657 678362656
1412.8F78362656o1112o04629J2893l59802k95944M52728n093384L26462L000412J610184
$$ 678362656 678301544 677696915 677709808 677350006 677054062 677506790 672413406 672739868 675740280 677350464
1422.5F77350464k06757j667022J181716J464768r4986K10571l18756j732025k060
$$ 677350464 677143707 675476685 676658401 678123169 678028183 678238754 677919998 676187973 676185913
1431.2F76185913J181336N79452L48663K132111J590271n330582J189804L594895Q99429
$$ 676185913 677367249 677946701 678295364 680427475 682017746 676687164 677876968 681471863 682371292
1439.8F82371292l09143N0964P3471M21830J13372L07618J084594K38724j498108J062775
$$ 682371292 682062149 682113113 682186584 682608414 682721786 683029404 684113998 684352722 682854614 683917389
1449.5F83917389K197876N40008l39889M84772J247253P29981j247330m757614j999970
$$ 683917389 686115265 686655273 686315384 686800156 688047409 688777390 687530060 682772446 680772476
1458.2F80772476K889481K656021L345032J850052J195602K488937l017578j323929
$$ 680772476 683661957 686317978 689663010 691513062 692708664 695197601 692180023 690856094
1465.9F90856094K526780R99298K22244P89642K520676m6005m064331Q36181N011139
$$ 690856094 693382874 694382172 694604416 695394058 697914734 697868729 693804398 694640579 699651718
1474.6F99651718M291763j399154R58633L055268J280136J030655m97132q0871J405716
$$ 699651718 703943481 702544327 703502960 706558228 707838364 708869019 708371887 708291016 709696732
1483.2G09696732J229019J070556J302796n05524p84149K916565j424790m391479J935196
$$ 709696732 710925751 711996307 713299103 712793579 712009430 714925995 713501205 709109726 711044922
1491.9G11044922K150116N37109N76172J95923o675568J763459k060k406693K297440
$$ 711044922 713195038 713732147 714308319 714504242 707828674 709592133 709590073 707183380 709480820
1500.6G09480820Q087l90549j0834J193390J526337j0719986j0784378L123550L209305
$$ 709480820 709488907 709098358 709087524 710280914 711807251 701087265 690302887 693426437 696635742
1509.3F96635742O73905K694854q55789k654648J865006m578j99051k923813n620803
$$ 696635742 697309647 700004501 699148712 696494064 698359070 698354492 698155441 695231628 689610825
1518F89610825L652267L906860k414550p546997j229172K560425K394180l168640M57229
$$ 689610825 693263092 697169952 694755402 687208405 685979233 688539658 690933838 687765198 688222427
1526.6F88222427J357804k164536M82102J097793n25970j126251l131028n767822K428207
$$ 688222427 689580231 687415695 687897797 688995590 688469620 687343369 684212341 678444519 680872726
1535.3F80872726K119065J667480L165207m119339j1241455L177872J960602J90963
$$ 680872726 682991791 684659271 687824478 683705139 672463684 675641556 677602158 677793121
1543F77793121K398377l38288k611236K453995J142807J380996j235962l213501K574845
$$ 677793121 680191498 679853210 677241974 679695969 680838776 682219772 680983810 677770309 680345154
1551.7F80345154K104263J287232m036484P83920M745331K719498n950470j2384644
$$ 680345154 682449417 683736649 679700165 680484085 685229416 687948914 681998444 669613800
1559.4F69613800M937897O286850L901138K030182J186066j381913N9739K636795K236023
$$ 669613800 674551697 680838547 684739685 686769867 687955933 686574020 686633759 689270554 691506577
1568.1F91506577R40246p707214J153259K285233O408R07135J528626j00174j0522843
$$ 691506577 692446823 684739609 685892868 688178101 688184509 689091644 690620270 690520096 679997253
1576.8F79997253K589493K391205K94876K58484r72748j9836j335297j563492j448135
$$ 679997253 682586746 684977951 685272827 685531311 684558563 684538727 683203430 681639938 680191803
1585.5F80191803j057663p41882j683350r70077j684647n84641j282806q69980j075668
$$ 680191803 679134140 678392258 676708908 675738831 674054184 673469543 672186737 671316757 670241089
1594.1F70241089k315903r04465k017059j300125j929474j060562j344070j759110
$$ 670241089 667925186 667020721 665003662 663703537 661774063 660713501 659369431 657610321
1601.9F57610321j218796k593002k93808j037827j342773k471542j594468j808166
$$ 657610321 656391525 653798523 653504715 652466888 651124115 648652573 647058105 645249939
1609.6F45249939k900543k14615k307587j179771j331024Q86612J78108j2537041K359352
$$ 645249939 642349396 642134781 639827194 638647423 637316399 638203011 638381119 625844078 628203430
1618.2F28203430L36456j54914j096306K27318j151429p434425R27658N17807Q49648
$$ 628203430 628539886 628384972 627288666 627515984 626364555 618930130 619857788 620375595 621225243
1626.9F21225243l542748k644043J95961j237182l06054j060943J309547J181908p523956
$$ 621225243 617682495 615038452 615234413 613997231 613691177 612630234 613939781 615121689 607597733
1635.6F07597733k709160J387405L92952O03256O59409p95365R05838q45642J395684
$$ 607597733 604888573 606275978 606668930 607272186 607931595 607136230 608042068 607196426 608592110
1644.3F08592110K462616l197327j604347l101998K955628K462463L013039L810768
$$ 608592110 611054726 607857399 606253052 603151054 606106682 608569145 611582184 615392952
1652F15392952m703674r642220L743858M955864J888733J233597J138497J283187J464157
$$ 615392952 610689278 601047058 604790916 609746780 611635513 612869110 614007607 615290794 616754951
1660.7F16754951J805115N00450k450981L086472K143860J243629K063141J496048
$$ 616754951 618560066 619060516 616609535 619696007 621839867 623083496 625146637 626642685
1668.4F26642685k776299m2457M371910O68793L183784L879509j283913j842536L345146
$$ 626642685 623866386 623823929 628195839 628864632 632048416 635927925 634644012 632801476 636146622
1677.1F36146622L414154J667557J153030o32935L721695N453263j687851p061768
$$ 636146622 639560776 641228333 642381363 641748428 645470123 650923386 649235535 642173767
1684.8F42173767L445435O773758L463440J075820K188187Q9874K397995K490693K168502
$$ 642173767 645619202 652392960 655856400 656932220 659120407 659210281 661608276 664098969 666267471
1693.5F66267471M013443L145447o641922L180924O748657O579895j511841r446716
$$ 666267471 670280914 673426361 666784439 669965363 676714020 683293915 681782074 672335358
1701.2F72335358R484634N980911K350540O69480J383896J17569K261581M452515J591034
$$ 672335358 681819992 687800903 690151443 690820923 692204819 692322388 694583969 699036484 700627518
1709.9G00627518O31942K738114K351990K263717j348266q83103M298630l3340q533860
$$ 700627518 701259460 703997574 706349564 708613281 707265015 706381912 710680542 710647202 702113342
1718.5G02113342N240784M800110K147598J386109K31933K95639J715546J284256Q37326
$$ 702113342 707354126 712154236 714301834 715687943 715919876 716215515 717931061 719215317 720052643
1727.2G20052643J204986J778183k169189j384583L915406K910232o876526r308853
$$ 720052643 721257629 723035812 720866623 719482040 723397446 726307678 719431152 710122299
1734.9G10122299P993851N272140J597367K420273k175599k819595M733811K383804
$$ 710122299 718116150 723388290 724985657 727405930 725230331 722410736 727144547 729528351
1742.7G29528351k696304l43628K920837J669388Q59070Q6364j23367L919144j333237
$$ 729528351 726832047 726488419 729409256 731078644 731937714 732024078 731900711 735819855 734486618
1751.3G34486618j751862M990235K482376K103424K179031l127899M07868K092056
$$ 734486618 732734756 737724991 740207367 742310791 744489822 741361923 741769791 743861847
1759G43861847J756363K479553m152603j041718L931504J914444R51004J699752P27540
$$ 743861847 745618210 748097763 743945160 742903442 746834946 748749390 749700394 751400146 752127686
1767.7G52127686m034272J417008L590545r82208o007995j683732N305558K386627
$$ 752127686 748093414 749510422 753100967 752118759 746110764 744427032 749732590 752119217
1775.4G52119217j145020J555176Q29926J361541M1962k309646R84039J596145M35563
$$ 752119217 750974197 752529373 753359299 754720840 754762802 752453156 753437195 755033340 755468903
1784.1G55468903j997757p15027J902389Q58231P86972J551742l29666r82971l429565
$$ 755468903 753471146 752756119 754658508 755516739 756303711 757855453 757525787 756542816 753113251
1792.8G53113251k1439L920059J86539j963577J466980K073517q66700j651992J613235
$$ 753113251 753091812 757011871 757198410 755234833 756701813 758775330 757908630 756256638 757869873
1801.5G57869873n08881o4544J379318m654N18189K42691n32456J120911Q91266k457734
$$ 757869873 757360992 757296448 758675766 758671112 759189301 759431992 758899536 760020447 760911713 758453979
1811.1G58453979o62689R17816M90265P74002Q2474M41742k94647K6398Q21304j0834
$$ 758453979 757791290 758709106 759199371 759973373 760055847 760497589 760202942 760229340 761050644 761039810
1820.8G61039810L04947r23996O03333J243515l703385J08185K698135J938019p45392
$$ 761039810 761344757 760420761 761024094 762267609 758564224 758672409 761370544 763308563 762563171
1829.4G62563171n091629J953659K559739j85318J74942J96609K22015o67419r79767
$$ 762563171 757471542 759425201 761984940 761799622 761974564 762171173 762393188 761725769 760746002
1838.1G60746002N28794J68228Q18176M47845J288605K6779o372833K569504L105926
$$ 760746002 761274796 761443024 762261200 762709045 763997650 764024429 757651596 760221100 763327026
1846.8G63327026q10547r31549O24772M36706j79977K86255J12762J07117l98712j25580
$$ 763327026 762516479 761584930 762209702 762646408 762466431 762752686 762865448 762972565 762573853 762448273
1856.4G62448273N23147L0442K87246j14059j45722k75268J38397L12042j06582M03671
$$ 762448273 762971420 763001862 763289108 763175049 763029327 762754059 762892456 763204498 763097916 763501587
1866.1G63501587j58157M9820k185746k054214K109833J711425M84162r7122j25504
$$ 763501587 763343430 763393250 761207504 759153290 761263123 762974548 763458710 763361588 763236084
1874.8G63236084k43073j13143k03248j46865L7841l15704K39792K38037M77066N4245
$$ 763236084 762993011 762879868 762676620 762529755 762567596 762251892 762491684 762729721 763206787 763261032
1884.4G63261032l19290K33536Q5220J333008m76685l379364O28510J417160K05459
$$ 763261032 762941742 763175278 763260498 764593506 764116821 760737457 761365967 762783127 762988586
1893.1G62988586M18778q49762j448593P83310O94198J62735J56327k11945j38245
$$ 762988586 763407364 762557602 761109009 761892319 762586517 762749252 762905579 762693634 762555389
1901.8G62555389k32544q7356o75278n20935O51856M96673l29208k77024l71398J0910
$$ 762555389 762322845 762235489 761560211 761039276 761691132 762187805 761858597 761581573 761210175 761221085
1911.4G61221085Q15048j72806P6065j09558K08054J437378l184052j830521J896363
$$ 761221085 762036133 761863327 761939392 761829834 762037888 763475266 760291214 758460693 760357056
1920.1G60357056J061248O36445j668549j142883J093597N49164k20719j55258J44730
$$ 760357056 761418304 762054749 760386200 759243317 760336914 760886078 760665359 760510101 760654831
1928.8G60654831J66931j26114m29077j02386l39966k75650q240J97372K77024k35977
$$ 760654831 760821762 760695648 760266571 760164185 759824219 759548569 759540329 759737701 760014725 759778748
1938.4G59778748J42669J38245P54852p60956l050155R51385J139679n42145q6059
$$ 759778748 759921417 760059662 760814514 760053558 757003403 757954788 759094467 758552322 758466263
1947.1G58466263M62417K34452m83856K7236K26288k94876j19781J61209r9793l46908
$$ 758466263 758928680 759163132 758679276 758706512 758932800 758637924 758518143 758679352 758579559 758232651
1956.7G58232651k70462m18473j60369p6066k58483L3798K78244K71759M60815K48795
$$ 758232651 757962189 757543716 757383347 757307281 757048798 757082596 757360840 757632599 758093414 758342209
1966.4G58342209j126404q32138M79813K41012l20434m18396j17722K30789P3853k12479
$$ 758342209 757215805 756383667 756863480 757104492 756784058 756365662 756247940 756478729 756552582 756340103
1976G56340103N4703M2953k32162k7695M2267k18506o30493l59497o5994l88794K2964
$$ 756340103 756394806 756437759 756205597 756177902 756220169 756001663 755371170 755011673 754945679 754556885 754579849
1986.6G54579849J10321o55136m7684J288453K53372j824341m50516N72510P4844j52282
$$ 754579849 754690170 754035034 753987350 755275803 755529175 753704834 753254318 753826828 753901672 753749390
1996.3G53749390m97361m77752j39084k3728r0255j95618k4033k0599K2125K59934
$$ 753749390 753252029 752774277 752635193 752611465 752521210 752325592 752301559 752280960 752303085 752563019
2005.9G52563019k0447j86081j31531n96237m51279J06888k39944n01099j22299M90112
$$ 752563019 752542572 752356491 752224960 751628723 751177444 751284332 751044388 750543289 750420990 750911102
2015.6G50911102R2469r38645k25448L04794J67847J60751l17917l39127k05154m10614
$$ 750911102 751003571 750064926 749839478 750144272 750312119 750472870 750154953 749815826 749610672 749200058
2025.2G49200058m54788k66342n8823L2883J46484R1629J23825J74866l08762o76803
$$ 749200058 748745270 748478928 748420105 748452988 748599472 748691101 748814926 748989792 748681030 748004227
2034.9G48004227k93351n4473k06528k80533j33209n1575n89523r9335N38635J54724
$$ 748004227 747710876 747656403 747449875 747169342 747036133 746984558 746395035 746295700 746834335 746989059
2044.5G46989059Q5984l81317m70810j57624k91519k69623l30810J1139J84479r385
$$ 746989059 747075043 746693726 746222916 746065292 745773773 745504150 745173340 745184479 745368958 745359573
2054.1G45359573j79596l31878j26419M3792J52283m4021m08555n53207o00052l44772
$$ 745359573 745179977 744848099 744721680 744765472 744917755 744873734 744465179 743911972 743311920 742967148
2063.8G42967148p9346l66516l75977J44349J82266K54211J27869l43781j93176j43204
$$ 742967148 742887802 742521286 742145309 742289658 742471924 742726135 742854004 742510223 742317047 742173843
2073.4G42173843n64727p40509l17688l8681k05002l37067j2970K88391L4638J38015
$$ 742173843 741609116 740868607 740550919 740512238 740307236 739970169 739957199 740245590 740280228 740418243
2083.1G40418243J21308l40882m05120K517J8006n21698n38330m21143o3553J09406
$$ 740418243 740539551 740198669 739793549 739796066 739814072 739292374 738754044 738332901 738269348 738378754
2092.7G38378754j55564J69220L41416K88086J84478K4720J3580l11432m88129k16827
$$ 738378754 738223190 738392410 738733826 739021912 739206390 739231110 739244690 738933258 738445129 738228302
2102.4G38228302j61285j25046o3248j89590K67639J62887J9150L86048r6131o5689
$$ 738228302 738067017 737941971 737878723 737689133 737956772 738119659 738138809 738524857 738428726 738363037
2112G38363037k06070k71301Q6975l44696k36130r308K28043J73340l29972n6610L53241
$$ 738363037 738156967 737885666 737972641 737627945 737391815 737382507 737610550 737783890 737453918 737397308 737750549
2122.6G37750549R3537m09622k11564q8729j15738n2338k78549k54059k66953M6692
$$ 737750549 737844086 737434464 737222900 737134171 737018433 736966095 736687546 736433487 736166534 736213226
2132.3G36213226M47922J70441l12729l33634R7962O8817j91650J34430K92587k71225
$$ 736213226 736661148 736831589 736518860 736185226 736283188 736352005 736160355 736294785 736587372 736316147
2141.9G36316147l07007k7924j71127l12805j5335N63125L44391O714j30386k89993
$$ 736316147 736009140 735981216 735810089 735497284 735481949 736045074 736389465 736396179 736265793 735975800
2151.5G35975800l28598j63727K38647k34375k36511K86560K01798J17492n0201q6975
$$ 735975800 735647202 735483475 735722122 735487747 735251236 735537796 735739594 735857086 735806885 735719910
2161.2G35719910j57929K56272K71759l98255l92303l05252j31455j09329Q1100M36783
$$ 735719910 735561981 735818253 736090012 735691757 735299454 734994202 734862747 734753418 734834518 735271301
2170.8G35271301N5695l27149q5067J04522j52816P019K3880k40860k07215j39541
$$ 735271301 735326996 734999847 734914780 735019302 734866486 734873505 734897385 734656525 734449310 734309769
2180.5G34309769l5858k06757j08566K08664Q5525j09482M8600J19247O5079K86407
$$ 734309769 734273911 734067154 733958588 734167252 734252777 734143295 734191895 734311142 734376221 734662628
2190.1G34662628N6381k14767j05057j79977j73798J58158J21383R6359L05558j81198
$$ 734662628 734719009 734504242 734399185 734219208 734045410 734203568 734324951 734421310 734726868 734545670
2199.8G34545670r3079J03226r5826R385j54801q9111l38516L6163O20728l7995j12076
$$ 734545670 734452591 734555817 734459991 734469376 734314575 734225464 733886948 733923111 734543839 734505844 734393768
2210.4G34393768J29929j04141j30005N3100m04586m13742L22799K55280o0959k24228
$$ 734393768 734523697 734419556 734289551 734342651 733938065 733524323 733847122 734102402 734041443 733817215
2220G33817215m58j5259o6757J59989j22452q8654j65405n29480l96118K07367J52740
$$ 733817215 733816757 733801498 733734741 733894730 733772278 733683624 733518219 732988739 732592621 732799988 732952728
2230.6G32952728k18963J89209J33590k12021k26593j07879r7504Q5449K53296o9809
$$ 732952728 732733765 732922974 733056564 732844543 732617950 732510071 732412567 732498016 732751312 732681503
2240.3G32681503k83508n07965j92337N7831k4948K670J53427M91180q4610l42712
$$ 732681503 732397995 731890030 731697693 731755524 731730576 731733246 731886673 732377853 732293243 731950531
2249.9G31950531j06812P7897L9520m98352n11856k74582K14996k9754k56348M5166
$$ 731950531 731843719 731921616 731961136 731462784 730950928 730676346 730891342 730861588 730605240 730650406
2259.5G30650406m120K46201J40075Q6441j88446j22223j14364o23246J19858L6011
$$ 730650406 730646286 730892487 731032562 731119003 730930557 730808334 730693970 730070724 730190582 730226593
2269.2G30226593l27835J05743j12610L663N39398J0834l71399R5214k13928j81656
$$ 730226593 729898758 730004501 729891891 729895554 730434952 730445786 730074387 730169601 729955673 729774017
2278.8G29774017j79977k50397O1951j8234J29013r9259N8518R9411j60828l29132
$$ 729774017 729594040 729343643 729405594 729387360 729516373 729417114 729475632 729575043 729414215 729085083
2288.5G29085083k86560K20642l48053n5313O5079j82953N798n04608n5771L2654K35290
$$ 729085083 728798523 729019165 728671112 728615799 728680878 728497925 728503723 727999115 727943344 727975998 728211288
2299.1G28211288M3030l88870k2202M8752L53699m83551m58679l83682n76630Q8959
$$ 728211288 728254318 727865448 727843246 727891998 728245697 727762146 727303467 726919785 726343155 726432114
2308.7G26432114k04010J0528o43921J12152R09424j62735l05n29480n90897q05892
$$ 726432114 726228104 726238632 725594711 725706863 726616287 726453552 726453247 725923767 725332870 724526978
2318.4G24526978l10898M39071p03659o42929j80282K05383j07346l30047l52478r9640
$$ 724526978 724216080 724655151 723951492 723308563 723128281 723333664 723226318 722896271 722543793 722444153
2328G22444153L65906n02778q40835o14319L39737J41373M76761O93740q67462N70984
$$ 722444153 722810059 722307281 721466446 720852127 721191864 721333237 721809998 722503738 721636276 722207260
2337.7G22207260Q25272j004868j173858L51333M89273j165695o72073M8065P21817
$$ 722207260 723032532 722027664 720853806 721205139 721694412 720528717 719856644 719904709 720626526
2346.3G20626526N30624J061936K306060R69773r99603j051484o81152n97839j281586
$$ 720626526 721157150 722219086 724525146 725494919 724495316 723443832 722762680 722164841 720883255
2355G20883255j127930p39288p27844m68064n45501K87094J160049k18200p28608O74286
$$ 720883255 719755325 719016037 718288193 717820129 717274628 717561722 718721771 718503571 717774963 718449249
2364.7G18449249J159973K04850o02417n1499O11573M86907j84936L27530P51037J4267
$$ 718449249 719609222 719814072 719211655 719160156 719771729 720258636 720073700 720401230 721152267 721166534
2374.3G21166534N76172J079865N82504O9656O3172L87268q1406l58963K98004N96314
$$ 721166534 721742706 722822571 723405075 723474731 723537903 723925171 723843765 723484802 723782806 724379120
2383.9G24379120J46484N3559M57458M18778P8125q5755j53427l02658k99606j35041
$$ 724379120 724525604 724579163 725036621 725455399 725533524 725447769 725294342 724991684 724692078 724557037
2393.6G24557037q1024O0120N3482r5520Q2931K2660l49655J3198M15192k06223o49032
$$ 724557037 724476013 724536133 724589615 724494095 724577026 724599686 724250031 724263229 724678421 724472198 723823166
2404.2G23823166j62811Q3160k72217k63824O3934r079l69186j47705L97491K30866
$$ 723823166 723660355 723743515 723471298 723207474 723271408 723262329 722893143 722745438 723142929 723373795
2413.8G23373795j46866l20969j48010J74637r7580m22974k67410r1858k12174l3340
$$ 723373795 723226929 722905960 722757950 722932587 722835007 722412033 722144623 722052765 721840591 721807251
2423.5G21807251J23138k13546k07215P553K13242m3411o31028l31115R2163m8599
$$ 721807251 721930389 721716843 721509628 721517181 721730423 721687012 721055984 720724869 720817032 720768433
2433.1G20768433l75595n49241r3917L14483M6005j34277P5150O637k74505q7357J67313
$$ 720768433 720392838 719843597 719749680 720064163 720110168 719975891 720051041 720057678 719783173 719695816 719863129
2443.7G19863129o5842l44925m79584m28161k52457K747K22320j34506l05252Q8959
$$ 719863129 719797287 719452362 718972778 718544617 718292160 718294907 718517227 718382721 718077469 718166428
2453.4G18166428J94854l8147l08838m86526m53186J2741J40991l51410k59170K06222
$$ 718166428 718361282 718323135 718014297 717527771 717074585 717087326 717228317 716876907 716617737 716823959
2463G16823959K45514M1962p4234o1264p0801k46124m78363n32456k46124J23520m2572
$$ 716823959 717069473 717111435 717037201 716975937 716905136 716659012 716180649 715648193 715402069 715525589 715483017
2473.6G15483017j61209J5335k3956O8283l2196k19040k23847l63006k55661m24042
$$ 715483017 715321808 715337143 715313187 715381470 715349274 715130234 714906387 714543381 714287720 713863678
2483.3G13863678n91660j22680m3564J08032L01590k1515p0038k71072j03073J25732
$$ 713863678 713272018 713149338 713105774 713213806 713515396 713493881 713423843 713152771 713049698 713175430
2492.9G13175430m85382l60794k65884m94690p9117n4321j11008J41907L11203O1950
$$ 713175430 712690048 712329254 712063370 711568680 711489563 711435242 711324234 711466141 711777344 711839294
2502.6G11839294l90396k32696k57035n24749k35367P4005J16882j85165l40500N646
$$ 711839294 711448898 711216202 710959167 710434418 710199051 710273056 710389938 710204773 709864273 709869919
2512.2G09869919l0747l2043K23465k8000k59552l00751k58560m3640k99912o33316
$$ 709869919 709839172 709807129 710030594 710002594 709743042 709442291 709183731 709140091 708840179 708206863
2521.9G08206863k09884m5243j82113J82495J31226l9979m653j61210j25961k47803
$$ 708206863 707996979 707951736 707769623 707952118 708083344 708043365 708038712 707877502 707751541 707503738
2531.5G07503738k06298O9656k14691n40543j66244j602l19596N0049L54996K14004
$$ 707503738 707297440 707367096 707152405 706611862 706445618 706444016 706124420 706174469 706529465 706743469
2541.1G06743469M58m32434k61536R0180j95923n55878l60641j28403j38245L8834
$$ 706743469 706743927 706311493 706049957 706140137 705944214 705388336 705027695 704899292 704761047 704799881
2550.8G04799881n3711M5853L68194j25503m67453k20261j50604o0578k37960l52478
$$ 704799881 704746170 704792023 705160217 705034714 704567261 704347000 704196396 704135818 703897858 703545380
2560.4G03545380k71988n45426j74408K74048M46015L25241m28772j45340K29187j45416
$$ 703545380 703273392 702727966 702553558 702827606 703273621 703598862 703170090 703024750 703253937 703108521
2570.1G03108521k36969k25754n29175n83649j6556j29852J97067M63181l79486k52304
$$ 703108521 702871552 702645798 702116623 701532974 701516418 701386566 701583633 702046814 701667328 701415024
2579.7G01415024o8512q0490p7668m15039n25283l35770J14212n7068k19879j10855
$$ 701415024 701346512 701266022 701188354 700773315 700248032 699912262 700026474 699969406 699749527 699638672
2589.4F99638672O4163m58n36575k37961k4643j63345n3406o4545n88989r17587O7444
$$ 699638672 699702835 699702377 699165802 698927841 698903198 698739853 698686447 698621902 698032913 697115326 697182770
2600F97182770M08554j10245n33371m80423J86234R3765M3259L0365l93296m42123
$$ 697182770 697591324 697481079 696947708 696467285 696653519 696747284 696790543 696820908 696427612 695985489
2609.6F95985489k02942J4572j30005k49557n10330l26386R7427j97067q4534q2855
$$ 695985489 695782547 695797119 695667114 695417557 694907227 694580841 694678268 694481201 694396667 694313812
2619.3F94313812k85339j28479j44196k84500m77752l44162l05710l56064k01035Q5526
$$ 694313812 694028473 693899994 693755798 693471298 692993546 692649384 692343674 691987610 691786575 691872101
2628.9F91872101L31039k08359k45590r8114l76205o8817l61710m00085q5221l90930
$$ 691872101 692203140 691994781 691749191 691651077 691274872 691206055 690844345 690444260 690359039 689968109
2638.5F89968109l52020l91846j00784M7150j87607J27792K30560K78931l84064j014251
$$ 689968109 689616089 689224243 689123459 689170609 688983002 689110794 689341354 689620285 689236221 688221970
2648.2F88221970k64435m8294l07770m46014n68772k44827l13873j50605L76130K31552
$$ 688221970 687957535 687909241 687601471 687155457 686586685 686341858 686027985 685877380 686253510 686485062
2657.8F86485062J49688k07672n67627n15060o61926j05286P3242m22058k37732q9493
$$ 686485062 686634750 686427078 685859451 685344391 684682465 684577179 684650421 684228363 683990631 683901138
2667.5F83901138j07727j90277j62124J75781L46908Q1330k53296n02396p24411l33099
$$ 683901138 683793411 683603134 683441010 683616791 683963699 684045029 683791733 683289337 682564926 682231827
2677.1F82231827j76316k39410m9515j04599o8588j76620J0757J3046l59878l83148
$$ 682231827 682055511 681816101 681766586 681661987 681593399 681416779 681427536 681440582 681080704 680697556
2686.8F80697556n69840m01306j80206j0987n6076n27191m42123j25275L81012K77634
$$ 680697556 680127716 679726410 679546204 679535217 679479141 678951950 678509827 678384552 678765564 679043198
2696.4F79043198j58921K747m11453n59845j71128k17666n05142p86667l65067K25296
$$ 679043198 678884277 678887024 678475571 677915726 677744598 677526932 677021790 676235123 675870056 676095352
2706F76095352K05307m9667k52075q0567n9585l09372k94342l26691l05786j95389
$$ 676095352 676300659 676250992 675998917 675918350 675858765 675549393 675255051 674928360 674622574 674427185
2715.7F74427185p4387j59606n11857j72805K89230r2926k83051N5390j3886j16501
$$ 674427185 674352798 674193192 673681335 673508530 673797760 673704834 673421783 673477173 673463287 673346786
2725.3F73346786k23083p06711p52563n19791k40021j94778j77536J46866l7690j19628
$$ 673346786 673123703 672416992 671664429 671144638 670904617 670709839 670532303 670679169 670641479 670521851
2735F70521851m1657m6997k10266n75562k72979n7373k61002l77350l57208l27530
$$ 670521851 670480194 670433197 670222931 669647369 669374390 669317017 669056015 668678665 668321457 667993927
2744.6F67993927l1738K99759k38953l34702L9368j2817n8594k86407m29917n02777
$$ 667993927 667962189 668261948 668022995 667688293 667727661 667714844 667656250 667369843 666939926 666437149
2754.3F66437149m71573J6709J63345o12412q54568j06278L33863K31399k68478k86560
$$ 666437149 665965576 665982285 666145630 665533218 664678650 664572372 664906235 665137634 664869156 664582596
2763.9F64582596j23444m21295l89175m74625n75867j30310K00730j6785l17993n54962
$$ 664582596 664459152 664037857 663648682 663174057 662598190 662467880 662668610 662651825 662333832 661778870
2773.5F61778870k86332L63999N7068l09983n19409j011276p85904k85263j51062k93121
$$ 661778870 661492538 661856537 661913605 661603622 661084213 660072937 659287033 659001770 658850708 658557587
2783.2F58557587j61591j53046m74014J09711N92041j450o30798o44608j90124l88413
$$ 658557587 658395996 658242950 657768936 657878647 658470688 658469238 657838440 657193832 657003708 656615295
2792.8F56615295q17642n97000m60892j21307o5079j36413m4709o10733m47998l91922
$$ 656615295 655797653 655200653 654739761 654618454 654553375 654416962 654372253 653761520 653313522 652921600
2802.5F52921600o01272n7297k48032p33795p03659L2501L39203l81469q86689q00247
$$ 652921600 652320328 652263031 652014999 651281204 650577545 650610046 650949249 650567780 649681091 648880844
2812.1F48880844k35596j00936j29014j75170k82364l77884o87638o78558o63147m15192
$$ 648880844 648645248 648544312 648415298 648240128 647957764 647579880 646892242 646213684 645550537 645135345
2821.8F45135345l76129l14102k00271m77677r7046j67618o53762p55387k96020l2807
$$ 645135345 644759216 644445114 644244843 643767166 643670120 643502502 642848740 642093353 641797333 641764526
2831.4F41764526o68182q13904o02646k49061m85459o66961l85018o58035o44798j036530
$$ 641764526 641096344 640282440 639679794 639430733 638945274 638278313 637893295 637235260 636590462 635553932
2841.1F35553932j154709r45396j023178q72421j218262j437988j430703j257400j301804
$$ 635553932 634399223 633453827 632430649 631558228 630339966 628901978 627471275 626213875 624912071
2849.7F24912071j114845m18167l46222n08194o44379J18294Q0147q51021l38860j88522
$$ 624912071 623797226 623379059 623032837 622524643 621880264 621998558 622078705 621227684 620888824 620700302
2859.4F20700302k91519Q0070j06468l31192l37562m95949k88086j57661n68734r17968
$$ 620700302 620408783 620488853 620382385 620051193 619713631 619217682 618929596 618771935 618203201 617285233
2869F17285233j197663o28052N1003j52969p68319j179237n52177R651J20773M0856
$$ 617285233 616087570 615459518 615510521 615357552 614589233 613409996 612857819 612867470 612988243 613029099
2878.7F13029099k15416l93715o51932n08385j91765j60255m77905n85785n71480q65860
$$ 613029099 612813683 612419968 611768036 611259651 611067886 610907631 610429726 609843941 609272461 608406601
2888.3F08406601o39877k55051k29950k19460m38117q71850p45773o05812o35872l55339
$$ 608406601 607766724 607511673 607281723 607062263 606624146 605752296 605006523 604400711 603764839 603409500
2897.9F03409500o30188p55730o36749p35435k95410J10435p0915l72124n25246l96957
$$ 603409500 602779312 602023582 601386833 600651398 600355988 600466423 600395508 600023384 599498138 599101181
2907.6E99101181J3771m52576p97500l34702o01234q86498r16023n60760l13034n02282
$$ 599101181 599114952 598662376 597864876 597530174 596928940 596042442 595126419 594565659 594252625 593750343
2917.2E93750343k67830m79660q53080r43795n57861r7618m89426n60684p0228J70707
$$ 593750343 593482513 593002853 592149773 591205978 590648117 590550499 590061073 589500389 589430161 589600868
2926.9E89600868K48070K66724J85203J18065r3117j81541k82707k10724L27110L12576
$$ 589600868 589848938 590115662 590300865 590418930 590325813 590144272 589861565 589650841 589977951 590290527
2936.5E90290527J58692L57857L78417O8398L76549O76613P3051j7204k26708q7433
$$ 590290527 590449219 590807076 591185493 591253891 591630440 592307053 592380104 592362900 592136192 592048759
2946.2E92048759K94304l25775m94461j97182K7466r6245l15780n84374o62384k89344
$$ 592048759 592343063 592017288 591522827 591325645 591353111 591256866 590941086 590356712 589694328 589404984
2955.8E89404984k07406J31836K01683j90925o60477n70373J52893M59366M99458K250
$$ 589404984 589197578 589329414 589531097 589340172 588679695 588109322 588262215 588721581 589221039 589223289
2965.5E89223289J61324M82101J96534N30204N73006L31345J30005K71453P10030N90706
$$ 589223289 589384613 589866714 590063248 590593452 591166458 591497803 591627808 591899261 592609291 593199997
2975.1E93199997J59454p171M22477Q22602P04536L55835K31819K02065K07367L51486
$$ 593199997 593359451 593352280 593774757 594597359 595301895 595657730 595889549 596091614 596298981 596650467
2984.7E96650467L83034K55508L1319J51214L36266M97017M77485J33210j58844k25830
$$ 596650467 597033501 597289009 597320328 597471542 597807808 598304825 598782310 598915520 598756676 598530846
2994.4E98530846L01704K81906n5618O0387j63651m81415k98843L84674K66304n22232
$$ 598530846 598832550 599114456 599058838 599119225 598955574 598474159 598175316 598559990 598826294 598304062
3004E98304062j73149O57730O7444n89104n9319p2631k82135p3510l98826q38509j09405
$$ 598304062 598130913 598788643 598856087 598266983 598207664 598135033 597852898 597779388 597380562 596542053 596432648
3014.6E96432648L62510k05879n6228l06397n89065l60871n22232m35905j72310J53007
$$ 596432648 596795158 596589279 596533051 596226654 595637589 595276718 594754486 594318581 594146271 594299278
3024.3E94299278j25847m71077p22007n69496J34544k08321n39016l74566n874k11716
$$ 594299278 594173431 593702354 592980347 592410851 592545395 592337074 591798058 591423492 591417618 591205902
3033.9E91205902n29671k34871n63316k53754l67851r66644l61061k45400o68029m39797
$$ 591205902 590676231 590441360 589878044 589624290 589256439 588289795 587928734 587683334 587015305 586575508
3043.6E86575508Q4343j37634m91867n72129n95970m66003m15001k26784m21600q49228
$$ 586575508 586659851 586522217 586030350 585458221 584862251 584396248 583981247 583754463 583332863 582483635
3053.2E82483635o74782J67961J54534p02324l61481p5569n81055p87773m48303j61705
$$ 582483635 581808853 581976814 582131348 581429024 581067543 580991974 580410919 579623146 579174843 579013138
3062.9E79013138l79791n49965r7504J52016n73883p18804l55186l53050m07525o54220
$$ 579013138 578633347 578083382 577985878 578137894 577564011 576845207 576490021 576136971 575729446 575075226
3072.5E75075226o35910m08478l0594M29726K37808o08482j095696p13386O218Q4953
$$ 575075226 574439316 574030838 574000244 574429970 574667778 574059296 572963600 572250214 572256432 572341385
3082.1E72341385o32324r81217o82258j5450J2436k93617k98729o44531n16892l82156
$$ 572341385 571709061 570727844 570045586 570030136 570042572 569748955 569450226 568805695 568288803 567906647
3091.8E67906647m40369n17807m29344m81033q39539J12534J20010n14221k09427l21541
$$ 567906647 567466278 566948471 566519127 566038094 565198555 565311089 565431099 564916878 564707451 564385910
3101.4E64385910n15671p32879n25017k86408j42860k12555m90532l26424o45179p06673
$$ 564385910 563870239 563137360 562612343 562325935 562183075 561970520 561479988 561153564 560508385 559801712
3111.1E59801712m00124j94854l40691p13043n86128m13895j57852l98903p63855l30238
$$ 559801712 559401588 559206734 558866043 558153000 557566872 557152977 556995125 556596222 555832367 555502129
3120.7E55502129k09580j047630q57353J52893l65181o58074l72162l07998j15509
$$ 555502129 555292549 554244919 553387566 553540459 553175278 552517204 552145042 551837044 551721535
3129.4E51721535m42963n55267o31142j315460j013909J94741J3618p88421o52237
$$ 551721535 551278572 550723305 550092163 548776703 547762794 547957535 547971153 547182732 546530495
3138.1E46530495n5619l3187o77948o36559n32837o54526p31163r41314r16901m12140
$$ 546530495 546474876 546441689 545763741 545127182 544594345 543939819 543208656 542267342 541350441 540938301
3147.7E40938301O2637k62947k61230l38555k85911n55267j065484m06913r61609q73451
$$ 540938301 541000938 540737991 540476761 540138206 539852295 539297028 538231544 537824631 536863022 535989571
3157.4E35989571j16272o02303n24139l43552m26178o07147m28200n21545k81144j86042
$$ 535989571 535873299 535270996 534746857 534403305 533977127 533369980 532941780 532420235 532139091 531953049
3167E31953049r61266o31599l78952l73612m24690m19350n57098o20651m63562r77478
$$ 531953049 530991783 530360184 529981232 529607620 529182930 528763580 528206482 527585831 527122269 526144791
3176.6E26144791l72467k38419n65262p04193p24525j48049o32477l72467n20172p14187
$$ 526144791 525772324 525533905 524968643 524264450 523539925 523391876 522759399 522386932 521866760 521152573
3186.3E21152573m00505q67997o21605p23228l88412k46583n49430k29149j79329l50228
$$ 521152573 520752068 519884071 519262466 518539238 518150826 517904243 517354813 517125664 516946335 516596107
3195.9E16596107m11949l23524q38814m85077l54004o03637l12539o78749n69267n75485
$$ 516596107 516184158 515860634 515021820 514536743 514182739 513579102 513266563 512587814 512018547 511443062
3205.6E11443062k42195m05197r58024k25143J6861l44429n25398k84539p16094q63572
$$ 511443062 511200867 510795670 509837646 509612503 509629364 509284935 508759537 508474998 507758904 506895332
3215.2E06895332n62477o64100j25199q8386n02014p74956l91693p57676q42361K91176
$$ 506895332 506332855 505668755 505543556 505455170 504953156 504178200 503786507 503028831 502186470 502477646
3224.9E02477646k65198o12182n19753l98979k65503n46150k46964n21698o37703k83623
$$ 502477646 502212448 501600266 501080513 500681534 500416031 499869881 499622917 499101219 498463516 498179893
3234.5D98179893j60636m43459n29137m99420q22372m58184k35939j39236J80817j1139
$$ 498179893 498019257 497575798 497046661 496547241 495724869 495266685 495030746 494891510 495072327 495061188
3244.2D95061188j091347p52640N45082k64206o27060m03900p35283n95665l44162
$$ 495061188 493969841 493217201 493762283 493498077 492871017 492467117 491731834 491136169 490792007
3252.8D90792007n16700o14510k556J7739l86887o17676n21545n90019m56200L1433
$$ 490792007 490275307 489660797 489658241 489675980 489289093 488671417 488149872 487559853 487103653 487135086
3262.5D87135086l29475m09928l12881r1629j67885l05862l56789m79012M0589o27556
$$ 487135086 486805611 486395683 486082802 485991173 485823288 485517426 485160637 484681625 484722214 484094658
3272.1D84094658q06236q90694o35872K96669m55437k8152M8866o28509o09360k95105
$$ 484094658 483288422 482397728 481761856 482058525 481603088 481574936 481623802 480995293 480385933 480090828
3281.8D80090828j1864q00934q15315n39741J87301K43416o79932m06456L25089O18744
$$ 480090828 480078964 479278030 478462715 477922974 478110275 478353691 477673759 477267303 477592392 478211136
3291.4D78211136l66211n13535o46362q48007l68042p63626n27954l32489J15814k63710
$$ 478211136 477844925 477331390 476685028 475837021 475468979 474705353 474177399 473844910 473960724 473697014
3301D73697014r04198j03264j59797k40631k11945j36948l78799n98526j56288k63329
$$ 473697014 472792816 472689552 472529755 472289124 472077179 471940231 471561432 470962906 470806618 470543289
3310.7D70543289m05540r97696r32808j68724j13106k24190n41153l39279L68805l53279
$$ 470543289 470137749 469140053 468207245 468038521 467925415 467701225 467160072 466820793 467189598 466836319
3320.3D66836319j312408l34702K63710r1705q74291j058616j24245m38156l73574
$$ 466836319 465523911 465189209 465452919 465361214 464486923 463428307 463304062 462865906 462492332
3329D62492332l21159o02074K1439j58195m70162n29518k53639l31764p78504k38571
$$ 462492332 462171173 461569099 461590538 461432343 460962181 460432663 460179024 459847260 459068756 458830185
3338.7D58830185k73323q53462o25038k4300j67732n74189j56631j59912p27310m16108
$$ 458830185 458556862 457703400 457078362 457054062 456886330 456312141 456155510 455995598 455268288 454852180
3348.3D54852180j71127l23906o37893j116906m14390J64070k64664n08957l67126
$$ 454852180 454681053 454357147 453719254 452602348 452187958 452352028 452087364 451578407 451211281
3357D51211281l36762k53601M2343p39555j114960l12194O7977m06951o67382j16882
$$ 451211281 450874519 450620918 450663261 449923706 448808746 448496552 448564529 448157578 447490196 447373314
3366.6D47373314l63236m43077l94935j97640n4054o36063m07638n21774l00408n0583
$$ 447373314 447010078 446567001 446172066 445974426 445920372 445284309 444876671 444354897 444054489 444003906
3376.3D44003906j53198l24211r64432k32849j7090k8610j59798m61273o0806r58824
$$ 444003906 443850708 443526497 442562065 442329216 442312126 442283516 442123718 441662445 441601639 440642815
3385.9D40642815p40357J06812j1101k61116m24805r2010m62723n95055n0888O1493
$$ 440642815 439902458 440009270 439998169 439737053 439312248 439220238 438757515 438162460 438111572 438173065
3395.6D38173065k47993o33049l59574J36109k4567k39868J7013l39546q29544p70988
$$ 438173065 437925072 437292023 436932449 437068558 437043991 436804123 436821136 436481590 435652046 434881058
3405.2D34881058k88506K94457M97093M7035n44205j02729j26114n32990n14183n30929
$$ 434881058 434592552 434887009 435384102 435431137 434886932 434784203 434658089 434125099 433610916 433079987
3414.8D33079987l46375o0463M23012L09563K16560n722q18215p08351P4807M25834
$$ 433079987 432733612 432673149 433096161 433405724 433622284 433616562 432798347 432089996 432164803 432590637
3424.5D32590637j13182J4420M883n15290J82724L98789n99060p21131L55721O53496
$$ 432590637 432477455 432491875 432496758 431981468 432164192 432562981 431963921 431242790 431598511 432252007
3434.1D32252007j32561m97666K08626j7700n62401Q0643N30472O53572l49541n83878
$$ 432252007 432119446 431621780 431830406 431812706 431250305 431330948 431861420 432514992 432165451 431581573
3443.8D31581573j01394M34036K61574j709404M72031J478233K1667J87455M57344
$$ 431581573 431480179 431914215 432175789 430466385 430938416 432416649 432438316 432625771 433083115
3452.5D33083115M04510o65741n74989J52969N52979M06685p0649N01671k19879j18904
$$ 433083115 433487625 432821884 432246895 432399864 432952843 433359528 433288879 433790550 433570671 433451767
3462.1D33451767N1422j55144L88527O5804J39160J17340N95245M32511j40228K0065
$$ 433451767 433503189 433348045 433736572 433802376 433941536 434058876 434654121 435086632 434946404 434966469
3471.7D34966469j24054N60913Q29430L4751m40292q1520N57404J168251O03828J54419
$$ 434966469 434842415 435403328 436232758 436267509 435827217 435745697 436303101 437471352 438075180 438229599
3481.4D38229599j39275j301460M44946P67022L62663J349220N913n83725L28598R90677
$$ 438229599 438090324 436788864 437233810 438000832 438363495 439712715 439718628 439134903 439463501 440454178
3491D40454178N25932K25067K11411l86391j26800j63308M98238R42040P07397M15764
$$ 440454178 440980110 441205177 441416588 441030197 440903397 440740089 441238327 442180367 442887764 443303528
3500.7D43303528K51617R5902p47299N9433O41098N70564O29234J105843L16162q62122
$$ 443303528 443555145 443651047 442903748 442963181 443604279 444174843 444804077 445909920 446226082 445363960
3510.3D45363960Q53844O90498J36795r918J1902O07147Q8845K58483L05138J80168
$$ 445363960 446217804 446908302 447045097 447035179 447047081 447654228 447743073 448001556 448306694 448486862
3520D48486862N19066J262131N28221j170693j79481O38504P78236L80669O55823N47714
$$ 448486862 449005928 450268059 450796280 449625587 449446106 450084610 450862846 451243515 451899338 452447052
3529.6D52447052Q02498M03099m79088O80771N10864J516075J04294j705513J101418
$$ 452447052 453249550 453652649 453173561 453854332 454365196 455881271 455985565 454280052 455381470
3538.3D55381470R05952M69322Q7433N39170Q45336P08161P29904m45480N32760r62906
$$ 455381470 456287422 456756744 456844177 457383347 458228683 458936844 459666748 459221268 459754028 458791122
3547.9D58791122N72968J645088J088524Q85277k224655M87137J121559J094474J363564
$$ 458791122 459364090 461009178 462097702 462982979 460758324 461245461 462367020 463461494 464825058
3556.6D64825058k57034J405792P97844l07579j47591J887169M49257j110001L974953
$$ 464825058 464568024 465973816 466771660 466464081 466316490 468203659 468652916 467542915 471517868
3565.3D71517868r1362k895546q73527j083641L328971J753540Q17604J287041N08728
$$ 471517868 471426506 468530960 467657433 466573792 469902763 471656303 472473907 473760948 474269676
3574D74269676j18332J102028J295624n65376J837692R06105r64279Q46329J510467
$$ 474269676 474151344 475253372 476548996 475983620 477821312 478727417 477763138 478609467 480119934
3582.6D80119934M68102Q773L832131L86123m106864Q70170q67920K503014K767296
$$ 480119934 480588036 480596809 484428940 484815063 480708199 481578369 480710449 483213463 485980759
3591.3D85980759K241325N2109n13153K767486k649536J349449L136254r58977J823006
$$ 485980759 488222084 488274193 487761040 490528526 487878990 489228439 492364693 491405716 493228722
3600D93228722Q621k76909J346970R37347J333313K430916K201805k394104J988792
$$ 493228722 493237343 492960434 494307404 495244751 496578064 499008980 501210785 498816681 500805473
3608.7E00805473n93300j068191O404800j315727l229256M282914k126427K533073
$$ 500805473 500212173 499143982 505548782 504233055 501003799 505286713 503160286 505693359
3616.4E05693359M179192p22237P66068j584931r002L179779K674675J616897J309090
$$ 505693359 509872551 509150314 509916382 508331451 508322449 511502228 514176903 515793800 517102890
3625.1E17102890P69348J560898O303024j332054j2097206M229507M759484N185814
$$ 517102890 517872238 519433136 525736160 524404106 512306900 516536407 521295891 526481705
3632.8E26481705N21316j852913K446366K331047J320762l20053J387139J882820J372909
$$ 526481705 527003021 525150108 527596474 529927521 531248283 530928230 532315369 534198189 535571098
3641.5E35571098M01192j68419K578697L895111N512124k747918n382423M428215l050995
$$ 535571098 535972290 535803871 538382568 542277679 547789803 545041885 539659462 544087677 541036682
3650.1E41036682l927154J197586O633567L787270K877731M279175q281822J746826
$$ 541036682 537109528 538307114 544940681 548727951 551605682 555884857 547603035 549349861
3657.9E49349861M856796J236344J053886j56326J565933J015511J580734J438255
$$ 549349861 554206657 555443001 556496887 556340561 557906494 558922005 560502739 561940994
3665.6E61940994N98946L952293J629257k725715k523232o481514L591690R498482
$$ 561940994 562539940 566492233 568121490 565395775 562872543 556391029 559982719 569481201
3673.3E69481201J0324936j757011k5588456M549942J0008240M602776k730370K88429
$$ 569481201 579806137 578049126 552460670 557010612 567018852 571621628 568891258 569179687
3681E69179687K831498J762962J317482l61290j06888M807244O528205j1689338n543366
$$ 569179687 572011185 573774147 575091629 574730339 574623451 579430695 585958900 574269562 568726196
3689.7E68726196Q165093o933174l15209O298866P63245J411514r9983j166305R63020
$$ 568726196 576891289 569958115 569642906 575941772 576705017 578116531 578016548 576850243 577813263
3698.4E77813263K53944K686577K939491o842613l322296N435295J801453o26793Q16650
$$ 577813263 578067207 580753784 583693275 576850662 573528366 578963661 580765114 580138321 580954971
3707E80954971L132820L961564q571053L014183L766594j4128342N142823M428901
$$ 580954971 584087791 588049355 579478302 582492485 586259079 572130737 577273560 581702461
3714.8E81702461M95835P55844K676925R17397n032654J311073O414185l173752n695305
$$ 581702461 582198296 582954140 585631065 586548462 581515808 582826881 589241066 586067314 580372009
3723.4E80372009M579087J311340q41980l471527m19350M228516N61332M796639k325859
$$ 580372009 584951096 586262436 585420456 581948929 581529579 585758095 586319427 591116066 588790207
3732.1E88790207p336006R371681l45802j1263962R68208K355156m23736K717437L756752
$$ 588790207 581454201 590825882 590480080 579216118 580184326 582539482 582115746 584833183 588589935
3740.8E88589935m707107K573776J2190094r896507j8260765J0556564O526337O777038
$$ 588589935 583882828 586456604 598646698 588750191 570489426 581045990 587572327 594349365
3748.5E94349365k679481j2469330J0749550o471443q129845N754318N462723L929138
$$ 594349365 591669884 579200554 589950104 583478661 575348816 581103134 586565857 590494995
3756.2E90494995o008644J951637M444657r252320r48143M824295J671868M1427L496819
$$ 590494995 584486351 586437988 590882645 581630325 580682182 585506477 587178345 587219772 590716591
3764.9E90716591k350693n353546K975845N650063r6512j1405029J824379L383865
$$ 590716591 588365898 583012352 585988197 591638260 591541748 580136719 581961098 585344963
3772.6E85344963O99463J533356l35732P68662M24232K534409o17485r093933K324447
$$ 585344963 586044426 587577782 587242050 588010712 588434944 590969353 590351868 581257935 583582382
3781.3E83582382K500687R77402K316093l606606j505584J207351N18990J025543l98712
$$ 583582382 586083069 587060471 589376564 585769958 584264374 585471725 585990715 587016258 586617546
3790E86617546k75917O142Q42399k66456K58979L352967m448738m693680L321228M936676
$$ 586617546 586341629 586347771 587190170 586923714 587182693 590535660 586086922 581393242 584714470 589651146
3799.6E89651146N613098r266510j0688782M260025L988839N442657M166031j1764565
$$ 589651146 595264244 585997734 575308952 579568977 583557816 589000473 593166504 581401939
3807.3E81401939m141388O035691K129669l74718J219521P74650Q73833M710541k551804
$$ 581401939 577260551 583296242 585425911 585051193 586270714 587045364 587919197 592629738 590077934
3816E90077934j4717140N967064O570740L473053j404457j9663315M376259P130317
$$ 590077934 575360794 581327858 587898598 591371651 589967194 570303879 574680138 581810455
3823.7E81810455K638970L277511K48299n597954J66359K405281K969322Q38852r167099
$$ 581810455 584449425 587726936 587975235 582377281 582543640 584948921 587918243 588757095 579589996
3832.4E79589996L174134P621612o742248j128617R375878p256127n670395O915207
$$ 579589996 582764130 590385742 583643494 582514877 591890755 584634628 578964233 585879440
3840.1E85879440o870231K59971O863709l616524l887787L048783J606369L07731K260246
$$ 585879440 579009209 579269180 586132889 582516365 578628578 581677361 583283730 583591461 585851707
3848.8E85851707j229438J683998O421928p395477j94359j7557640J697693J1847763
$$ 585851707 584622269 586306267 592728195 585332718 585138359 567580719 569278412 581126175
3856.5E81126175j21460j756249K574807L028297K235565p343177m08249P592811o346664
$$ 581126175 581004715 579248466 581823273 584851570 587087135 579743958 579335709 586928520 580581856
3865.2E80581856n150643M399224N290641P298127r334870j1052742M479790O365700
$$ 580581856 575431213 579830437 585121078 592419205 583084335 572031593 576511383 582877083
3872.9E82877083K559776j1345787K045441M584770J54953K647057M748535o850777
$$ 582877083 585436859 574091072 576136513 580721283 580876236 583523293 588271828 581421051
3880.6E81421051q825111O425323J243096J675376N189591j4022026J030769N058670
$$ 581421051 572595940 579021263 580264359 581939735 587129326 573107300 574138069 579196739
3888.3E79196739K041550M098091j681671q723297J128540K805786j484566J656914
$$ 579196739 581238289 585336380 583654709 574931412 576059952 578865738 577381172 579038086
3896.1E79038086J373558K232208J658287r315986N509834J581573p296905L924103
$$ 579038086 580411644 582643852 584302139 574986153 580495987 582077560 574780655 578704758
3903.8E78704758l105431j334267P91779O58684K129898k53296K20337K85721K52647
$$ 578704758 575599327 574265060 575056839 575715523 577845421 577592125 577812462 578098183 578350830
3912.5E78350830l33710n20324J925087J775093m131699l640404M631920K71378n041199
$$ 578350830 578017120 577496796 579421883 581196976 577065277 573424873 578056793 578328171 573286972
3921.1E73286972K402000K433014J021920j674576k562676J633377R60923O43005j894073
$$ 573286972 575688972 578121986 579143906 577469330 574906654 576540031 577500954 578143959 576249886
3929.8E76249886r54171K228394l027878j076431J817398n49622M73786Q58421q81538
$$ 576249886 575295715 577524109 574496231 573419800 575237198 574687576 575161362 576019783 575138245
3938.5E75138245j76926L40042J512070R46235n443878j279983K192764J661530R15756
$$ 575138245 574961319 575301361 576813431 577759666 572315788 571035805 573228569 574890099 575805855
3947.2E75805855l565750R15374J144829k501373J903725P63168j022339j20697P49054
$$ 575805855 572240105 573155479 574300308 571798935 573702660 574465828 573443489 573322792 574071846
3955.8E74071846L36838j119118j20316k20222O17867M3220j490021N59807O00777
$$ 574071846 574408684 573289566 573169250 572949028 573566895 573610115 572120094 572679901 573280678
3964.5E73280678Q9187M53606J78223k53411j225204m41094P69730m70199n82810L46336
$$ 573280678 573369865 573823471 574001694 573748283 572523079 572081985 572851715 572381516 571798706 572145042
3974.2E72145042l0250j47896p2632k08626l56407L0861R4185l7041k36625k7809Q72726
$$ 572145042 572114792 571966896 571894264 571685638 571329231 571360092 571454277 571417236 571180611 571152802 572025528
3984.8E72025528j90926n03006k1209L013N93643m01191q21953Q3427O55060j14899
$$ 572025528 571834602 571331596 571310387 571313400 571907043 571505852 570683899 570767326 571422386 571307487
3994.4E71307487j321449r0599J192703N0660q53692J32752
$$ 571307487 569986038 569895439 571088142 571138802 570285110 570417862
4000.2E70417862
$$ 570417862
##END=$$ End of the data block
