##TITLE=$$ Begin of the data block
##JCAMP-DX=5.00 $$ ACD/SpecManager v 10.08
##SPECTROMETER/DATA SYSTEM=Varian
##DATE=18 Dec 2012 10:43:42
##DATA TYPE=INFRARED SPECTRUM
##DATA CLASS=XYDATA
##ORIGIN=
##OWNER=
##NPOINTS=3735
##FIRSTX=399.26403809
##LASTX=4000.35498047
##MAXX=4000.35498047
##MINX=399.26403809
##MAXY=74.22116852
##MINY=38.72634125
##XFACTOR=1.0000000000
##YFACTOR=0.000000100000000
##FIRSTY=65.41515350
##DELTAX=0.96440572
##XUNITS=1/CM
##YUNITS=TRANSMITTANCE
##XYDATA=(X++(Y..Y))
399.3 654151535 656706467 656543045 654189072 652668152 645871887 643427963 641437149 639688377 646573181
407.9 646573181 651970673 652010651 645805283 637570496 640632858 645000381 639263191 633784485 636001167
416.6 636001167 635777588 634515190 641230545 636388321 641045532 644650726 643177872 643455887 636283951
425.3 636283951 633470078 635595627 637024841 638822136 636387520 635543518 638046951 641557846 641346436
434 641346436 638026924 639635887 641863632 640447617 638362350 636150932 632604828 633859940 640988617
442.7 640988617 642067261 636312408 630325623 628583488 630485954 631877327 629190331 626760063
450.4 626760063 629045906 631601143 634335480 633715134 632782173 637672386 644125061 639097061 631317749
459.1 631317749 630305557 632164841 635771446 635552025 634336624 633169174 629403076 626683044 621997223
467.7 621997223 617527542 619428749 623282547 622019577 617213860 618947067 623832932 628668060
475.5 628668060 628721237 626492043 626400261 629229507 632265244 632149925 632622223 633160477 634288254
484.1 634288254 634287987 633001747 631763840 631476784 632923088 631142693 628909264 628917046 630406456 630763321
493.8 630763321 631922417 636653023 636973305 635224915 632248573 628662682 628997078 629130974 630188751
502.5 630188751 631245613 631286392 632003708 632318878 630767097 630140152 632115860 631300011 629385147
511.1 629385147 628495750 627532425 627429428 625519943 622332802 622491379 626367836 627574959 627995529
519.8 627995529 629100304 628076210 625584297 622912407 621218376 618469162 616833229 618400955
527.5 618400955 619023247 619974060 620705681 621065979 621085167 619449730 618484993 618098564 617967110 619061699
537.2 619061699 620274658 620403214 620150490 621265945 622220688 620869827 619009514 619023628 619227180
545.9 619227180 618149300 617888985 619453583 621245270 621319656 622252502 624343834 623835983 621738167
554.5 621738167 620834999 620249748 619462166 619070129 619086037 620488548 621193275 621123543 623762436 623907509
564.2 623907509 620996552 621266365 622833366 622229805 619994736 619484520 620200005 620148239 620691299
572.9 620691299 621579018 623023682 623029137 620154457 617631760 616399689 618044548 620354042 619495430
581.5 619495430 619067650 621215324 622523956 622530937 622907753 623099327 621923561 619408646 619178314
590.2 619178314 620710831 621786194 622176132 620591011 619867020 620549774 620257759 619697342 619211769
598.9 619211769 617890472 615978928 615730934 616161537 616116791 615132408 614397888 615044136 614354973 612957878
608.5 612957878 611834869 610414505 608945122 607064819 605022011 603668175 602505913 601820030 603030853
617.2 603030853 603436661 603573494 604556732 604114876 602441673 600264359 600044403 601029205 602107353
625.9 602107353 605127640 608113708 611059341 613999443 614975243 614554672 613997688 614199028 613777008
634.6 613777008 613101387 613841209 614570923 613951912 613809395 615690727 617369499 619369736 622260323
643.3 622260323 623353729 623020325 624396706 627793770 628496208 626891556 627487984 628740768 628751793
651.9 628751793 629242325 629830627 629637527 629139252 628499794 629524574 630884514 631008911 631234512
660.6 631234512 631790123 632193909 632131195 632886658 633782272 634041176 632357140 629605179 634824295
669.3 634824295 636025848 636769905 637792740 637511177 636519089 635100861 635349846 636118431 636536102
678 636536102 637302094 638220062 639327736 638931465 638533707 639067650 638728027 637642670 637339172 637403564
687.6 637403564 637150688 638160744 638889923 638522186 637537880 635490952 634384499 634103050 633201408
696.3 633201408 632322502 632485352 633313446 633405609 633048401 633121071 634567299 635900993 635139198 634477959
705.9 634477959 634521751 634376488 634971581 635865898 636520195 637460098 638416443 639512825 641307526 642651520
715.6 642651520 642430725 641570663 641545181 642365417 642757416 643496017 644848022 645468216 645984116 646889572
725.2 646889572 648205185 648976517 648497620 647655945 646563416 646176071 646338730 646535873 647581100
733.9 647581100 649160233 650068665 649617386 648760300 648861923 650134888 650851746 650163040 649634552
742.6 649634552 650590363 652200241 653237991 654657440 656103745 657312317 658807144 659841232 660366669
751.3 660366669 660450211 660994949 661997833 662715073 663682404 665617218 667757416 669898071 671547470
760 671547470 670672073 669972305 669947739 669785767 669976501 669395370 670094910 670308914 669846802 670802994
769.6 670802994 671564789 671645203 671395569 671763763 671502914 671024857 671139679 671967850 674055023 675559616
779.2 675559616 676915436 678098373 679302292 680624313 681165314 681501541 681523895 681642303 682451019
787.9 682451019 683708801 684612274 686618881 688412323 688565826 689019775 688160400 685933838 684268112
796.6 684268112 684537048 685208435 685939560 687420578 688919754 690831680 691182709 691307602 690792389
805.3 690792389 689372177 688817596 687491302 687476196 688791046 690240936 691980438 694225159 695565186
814 695565186 694954071 694797440 695094452 696009750 695209122 693540115 693360138 693469238 694567261 695778961
823.6 695778961 696347580 695519485 695162659 694579315 692846832 692211990 690797882 689391327 687767792
832.3 687767792 686456223 686025848 684824448 684200516 683265915 681868668 680789948 679087677 676374435
841 676374435 674167633 672377396 670329208 669973068 671152496 672086334 672139130 672991180 673861618 673342819
850.6 673342819 673267441 673085861 673130188 673881836 675149765 677149429 679563828 682239532 684771423
859.3 684771423 687217789 687840500 686987457 687061920 688964767 690491409 690526505 691653290 693033905
868 693033905 693947525 695200348 696609421 696316757 695365677 695829926 695851517 696161499 696296768 696007309
877.6 696007309 696356277 697023010 696974182 696391983 696624985 695135803 692558365 690400238 688944550
886.3 688944550 687962418 686582870 686072769 685903549 686789780 687810287 688410568 689418106 688989944
895 688989944 687892990 686785812 685904236 686241302 687633362 687628021 687334518 688968201 689881058 689843826
904.6 689843826 688649216 686741104 685094833 683369370 681502304 679525146 678784943 678357468 677530746
913.3 677530746 676482315 675359573 674170685 671923676 669256744 667210464 666121521 665178070 664471436
922 664471436 663971481 663196716 662648087 662219620 661737671 660335617 659094009 658735352 658383713 658573380
931.6 658573380 658599319 658263855 658526535 659983444 662023087 663728485 664987030 665643845 666444092
940.3 666444092 667087936 667658234 668830414 670571289 672622604 674593430 676528091 678082352 679520721
949 679520721 680767899 681985550 682200317 681207581 680663452 680438156 680762939 680618057 680223312 679882355
958.6 679882355 678747482 677967911 677167511 675126648 671623306 669033966 668460770 667646408 666063156
967.3 666063156 665238113 665562668 665211334 664041367 663026657 661597290 659999313 659042892 658523102
976 658523102 658106995 657625275 656880722 656102753 655739822 655562973 654271317 652197113 650416107 649068909
985.6 649068909 647925644 645899582 644283600 643256912 641724091 640644989 639392090 637431450
993.3 637431450 634510574 630979652 628461227 627451363 627230034 626543045 626302757 626615982 625602570
1002 625602570 624465294 623749123 622755508 621247673 619384460 617965813 616828423 616312523 615419159
1010.7 615419159 614460449 614436607 613846779 613136749 611822319 610044594 608510246 606640930 605349007
1019.4 605349007 604373512 603538322 602816849 601715279 600758286 600317688 598771248 596538773 595176163
1028.1 595176163 593917084 593118057 591578712 590438232 590181427 589097519 589032745 589327850 589118538
1036.7 589118538 588064919 587301826 587434959 587510109 587484894 586908112 587620583 588403816 588304482 588253593
1046.4 588253593 588592339 589432526 590029221 590964966 590479126 589617958 589982071 590291557 590612907 591231956
1056 591231956 591772041 591154823 590966988 590939064 590875816 591040802 590004959 588965645 588454361 588595963
1065.7 588595963 588607941 589184341 589421844 588049507 587362137 586983757 586393814 585357437 585534286
1074.4 585534286 586305542 585792694 585581970 585476456 585443726 585293388 585346298 585303841 585591927 586011620
1084 586011620 585009079 584448013 584712677 584854355 584456520 584605789 584666710 583598137 582114601 580547104
1093.6 580547104 580294647 579435577 578118248 577089844 575898476 575165291 573671799 572456779 571250076
1102.3 571250076 569820023 568453636 567445488 566216240 564360695 563238907 562071877 561524773
1110 561524773 559832458 558069649 557661705 557082443 556731262 555920105 555985069 555000305 553969841 554474716
1119.7 554474716 555054703 555440102 554644356 554870186 555224380 555435371 555499001 555453224 555161781 554405861
1129.3 554405861 555715446 556285324 556892090 557268791 556479759 556632957 555811234 554760132 554479790
1138 554479790 554679413 554087677 553595047 552956581 552266426 552919197 552307968 551423454 550140419 549151573
1147.6 549151573 548410606 547215118 546709824 546082916 546615486 546521835 546735382 547377357 547521667 548616943
1157.3 548616943 549965172 551602936 551608963 551621399 552530746 553695679 555112228 556681252 559406433
1166 559406433 561720734 564004059 565942078 568383904 571244049 573405571 575565681 577581558 580303345
1174.6 580303345 582634315 585318298 588506203 591483917 594226303 596082954 598314819 600294914
1182.4 600294914 601571503 602365723 603152008 604177284 605655823 607705765 608819351 610030022 611507149
1191 611507149 612797012 613547134 614020386 615167007 615639267 616145439 616946335 617879982 619167061
1199.7 619167061 620379181 621648712 622362061 622791290 622723236 622540703 622586212 622656860 623088188 623256149
1209.4 623256149 623829765 624769897 625737686 626278839 626265755 626366310 625910149 625316544 624791679 624622803
1219 624622803 624875565 624939690 625172501 625641899 626291618 626261940 625642548 625314636 625181427 624667206
1228.6 624667206 623933983 623817711 623858986 624057999 624648437 625541039 626059952 626024323 625926132 625673180
1238.3 625673180 625669899 625698204 625809250 625928192 626141777 626538391 626580925 627002945 627321625 627069931
1247.9 627069931 626767464 626593513 626258163 625816994 625960655 626082420 626354637 626860504 627081718 626919975
1257.6 626919975 626487808 626081352 625995026 626757088 626992531 626622238 626854706 627501221 628090439 628464851
1267.2 628464851 628996315 629419670 629656639 629954758 630755997 631420860 631423683 631939278 632791977 633543434
1276.9 633543434 634125671 634504509 635059662 635998116 636717377 637055168 637883453 638759689 639632072 640632019
1286.5 640632019 641115265 641291428 642019501 643202591 644035873 644935379 645931854 646920624 647755585
1295.2 647755585 648351212 649443054 650292664 650732193 651364975 652160950 652873535 653135834 653665848
1303.9 653665848 654547882 655455780 656072693 656036682 656197815 656719437 657243042 657542496 657861252 658287811
1313.5 658287811 658645554 659506149 660149078 660476379 660794907 660715485 660872879 661426239 662056122 662439804
1323.2 662439804 662804184 663038940 663185196 663994064 664849243 665081329 665148544 665215912 665218048 665465469
1332.8 665465469 664780731 664090652 664797211 665137558 665282364 665238190 664612274 664538803 665077209 665520706
1342.4 665520706 665582428 665820618 665678864 665423050 665536499 665888214 665843124 665284729 665304489 664886551
1352.1 664886551 664547806 664123611 663708801 663819656 663438568 663496094 663647156 663890686 663468704 662914047
1361.7 662914047 662430420 660701675 661529694 661660080 660704193 660493851 659855728 659055939 658633194
1370.4 658633194 658517838 658027802 657348404 656373291 656015930 656799164 656773834 655989761 655595322 655636292
1380.1 655636292 655420914 655641098 655893936 655391235 655406952 656499329 657435074 657108154 657941360 658788223
1389.7 658788223 659009628 659498672 659916992 660486221 659311829 657706604 658536453 659398804 659487000
1398.4 659487000 657412872 656903610 657417145 657332916 656974564 656497040 655338974 654586487 654951859
1407.1 654951859 654948502 654709930 654161072 653616333 653266983 652607956 652275696 651786499 651864471 652049561
1416.7 652049561 652053604 652336960 649693375 650014038 651521606 652011948 651232910 649323883 649732132
1425.4 649732132 650907516 651150131 651472778 652057953 651776276 651689148 651956940 652016754 652132263 652476578
1435 652476578 651927338 648545303 650071182 652048187 652583923 652806931 653063889 653313599 653789825
1443.7 653789825 653923492 653577042 653231506 652754974 652642822 653882751 654734650 654764938 655163498 656086655
1453.3 656086655 657057800 657465591 656975708 654025574 653927917 656375351 657759018 660087204 661735077
1462 661735077 662590408 663738022 662043228 662411118 664127045 664602509 665343628 666854172 669122238
1470.7 669122238 670785675 669900055 669687347 672371979 675054932 675139542 676346970 678416672 679403534
1479.4 679403534 680381165 680740128 681432571 682439880 683172607 683726654 683921661 683652954 682774506
1488.1 682774506 682969131 681264191 680213699 681217194 681870804 681941605 681897049 681613235 677294922
1496.7 677294922 678350220 677436523 674730759 675458298 674288635 673310165 672894287 673432770 673692932
1505.4 673692932 669024734 661820221 660910645 663143158 662102966 662533340 661104965 658817673 658965607
1514.1 658965607 658298645 657515106 652705231 650356979 652491379 654333725 652000504 647569046 648938065
1522.8 648938065 649008179 649725189 646551208 645377960 645525055 644412308 644291306 643831177 643443680
1531.5 643443680 642323532 640383301 637626991 639080391 640282669 640499802 641992035 636930046
1539.2 636930046 629522552 633940163 635940437 634762878 635116539 635822182 635273056 637259178 637645378
1547.9 637645378 637736778 637695274 637287979 638913460 639355392 639379997 637337761 638974915 642249908
1556.5 642249908 643957596 643047028 634037628 636259918 641107330 644252472 645580521 645947800 645720444
1565.2 645720444 646309052 648271637 649421310 649432983 645948792 646890564 648405151 648758240 649388351
1573.9 649388351 649768906 648958435 643729172 646140976 647659073 647504044 647683334 647065048 646742630
1582.6 646742630 645869141 645242844 644459534 643545456 642934799 641712723 640728073 638803673 637887077
1591.2 637887077 637026978 636352348 634923668 632695122 631959686 630147820 628941765 626969032 625462341
1599.9 625462341 623703957 621662445 620854759 618569069 617231293 615417061 613692780 610944405
1607.6 610944405 608851357 607075500 604205399 603443871 601317444 599943428 598160706 597577133 596645584
1616.3 596645584 588217506 588396568 586931953 585770111 583432045 582962265 581738205 575923233 575963783
1625 575963783 574999771 574821510 571224823 568894501 568170509 566299896 565200424 563682289 564229164
1633.7 564229164 563881836 559635696 556130371 557144470 557278366 556975975 557783356 556525993 556914597
1642.4 556914597 555918770 556576004 557746544 554718552 555031509 553870316 557069664 558491745 561123085
1651 561123085 564330482 562596130 557043266 557795792 561444206 562572136 564091721 565028725 566094017
1659.7 566094017 567212181 568061066 569439201 568307762 570385666 571730881 573091469 574794540
1667.4 574794540 576421432 576784935 576729279 580228271 580623131 582852058 585287704 584425316 584111824
1676.1 584111824 586942825 590239258 591668358 593719025 594401321 596888504 600679665 600205154 598592300
1684.8 598592300 600278664 605030174 607546158 608952217 611002502 612643013 615578461 617881012
1692.5 617881012 620594444 623775177 627287254 625267487 627858124 632831535 637499275 637586441 631467285
1701.2 631467285 639608688 644747772 647923965 650038223 651800842 653882065 656319351 659571533
1708.9 659571533 661317673 662479553 664088211 666167603 668884277 669306946 670224228 672967606 674840393
1717.6 674840393 671579285 673506470 675660248 676273346 677444000 677855911 677787018 678890762 680193863
1726.3 680193863 681179810 682125092 683485336 682827454 683222122 685656357 686892471 683449783 679042053
1734.9 679042053 683913574 687322464 688771591 690728149 690659485 689727859 692667694 694378204 693273621
1743.6 693273621 693531189 695698242 697646408 699076996 700573883 701569595 704718094 705996704 705520020
1752.3 705520020 708874893 710903168 712304611 713805313 712638779 713900452 716219788 718156128
1760 718156128 720414658 718995285 718629608 721132889 722322235 722927704 723981171 724421463 722224426
1768.7 722224426 723656845 726643982 726742783 724107285 723195114 726289368 727828674 727206268 728465576
1777.4 728465576 728724976 729120636 729037704 727950821 728809891 730177155 731527100 731184235 730665665
1786 730665665 731523437 732216644 732715149 733234787 732848663 732566986 731220245 730770035 732963028 733687973
1795.7 733687973 733284760 734548569 735993805 735392532 733805237 734660797 734214478 734254456 735493011
1804.4 735493011 735761642 736259003 736399536 736242218 737136078 737868729 736510849 736080704 736605072
1813 736605072 736889114 737649994 737732391 737917099 737869110 738038483 738867111 738877335 738980331 738766708
1822.7 738766708 739271545 739687119 736880569 737050934 739348602 740641174 739509277 736630554 738193741
1831.4 738193741 739892960 739655151 739668350 739767532 739625549 739101105 738757782 739524918 739743805 740402069
1841 740402069 740921326 741768799 742081223 737972946 739162140 740587387 740029221 739577560 740057449
1849.7 740057449 740978699 741174088 741358948 741436844 741640930 741314926 740945816 741301727 741015320 740862427
1859.3 740862427 740537338 740567474 741113129 741534348 741645660 741604691 742005310 741464920 741177063 740118027
1869 740118027 738769913 740009842 741067429 741302109 741178970 741310883 741407242 741614609 741688843 741416855
1878.6 741416855 741560287 741555328 741551819 741512451 741459198 740845413 740523529 741442032 741831207 742211685 741625214
1889.2 741625214 739694977 740432281 741450806 741144028 740976410 740400314 739755020 740345459 740749969
1897.9 740749969 741059647 741219559 741264114 741172485 740743866 740704498 740311050 740299301 740646820 740665436
1907.6 740665436 740573578 740400543 740271759 740034790 740290527 740121078 740163879 740308075 740119705 740409775
1917.2 740409775 738681412 738289108 739493942 739920807 740028915 739002533 738713913 739229584 739390488
1925.9 739390488 739310455 739216461 739221878 739090347 738958054 739044800 739343109 738814011 738308792 738311691 738215942
1936.5 738215942 738157959 737886887 737808456 737927170 738738327 738390732 736715012 737426071 737850189 737615585
1946.1 737615585 737374268 737062378 737004547 736762390 736953888 737018433 736838608 737027054 737086868 736907883
1955.8 736907883 736873016 736889038 736393585 735818329 735866318 736276016 736174622 735809784 735733643 735798340
1965.4 735798340 736097870 735573273 734745178 735038681 735098267 734965820 735197830 734886475 734727325 735109558
1975.1 735109558 735206604 735216217 735136414 734827728 734401093 733972626 733704453 733484268 733534088 733742981
1984.7 733742981 733800201 733878479 733599548 732933655 732828674 733302231 733243484 731913223 731306763 731775436
1994.3 731775436 732059784 732216721 732181473 732025986 731748199 731251678 731086884 730800629 730364075 730158997
2004 730158997 730024872 730100937 730286560 730079117 729790115 729842682 729750824 729604416 729256973 728783035
2013.6 728783035 728592377 728663940 728698578 728000717 727873764 728187714 728064728 728057785 727898712 727671890
2023.3 727671890 727208481 727021027 727305679 727256470 727007217 726885376 727027359 726842575 726453400 726032410
2032.9 726032410 725723114 725623856 725306702 725099030 725030136 725329361 725405121 725078812 724911575 724709244
2042.6 724709244 724596252 724322433 724294739 724238205 724175339 724313812 723918152 723674850 723632126 723628311 723606339
2053.2 723606339 723562164 723261032 722591171 722562561 722492752 722191391 722077179 721999512 721967163 721884079 722247849
2063.8 722247849 722331772 721772919 721596298 721574020 721093140 720438690 720241547 720440063 720295105 719892960
2073.4 719892960 720287399 720644836 720206909 719883881 719688187 719432373 719155884 719133682 719280701 718952179
2083.1 718952179 718458405 718436203 718730927 718875122 718880081 718925476 718905869 718697433 718357239 717992020
2092.7 717992020 717911682 717835312 717701187 717911530 717905884 717895508 717961426 717601700 717193451 717063522 717004547
2103.3 717004547 716848221 716940002 716884079 716876984 717113342 717100067 717131424 717084808 717182312 717066193 716779175
2113.9 716779175 716752319 716388702 716234512 716420364 716412201 716133881 716094589 716276474 716429520 716561890
2123.6 716561890 716247025 716045609 715856247 715572662 715286179 715098877 715526428 715946808 716248016 715992889
2133.2 715992889 715431900 715246353 714977798 714707718 714731598 715031052 714815292 714696350 714889603 714955063
2142.9 714955063 715469971 715424194 714983902 714853592 714670639 714542999 714375000 714197159 714321823 714560242
2152.5 714560242 714438095 714446030 714748001 715007172 714887390 714495087 714312286 713976746 713891602 714030838
2162.1 714030838 714202118 714479218 714409866 714573135 714833603 714579391 714072723 713723221 713513565 713463974
2171.8 713463974 713603363 713675003 713844986 713794861 713563080 713577423 713606567 713276978 712927475 713440170
2181.4 713440170 714002380 713814774 713562393 713489609 713491440 713716583 713895111 713739471 713435440 713122559
2191.1 713122559 713065720 712951813 712698822 712729187 713004532 713258591 713418808 713626556 713448563 713321609
2200.7 713321609 713168411 712647018 712365265 712052536 712148895 712315445 712417145 712999802 713298721 713140640
2210.4 713140640 712875061 712960892 712612686 711928558 711716080 711648560 711930542 711848297 711519928 711528625
2220 711528625 711815567 712284317 712184448 711836548 711589813 711437836 711394653 711390381 711266479 711074677 711467819
2230.6 711467819 711776733 711620407 711544571 711374664 711126633 710704575 710289917 710406647 710371780 709999237
2240.3 709999237 710016861 710342941 710705185 710761032 710661240 710579758 710283661 710077820 709898911 709601593
2249.9 709601593 709291916 709359207 709665222 709728394 709899750 710146713 710111237 709646378 709162827 708952255
2259.5 708952255 708708496 708332901 708162460 708416138 708713837 709049530 709177780 709169006 709151077 708840179
2269.2 708840179 708622208 708378372 708264999 708393326 708558426 708636475 708824768 709117279 708903503 708715439
2278.8 708715439 708435364 708224716 708129196 707628937 707321320 707185745 707380600 707533112 707851715 708209076
2288.5 708209076 708096237 708272476 708016663 707487030 707051926 707045822 707440186 707452469 707481308 707286835
2298.1 707286835 707431259 707627106 707802048 708067932 707510605 707125015 706954956 707097397 707052917 706807556
2307.8 706807556 707495651 708278046 708596725 708203354 707927475 707511215 706859665 706700592 706440430 706834564
2317.4 706834564 707096558 707279205 707470932 707096939 707441711 707754593 707590332 707110214 706873398 707267227
2327.1 707267227 707794571 707872238 707396469 707067261 706446838 706791000 707567673 707626419 707821426 707594528
2336.7 707594528 707528763 707443542 707562332 707998428 707782135 708063354 708441391 708171463 707482529 707150726
2346.3 707150726 706945648 706319275 706840668 707955170 707822723 708299179 709576797 708041916 705846481
2355 705846481 707190857 708647308 707850113 707540359 707897491 707470932 706548538 707104340 707999115 707757874
2364.7 707757874 707657700 707001953 706920395 707235413 706893463 707125549 707163467 706513519 705786667 706175842
2374.3 706175842 706699448 705889969 705435410 705591583 705707550 705755768 705405731 705102692 705200806 705216446
2383.9 705216446 705120392 705333481 705558167 705623856 705814743 706000519 705843735 705666275 705551453 705084457
2393.6 705084457 704944229 705045700 704856720 704721985 704573441 704625931 704672470 704462814 704726868 705245361
2403.2 705245361 705135574 704724350 704347839 703807907 703680649 703922119 704060440 704295120 704451370 704291077
2412.9 704291077 704023437 703897095 703787231 703504333 703188629 703096542 703197632 703406906 703564224 703547211
2422.5 703547211 703533249 703310165 703135147 703135834 702958374 702650604 702056580 701786880 702058640 702272797
2432.2 702272797 702582321 702782822 702556076 702275238 702148743 701991425 701658859 701200256 701004791 701013489
2441.8 701013489 701152039 701406097 701239395 701249847 701597824 701496811 701113052 700997925 700927963 700267563
2451.5 700267563 699844360 700047760 700300827 700630646 700897293 700887833 700531921 700225830 699946976 699574585
2461.1 699574585 699337540 699266052 699390106 699219437 698850555 698775711 699122391 699366684 698924637 698270569
2470.7 698270569 697841187 698009872 698184891 697844162 697796631 698131714 698402557 698313675 697791061 697149506
2480.4 697149506 696915588 696883698 696799698 696796722 696675034 696553726 696464996 696851196 697350159 697206573
2490 697206573 696958008 696516190 696146011 696074142 695851822 695587921 695530701 695661163 695545959 695275269
2499.7 695275269 695286331 695591965 695493927 694990234 694777222 694611969 694268417 693802338 693831482 693921585
2509.3 693921585 693620453 693968811 694291916 694129257 693885574 693509750 693242722 693046722 692934341 692862778
2519 692862778 692814484 692792511 692849197 692867889 692684708 692612610 692718353 692832031 692680588 692449722 692089996
2529.6 692089996 691648483 691609955 691553345 691603851 691797104 691870880 691937561 691729736 691477203 691328354
2539.2 691328354 691023331 690628510 690567703 690733719 690769730 690714874 690556564 690529404 690419693 690233307
2548.9 690233307 690316544 690346375 689966965 689416428 689259491 689193420 689058456 688811417 688807449 689355850
2558.5 689355850 689107971 688469772 688397751 688327179 688016129 687738647 687981720 688038101 687806396 688166656
2568.1 688166656 688711472 688473663 687483749 686939316 686841049 686665192 686581497 686592941 686988144 687322845
2577.8 687322845 686840973 686327667 686414337 686201019 685706635 685697098 685712509 685381012 684981613 685015335
2587.4 685015335 685160828 684696732 684292831 684354401 684504242 684383163 683827744 683667755 683857574 683716431
2597.1 683716431 683805695 683785934 683236771 682911835 682818375 682754211 682588425 682333221 682327805 682365723 682145844
2607.7 682145844 681665344 681321869 681307220 681277924 681172180 680884476 680553055 680501862 680270462 679790115
2617.3 679790115 679399948 679111404 679150314 679316940 679325714 679041138 678595505 678508453 678395386 678071289
2627 678071289 677811508 677657852 677582321 677358780 677142410 676915970 676859436 676859131 676544113 676488342 676396484
2637.6 676396484 676062317 675828323 675389709 675055847 675068436 674939270 674480591 674302826 674404449 673918228
2647.2 673918228 673359909 673260574 673189392 673177109 672961960 672602997 672322693 672052536 672200546 672256470
2656.9 672256470 672067184 671990585 671722031 671567078 671424942 671147766 670895462 670528336 670069351 669698334
2666.5 669698334 669821167 670032806 670043259 669937820 669475403 669211044 669281235 668901825 668116074 667951584
2676.1 667951584 668273621 668334198 668274307 667942581 667387466 666924820 666872101 666933670 666528549 666397018
2685.8 666397018 666256104 665598679 665348816 665519714 665516663 665281677 665216980 665308685 665254822 664903488
2695.4 664903488 664277420 664097748 663953171 663306580 663017197 663253250 663642731 663664627 663271790 662709579
2705.1 662709579 662093658 661942749 661823349 661705704 661901321 661852646 661642227 661203842 660685425 660465240
2714.7 660465240 660134659 659849701 659776306 659492645 659253540 659156952 658854065 658624725 658705978 659005280
2724.4 659005280 658935928 658364868 657853470 657465134 657175980 656625977 656324692 656321793 655670166 655148468
2734 655148468 655171890 655537796 655799179 655382004 654875031 654920807 655221939 654972687 654533005 654034348
2743.7 654034348 653598862 653668137 653506012 653290558 653365097 653407974 653020096 652483368 652378159 652170639
2753.3 652170639 651974792 651775742 651327362 651227798 651447525 651365356 650906830 650289688 649645844 649456177
2762.9 649456177 649567032 649449997 648910294 648655472 649012909 648854828 648423843 648044052 647550964 647150726
2772.6 647150726 647007751 647000732 646418915 645929337 645724945 645552521 645517197 645208817 644878540 644432526
2782.2 644432526 644267120 644304276 643970642 643682098 643509445 643447037 643186951 642852783 642490463 641769562
2791.9 641769562 641135101 640913162 640852432 640669098 640431747 639876976 639251976 638730240 638289413 638441391
2801.5 638441391 638569107 638244858 637670593 637160149 636982613 636730347 636192436 635831451 635754967 635280724
2811.2 635280724 634705086 634070778 633296890 633067894 633085976 633000145 632606850 632181740 631741486 630981331
2820.8 630981331 630354500 629929657 629931908 629838676 628919220 628117256 627866592 627462730 627094917 626697960
2830.4 626697960 625936546 625546150 625055733 624489098 624087753 623253288 622612190 621804886 620912666 620210724
2840.1 620210724 619146118 618090096 617024384 616089249 614958382 613483849 612090492 610383148
2847.8 610383148 608835030 607764015 606658287 605712051 605259476 604780235 604000549 603531151 603742485
2856.5 603742485 604404335 604676437 604560738 604412689 603963966 603632507 603506241 603307800 602947350 602036324
2866.1 602036324 601007004 600380859 600031281 599898109 599467850 598752899 598320084 598179054 597991104
2874.8 597991104 597345543 596805763 596818275 596890984 596601486 596225166 596226311 595954971 595392342 594978714
2884.4 594978714 594615593 594200592 593301697 592415466 592089958 591832466 591503181 591424751 591040230 590172348
2894.1 590172348 589592323 588951378 588204002 587507973 586721420 586208153 585790176 585299721 585009193 584762230
2903.7 584762230 584202919 583560867 582729683 582466545 582656593 581638756 580648346 580205231 579840393
2912.4 579840393 579437027 578255386 577104263 576365547 575860786 575357132 574613113 572981949 571260300
2921.1 571260300 571085320 571242867 571402588 571235924 571205711 571383934 570577011 570615578 570976524 570802155
2930.7 570802155 570668030 570279121 570114059 570666046 571902618 572555618 572633591 572712440 572868347 572981110
2940.4 572981110 572964287 573627319 574251289 574457054 574292107 574083481 574437447 574391174 573859444 573423271
2950 573423271 573372345 573365440 573013763 572331924 571718445 571589622 571010208 570359306 570305481 570265350 570267220
2960.6 570267220 570531960 570670509 570459900 570710068 571178360 571227417 571164932 571221542 571601448 571998978
2970.3 571998978 572182808 572638550 573295975 573645782 573850098 573960876 574296112 575030251 575573273 575860443
2979.9 575860443 576048622 576285629 576449432 576799240 577282486 577526703 577764244 577798080 578033485 578298721
2989.6 578298721 578564301 579020996 578956146 578909988 578747025 578693542 579176483 579219398 579219742 579329605 579058456
3000.2 579058456 578717613 578455048 578396492 578492470 578159218 577667503 577461433 577304344 577398186 577106438
3009.8 577106438 576427841 576552277 576577568 576066132 576030312 575864220 574944077 574123154 574091797 574102821
3019.5 574102821 573580132 573466530 573301659 572508698 572012024 571447563 570665207 570293045 570210037 569916763
3029.1 569916763 569597969 569364853 568644104 568254356 568286324 567972946 567536697 567040062 566399536 565944328
3038.7 565944328 565970535 565478363 564536858 563921432 563003998 562393417 562433777 562009087 561219826 560930824
3048.4 560930824 560755577 560281258 559730682 558961296 558423576 558198547 557830620 557359734 556692848 555936432
3058 555936432 555597153 555366096 554547729 553922729 553935471 553698387 553161545 553049622 552835426 552005882
3067.7 552005882 551486053 551123581 550400085 549712448 549214363 548824196 548695526 548663445 548206635 547569084
3077.3 547569084 547194023 547231102 546923599 546180000 545594940 544824562 544462662 544199944 543606300 543207092
3087 543207092 542800140 542503395 542248077 541831589 541316261 540970001 540444374 540073738 539957542 539171906
3096.6 539171906 538794785 538298607 537484398 537229156 536683350 536426926 536305199 535698318 535071907 534737244
3106.2 534737244 534485741 533833008 533315544 533029594 532400894 531597786 531294632 531131821 530579567 529855232
3115.9 529855232 529186554 529021950 528579483 527585640 527097740 526634293 526138649 526132011 525642204 524971695
3125.5 524971695 524548531 523697319 523251190 523088837 522560959 521740799 520875435 520343590 519739304 519409027
3135.2 519409027 519151268 518739700 518133240 517273979 516688499 515895729 515323944 514706345 513970909 513696594
3144.8 513696594 513247910 512679634 512063904 511906128 511390457 510383644 509998093 509570503 509057198
3153.5 509057198 508240356 507554245 507185593 506250763 505302925 504825249 504391289 503610420 503059311 502644539
3163.1 502644539 501531525 500410614 500377121 500560608 500035858 499329910 498717651 498273201 497247467
3171.8 497247467 496214981 496097450 495759888 494965019 494158211 493611946 493052711 492639503 492212448
3180.5 492212448 491181297 490399704 489968758 489500084 488791161 488272018 488084030 487418213 486730728
3189.2 486730728 486212883 485462036 484927254 484469376 483335381 482255592 481893768 481560287 480409737
3197.9 480409737 479164124 479007263 478919258 478643227 478294754 477744637 477082634 476517410 476420975 475535431
3207.5 475535431 474517021 473945999 473637161 473568077 472838669 472299538 471333237 470370140 470252647 469952049
3217.2 469952049 469597626 468934631 468273811 467595558 467071800 466709175 466246338 466110268 465507469 464509583
3226.8 464509583 463807220 463461113 462916718 462624969 462761192 462367287 462043533 461713104 460996475 460321159
3236.4 460321159 459847374 459101639 458424530 457967224 457442093 457481194 456813011 455990562 455769043 455310783
3246.1 455310783 455368385 454960556 453866920 452964897 452617378 452687874 452303581 451546173 451135559 451260834
3255.7 451260834 451012154 450604286 450128899 449382553 448846321 448176537 447713890 447884483 448234062 448067207
3265.4 448067207 447448120 446601181 445936394 445788231 445575714 445332069 444754257 443958549 443359642 442988319
3275 442988319 442827415 442406197 441985931 441940804 441838417 440901642 440353241 440397797 439749374 439275703
3284.7 439275703 438856850 438453331 438284225 437832718 437536888 437318993 436678543 435945625 435531731 435200653
3294.3 435200653 434987221 434707069 433980141 432825737 432366600 432602654 432328186 432195549 431856842
3303 431856842 431325188 430926666 430362892 429916687 429219170 428746262 428297157 427712326 427013779 426572533
3312.6 426572533 426509590 426282005 426281319 425215721 424384117 424141502 423186378 422958794 422708092 422041740
3322.3 422041740 421161842 420749931 420885582 420700989 420396805 419577484 418862038 418359108 418068047 417565422
3331.9 417565422 416728096 416063881 415409164 415345306 414741096 413907661 413821831 413577576 413022118 412818947
3341.6 412818947 412492218 411215744 410858955 410826988 409943619 409147263 408772545 408769646 408478203 408156853
3351.2 408156853 407169571 406400948 406309814 405818367 405566368 405011673 404742279 404423981 403622093 403295441
3360.8 403295441 402947769 402424049 401751289 401470146 401386871 401027489 400337791 399744530 399830818 399548569
3370.5 399548569 398636894 397799721 397351494 397214775 397435760 397224655 396461143 396004181 395619926 395467377
3380.1 395467377 394801941 393898621 393826561 393931732 393793526 393585205 393389397 393081627 393244972 393078499
3389.8 393078499 392470245 392271690 391907120 391897011 391861839 391304626 390779190 390508270 390160408 389988060
3399.4 389988060 390259743 389966927 389567108 389641647 389967575 389823074 389220924 388909073 388512802 388481445
3409.1 388481445 388506470 388232422 388308983 388684769 388656883 388082886 388091888 388355942 387924805 387377777
3418.7 387377777 387628937 387734528 387452087 387572289 387263412 387495918 388222923 387940979 387504959 387772980
3428.3 387772980 388010063 387777748 387468605 387461624 387707100 387684364 387848511 387980843 388098831 388212357
3438 388212357 387688332 387761459 387983627 388185043 388412399 388325005 388584137 389076996 389795609 389228554
3447.6 389228554 389068108 389770660 389952850 390405312 390241547 390352631 391004257 391498032 391833916 391845474
3457.3 391845474 392192345 392039375 392065582 392822113 393409538 393519249 393270683 393453865 393900452 394123192
3466.9 394123192 394264107 394750824 395037117 395184593 395632935 395901451 396384239 396933746 396791687 396588326
3476.6 396588326 397193680 398154106 398823967 398985786 399290161 399305305 399004250 400131531 401125488 401396980
3486.2 401396980 401335297 401366234 402352486 402850609 402879333 402763557 403668442 404863777 405248756 405710106
3495.8 405710106 405543480 405531425 405789871 406691666 407482948 407622986 408494568 408438683 408150902 408709755
3505.5 408709755 409539490 410133667 410806885 411287727 411095657 411735611 412107773 412432175 412796669 413284187
3515.1 413284187 414068756 414417152 414781570 414689026 415516586 416799164 417878113 418512039 418063698
3523.8 418063698 418751564 419277611 419458656 419763451 420220604 420403366 420702858 421512718 421670914 422448769
3533.5 422448769 422839699 423621941 424692612 424699516 425702972 426077271 426176186 426596680 427325287 428117867
3543.1 428117867 428918915 429615250 429119797 430092010 430814743 431538048 432275276 432862549 434131508
3551.8 434131508 433878555 434661713 434988441 435439453 436551132 436284676 436934967 438046265 439226418
3560.5 439226418 439570923 440907974 441719666 441319656 444573555 445224495 443117256 442908363 442523499
3569.1 442523499 444372482 445799522 447137337 448168488 449012222 449482307 449950142 450824165 450564194
3577.8 450564194 451678810 452622566 453026314 454272346 455332565 455967064 456320572 459129410 460414925
3586.5 460414925 458827896 459992981 458993530 460028229 461703300 463512840 464220314 463699646 465796204
3595.2 465796204 465190964 466036072 468468781 469096069 470665855 470534363 470974884 472490578 473729935
3603.9 473729935 475188751 476537247 477627106 475767899 477173004 477184982 476872406 482293854 482974663
3612.5 482974663 481112938 484076271 482998734 484594650 486120949 485186005 488142548 488399544 487881012
3621.2 487881012 489621162 491591110 493444252 494774437 496067238 498066216 503137321 505136528
3628.9 505136528 496586304 498775482 501403198 504607620 506084137 505383606 507539864 509902306
3636.6 509902306 511433640 511086082 511573219 513268433 514900055 516214828 516540337 518244972 521207962
3645.3 521207962 526197395 526111374 522345467 527781067 527761192 524737587 523937988 527669258 531094818
3654 531094818 533453941 536589088 530839119 531941528 535754395 537515564 539649200 540083504 541193161
3662.7 541193161 542014542 543521347 544577293 544411736 547576752 550101280 549933090 548943253 544439316
3671.4 544439316 546981392 553082695 558880424 557231712 545513268 548202591 554034386 557484283
3679.1 557484283 556107140 556378326 558776093 560328026 561064644 560993652 561024704 563824997 567481537
3687.8 567481537 560828323 559089699 565027313 560952873 560636902 564562416 564152222 564616165 565528488
3696.4 565528488 565682831 566150665 565772896 567471352 569174919 565489464 564494629 568264580 569781189
3705.1 569781189 569099236 569258270 571515312 575001831 569980125 571554146 574987946 565754662 569103851
3713.8 569103851 572315750 572599716 573445435 575285110 576110420 573277893 573517685 577179260 575817719
3722.5 575817719 572862778 576208534 577381134 576998215 574739571 574401245 577497635 577911949 581202621
3731.2 581202621 579418678 573848267 580842018 580903816 572196350 573098907 576069450 576472435 577769089
3739.8 577769089 580138321 577557907 579880638 588128967 578965492 566913223 575188179 579788322
3747.5 579788322 584161873 581076126 572208900 581412926 576629257 570992355 576490593 580276909
3755.3 580276909 582620811 578654060 579999123 583531647 578022499 576717834 579307022 580391846
3763 580391846 580494614 582617607 580326767 577305946 579812813 583211823 583706360 576606636 577445831
3771.7 577445831 579573479 580006523 580819321 580229721 580780830 581147995 583257103 583731308 577906189
3780.3 577906189 579240570 580605392 581065025 582630806 580217171 579023781 579984550 580434074 580926361
3789 580926361 580921440 581075058 580876350 580775833 580186577 580620422 583486977 581339226 578331108 579531326
3798.7 579531326 581510582 584858360 578633575 572922287 576960373 579089203 582266922 585279884
3806.4 585279884 577819061 574858131 579139671 581429787 581244659 581405792 581345100 582025452 586316299
3815.1 586316299 585994377 574973717 577622528 582107506 586126099 587211685 574596901 576365204
3822.8 576365204 579330063 579477463 581475792 582257881 578699150 578454666 579860611 582800789 584055290
3831.4 584055290 576404152 578698616 584743690 580473061 579667397 585670166 578299942 573183060
3839.2 573183060 579323654 576363068 576399574 580915909 578720016 576340981 578389931 579703636 579896355
3847.8 579896355 580976715 580115433 580896606 585069199 581030121 579685364 568611717 570138054
3855.6 570138054 577204933 576894493 576373978 578491745 579947548 580884781 577022209 577014771 581795006
3864.2 581795006 577275124 573211632 576104164 579454956 584025764 578577690 571316566 574077530
3871.9 574077530 578863525 581031799 573313675 574867668 577755356 577014084 578004112 581571274 578244514
3880.6 578244514 572399445 577127457 577806892 578018227 581287384 571809196 572375641 575912361 577067680
3889.3 577067680 579233017 578106461 572846756 574382362 577271919 576521797 576854744 577024574 578773460
3898 578773460 579884529 571889763 575000267 576508713 572581558 575868187 573660507 572573814 573850632
3906.7 573850632 574340591 575721512 575751114 575722923 575727577 575409622 574897881 574525070 575840797 576741447
3916.3 576741447 573035889 571110229 575017471 575832176 572785912 574137268 575276222 575349884 573372307
3925 573372307 570382881 571867676 574305229 575562439 574241638 573662491 575288696 573071899 571693077
3933.7 571693077 572994690 573130150 573192406 573795967 573273735 572298546 572401619 573847809 574372864
3942.3 574372864 570831490 570280647 571213379 572131691 573743019 572006340 572423134 572498589 570741463
3951 570741463 572103386 571730881 571295166 571823082 571745529 571736221 571310844 571521645 571627007 572023773
3960.7 572023773 571890678 570580215 571034660 571847496 571591415 571627502 571290436 570667229 570517654 570378075
3970.3 570378075 571020813 571276131 571060982 571453514 571243057 570454865 570018387 570344467 570267487 569995537
3980 569995537 569807739 570157661 571101646 570529671 570113335 570322456 570262718 570151329 570237732 570705299
3989.6 570705299 570184937 569365540 569098663 569609261 569909554 569606934 569569511 569226799 569268150 569130249
3999.2 569130249 569050598
4000.2 569050598
##END=$$ End of the data block
