##TITLE=$$ Begin of the data block
##JCAMP-DX=5.00 $$ ACD/SpecManager v 10.08
##SPECTROMETER/DATA SYSTEM=Varian
##DATE=18 Dec 2012 10:43:32
##DATA TYPE=INFRARED SPECTRUM
##DATA CLASS=XYDATA
##ORIGIN=
##OWNER=
##NPOINTS=3735
##FIRSTX=399.26403809
##LASTX=4000.35498047
##MAXX=4000.35498047
##MINX=399.26403809
##MAXY=74.50635529
##MINY=38.91230392
##XFACTOR=1.0000000000
##YFACTOR=0.000000100000000
##FIRSTY=64.13333893
##DELTAX=0.96440572
##XUNITS=1/CM
##YUNITS=TRANSMITTANCE
##XYDATA=(X++(Y..Y))
399.3F41333389K762375R225159K007828J028137j1104126j4516258j533471Q270302
407F37473335P509270R78165j182709L823166M27780m896469m770165p005195O15921
415.7F32973099R566955N228653n878219o321907m329110J665802N728798q72345m004211
424.3F33757515n157509o85959M256211K873077K166252j140556k452202l233986L518257
433F33901100O376457j806602k848930k922364R8496K364235N45463r57489J672859
441.7F36423225L114014n467796k152062L211327L628464J24855m201622k729721l564873
450.4F28385811j097107K272377M028206J908531k281532j6213k227669o668319J73874
459.1F24477959p10831k73438L821450K457084k323570p37305R77326j058426k341194
$$ plain form
399.3 641333389 644095764 653320923 655328751 656356888 645252762 630736504 629203033 637473335
407 637473335 644982605 645960770 644778061 648601227 649029007 644132538 639362373 632357178 632973099
415.7 632973099 642540054 647768707 641890488 635568581 631239471 632905273 638634071 637761726 633757515
424.3 633757515 628600006 627914047 632170258 635043335 637209587 636069031 633616829 630382843 633901100
433 633901100 640277557 638470955 635622025 632699661 632798157 635162392 635707855 634750366 636423225
441.7 636423225 639537239 634069443 631917381 635128708 638757172 638882027 634680405 631950684 628385811
450.4 628385811 627288704 629561081 633589287 635497818 633216286 633200073 630972404 624304085 624477959
459.1 624477959 623767128 623493690 627315140 629772224 627448654 626711349 627688675 626630249 624289055
467.7F24289055p42684J834069K719192M64440l176804k84119k343063Q02689O035194
476.4F29597969m67529j033364K544022K227554q97979l630028j850739K452317K827835
485.1F31770058j04981K55547l72200k304878k024575k19078J285744J389465J70479
493.8F29845581J288261L167115J80969J050301O92329k820663m24004r6932l883438
502.5F28999519k712288K700882K197113j802520q31795O0501J553192o08787m304352
511.1F25251465k244721L73536P19184n79490k2125M55131R02252K257691K015724
519.8F29128647q35533k341080q33511k141037k810402j690254k69013K403221K415085
528.5F23026123J447105j833038k146873J68724j405716j884728m48646J109810N20515
$$ plain form
467.7 624289055 623546371 625380440 628099632 628564072 625387268 625103149 622760086 623562775 629597969
476.4 629597969 629130440 628097076 630641098 632868652 631970673 628340645 626489906 628942223 631770058
485.1 631770058 631665077 631920624 631548424 629243546 627218971 626999893 628285637 629675102 629845581
493.8 629845581 631133842 634300957 634481926 635532227 636224556 633403893 632979889 632882957 628999519
502.5 628999519 626287231 628988113 631185226 629382706 628550911 628611412 630164604 629555817 625251465
511.1 625251465 623006744 623380280 624099464 623519974 623497849 623952980 624855232 627112923 629128647
519.8 629128647 628293114 625952034 625118523 622977486 620167084 618476830 618207817 620611038 623026123
528.5 623026123 624473228 622640190 620493317 620662041 619256325 617371597 616922951 618032761 618553276
537.2F18553276p98950P06406J835060J122055k46163j345482j577949K83546Q54378
545.9F19386177q52127P057J867752K046013Q07762K7733J49613P07435m92515j933594
555.5F21721306j611557r12895j41030p53212j3427J36451m58793J587333J498986
564.2F21053162R91363j109123k033424K046318J326294k143708j366119Q58803J189155
572.9F20812721N87693j0224j37825k3575r85717p32842J00555P36390k30751o72951
582.5F19443474J328659K07710q8196J767464N68275j427650j483345L54843L17345
591.2F20988579o95572j74484n65491m48914N10216l3646j101989q41294q79936n72662
600.8F16184807k56348j240616n03196Q47015R56688q7776j261444j863404j755638
$$ plain form
537.2 618553276 617754326 618460732 620295792 621417847 621171684 619826202 618248253 618531799 619386177
545.9 619386177 618534050 618541107 620408859 622454872 623262634 623290367 623439980 624147415 623654900 621721306
555.5 621721306 620109749 619196854 619055824 618302612 618289185 618425636 617966843 619554176 621053162
564.2 621053162 622044525 620935402 618901978 620948296 622274590 620130882 618764763 619623566 620812721
572.9 620812721 621400414 621390190 621252365 621228790 620243073 619510231 619610786 620347176 620116425 619443474
582.5 619443474 620772133 620979843 620891647 622659111 623227386 621799736 620316391 620671234 620988579
591.2 620988579 620293007 620118523 619553032 619104118 619614334 619580688 618478699 617637405 616757469 616184807
600.8 616184807 615928459 614687843 614184647 615031662 615988350 615900574 614639130 612775726 611020088
609.5F11020088o73065q62732j167946k461357l382683n14641R80874q2932K4185N88150
619.2F03467941j12953q99086j353760j370201l95927M40140K228241M237175L658943
627.8F09900513J699218J221505J404152J598014M73977j121293p83462j137390p65267
636.5F12489967J353531J259346K06070K73781Q06122J901588K365341J674996P85980
645.2F23116722R47495K967605J923485j372681r5405J534881o2866M09393P33605
653.9F30102234j575127r29184J495781J294174j33018N00717J588097R65614J89247
662.5F33498535p52029n26924J124878K146492J74560o675720L020172K658081J546593
671.2F36214638J685714J37635j123238j158485l18184J123810J193084P4120O78902
$$ plain form
609.5 611020088 610347023 609484291 608316345 605854988 602472305 601957664 602938538 602855606 602879791 603467941
619.2 603467941 603354988 602455902 601102142 599731941 599336014 599776154 602004395 606241570 609900513
627.8 609900513 611599731 612821236 614225388 615823402 616297379 615176086 614392624 613255234 612489967
636.5 612489967 613843498 615102844 615308914 615582695 616388817 618290405 620655746 622330742 623116722
645.2 623116722 624064217 627031822 628955307 627582626 627487221 629022102 628959236 629368629 630102234
653.9 630102234 628527107 627597923 629093704 630387878 630254860 630755577 632343674 633309288 633498535
662.5 633498535 632746506 632219582 633344460 635490952 635665512 628989792 632009964 634668045 636214638
671.2 636214638 637900352 638037987 636914749 635756264 635438080 636561890 637754974 637829094 638507996
679.9F38507996J395225J02654q53844k91901j82495j084137j99394M56734J29165
688.6F37980003j21345r68437n8899N41839L7728o95916j324005j139335j494332j79786
698.2F32577515P57370L37982Q63533L54309M92859K25487l96843L75022o96907o39495
707.9F34250832J303787R59816R27772J498909M77295O63071J791000J113053n94178
716.6F42391357n74874N22537K07672K33917R96018Q11309O54526J349259J214218
725.2F47805939M90188R95179K1286j071930l96042m56620m72793o1569R24453J427994
734.9F49206085K8534o69632J38474J278228J207810J29318m53033j45493O63071Q68378
744.5F52251740J722564J386185L77808J761474J572495M49676j0910L23715J346360
$$ plain form
679.9 638507996 639903221 640005875 639152031 638860130 638677635 637593498 637394104 637850838 637980003
688.6 637980003 637858658 636890221 636831322 637373161 637410889 636714973 635390968 634251633 632757301 632577515
698.2 632577515 633334885 633672867 634536400 634890709 635383568 635609055 635212212 635587234 634890327 634250832
707.9 634250832 635554619 636514435 637442207 638941116 639418411 640081482 641872482 642985535 642391357
716.6 642391357 641816483 642339020 642546692 642780609 643776627 644587936 645242462 646591721 647805939
725.2 647805939 648296127 649291306 649312592 648240662 647844620 647388000 646915207 646853638 647778091 649206085
734.9 649206085 649234619 648564987 648703461 649981689 651189499 651318817 650865784 650720291 651383362 652251740
744.5 652251740 653974304 655360489 655738297 657499771 659072266 659521942 659511032 659834747 661181107
753.2F61181107O16531J538238K227784J192474J425324J949081J243286n04990N1957
761.9F70920792q67615j592255M10767M87976Q66928L12805M59061R05609m425K56271
771.5F72155914m66766j36337M67224k4796j63803J116562K140656J467132J940384
780.2F78496170J521072J221466O23246j35193K11334o65512P17697J723328Q64639
788.9F84578247J095734J271362J042023R42535N68161q22830j259842l78494N60684
797.6F87597580n42297n56412J542587K048035J148147m33502M46930K33994p48902
806.2F90736160m08096j458511r6589J202851J191025J145324J125794J399154N59922
814.9F95397034N17883J239471N76477j689834j060181k15454l49960J576690J800919
$$ plain form
753.2 661181107 661797638 663335876 665563660 666756134 668181458 670130539 671373825 670868835 670920792
761.9 670920792 670053177 668460922 668871689 669359665 670226593 670539398 670998459 671904068 671899643 672155914
771.5 672155914 671689148 671552811 672020035 671995239 671831436 672947998 675088654 676555786 678496170
780.2 678496170 680017242 681238708 681861954 681726761 681938095 681272583 681990280 683713608 684578247
788.9 684578247 685673981 686945343 687987366 688929901 689498062 688675232 687415390 687036896 687597580
797.6 687597580 687055283 686498871 688041458 690089493 691237640 690804138 691251068 691485062 690736160
806.2 690736160 690328064 688869553 688772964 689975815 691166840 692312164 693437958 694837112 695397034
814.9 695397034 695914917 697154388 697730865 696041031 694980850 694765396 694415436 695992126 697793045
823.6F97793045M94766p95059l64227p55539j308594j427307k770996j452942j484680
832.3F87928467j587296n63431o44836n81055j421051p70034j72120j525802k788925
841F77873917k119828j418762j811294o20575N59387M89654L59497M22745p70645p61032
850.6F72203064O45218j04752M75998J790619J940842J793136J575089K406006K579879
859.3F85305099J809235R14078%O4850J290512M63562L17230J339874R39484K171402
868.9F94615326J473236N19028J64489k23083O03409m50516P5989J70212k31400L85513
878.6F97102203P55005P63321p20138j163178j946335j825256k011948k409210n90515
887.3F87953949k13699q31986r47723J025314J909256O59943L44696o82602r39102
$$ plain form
823.6 697793045 698287811 697492752 697128525 696372986 695064392 693637085 690866089 689413147 687928467
832.3 687928467 686341171 685777740 685132904 684551849 683130798 682360764 682188644 680662842 677873917
841 677873917 675754089 674335327 672524033 671903458 672462845 672952499 673311996 673734741 672964096 672203064
850.6 672203064 672848282 672743530 673219528 675010147 676950989 678744125 680319214 682725220 685305099
859.3 685305099 687114334 688028412 688028412 688093262 689383774 689847336 690164566 691504440 692443924 694615326
868.9 694615326 696088562 696607590 696772079 696548996 697152405 696701889 696777878 696948090 696716690 697102203
878.6 697102203 697857208 698620529 697900391 696737213 694790878 692965622 690953674 688544464 687953949
887.3 687953949 687740250 686908264 685960541 686985855 688895111 689555054 689899750 689217148 688278046
895.9F88278046m05350m41742l5706N88074j42670N46036J725388K40631k89688j078644
905.6F88984375k025681k258529k123795j114502j067123q35037l50800r55582j429519
914.3F76823807n71900r87701j948624j762237k467346k535477j730042o58874n17960
922.9F63643646q46939l96423q64945r59320l73993J16654j5030p29370n20172J79214
932.6F59233322K1668j51062J562957K393418J673279R96017Q3084L41416R72213J648712
942.2F68775024J704102J315002J463700J838531J932221R60922J550598J979141Q39081
950.9F82358322q1940n03921k84195j37787N53284J65329m73023p61032r46350p31125
960.6F79157562k153702k380905j681823j982651j626358j036072q41522j135864j005402
$$ plain form
895.9 688278046 687872696 687430954 687395248 687983322 687840652 688386688 690112076 690352707 690063019 688984375
905.6 688984375 686958694 684700165 682576370 681461868 680394745 679559708 679208908 678253326 676823807
914.3 676823807 676251907 675264206 673315582 671553345 669085999 666550522 664820480 664161606 663643646
922.9 663643646 662796707 662400284 661535339 660576019 660202026 660318680 660303650 659574280 659054108 659233322
932.6 659233322 659254990 659103928 660666885 663060303 664733582 665729599 665812683 666154099 667126312 668775024
942.2 668775024 670479126 671794128 673257828 675096359 677028580 677989502 679540100 681519241 682358322
950.9 682358322 682276382 681772461 681488266 681350479 681903763 682069092 681596069 680835037 679888687 679157562
960.6 679157562 677003860 674622955 672941132 670958481 669332123 668296051 667454529 666318665 665313263
969.2F65313263k73361m59442q42438p73239j488037k027665r53369m5547n48477m30451
978.9F57471237j72043q12301m44336o42777j912994k121582j671295j632080k037430
987.6F46024399j862488j501389r50775p92999j302566j939850k910157l089714k342033
996.2F29332428r74388m59099r62372k83623M93279q81538j817017o12602l26500r96056
1005.9F22512512j369819j844292j634407p88841n70984l7117M53071j085128j949692
1014.6F13685303j567116j598549j640778j372451j070214j269645q82759q90313r74197
1023.2F02419281m68979p19948j576233j949730j377105j187821j235504j623611r22013
1031.9E91358337l24936r71527m94766l81546J53465P0649k61460l39203o31446L0174
$$ plain form
969.2 665313263 665039902 664580460 663738022 662964783 661476746 659449081 658495712 658450165 657901688 657471237
978.9 657471237 657299194 656486893 656042557 655399780 653486786 651365204 649693909 648061829 646024399
987.6 646024399 644161911 642660522 641709747 640916748 639614182 637674332 634764175 631674461 629332428
996.2 629332428 628358040 627898941 626936569 626652946 627146225 626264687 624447670 623835068 623508568 622512512
1005.9 622512512 621142693 619298401 617663994 616875153 616304169 616267052 616720123 615634995 613685303
1014.6 613685303 612118187 610519638 608878860 607506409 606436195 605166550 604283791 603393478 602419281
1023.2 602419281 601950302 601230354 599654121 597704391 596327286 595139465 593903961 592280350 591358337
1031.9 591358337 591033401 590061874 589567108 589185562 589339027 589409676 589148216 588809013 588177567 588207741
1041.6E88207741k53258K54211N86434O13365L27759O0806J135140J56021k33879q1292
1051.2E90773048k93312J04332J98555N59159K40135L91655Q8539M6234L65601o02723
1060.9E91871223j034736j214676m96140L17536M58946J45493n58320m37965j76353
1069.5E88875008o02875o12793j89972o22330L09143M98276o29043J48239k81296q96835
1079.2E85995522j96877j91803l66096j58883K35634M9362n13954K41051N75676m26369
1088.8E85243263l22380l11317m47617j432876j317749j42403k020035j585579k7656
1097.5E77635651m48037j544990k612228j189156m12216r19762j513786p80869r98077
1106.2E67216530k065735j312103j442757p21855j045189r49402l64685j205368q01735
$$ plain form
1041.6 588207741 587954483 588208694 588795128 589408493 589736252 589797058 590932198 591088219 590854340 590773048
1051.2 590773048 590479736 590584068 590782623 591341782 591581917 591973572 592062111 592108345 592473946 591871223
1060.9 591871223 590836487 589621811 589125671 589443207 589902153 590047646 589489326 589051361 588875008
1069.5 588875008 588272133 587659340 587469368 586847038 587156181 587654457 587025414 587173653 586892357 585995522
1079.2 585995522 585798645 585606842 585240746 585081863 585317497 585366859 584852905 585093956 585669632 585243263
1088.8 585243263 584920883 584609566 584161949 582729073 581411324 581268921 579248886 577663307 577635651
1097.5 577635651 577187614 575642624 573030396 571841240 571429024 570509262 568995476 568214607 567216530
1106.2 567216530 565150795 563838692 562395935 561674080 560628891 559679489 559314804 558109436 557307701
1114.9E57307701p31773n29137o69212j6518k41890k16141N50423j2245O78024j48239
1124.5E55970993p8888L44086J45988n32036r85031J051293O11953M30069J44463r7351
1134.1E57005539N06973k59628j80855m83932o23513j105690l62243j6747o88171n82314
1143.8E53209419r17701J04789m58870j253624j864967j233635j2321k59705N47066
1152.5E47860451n58281k75650j9722N71632J575165O98776J358490Q05321Q70209
1161.1E52886391N62515P94678J784744K110329K760162J919517K116395J944808K694893
1169.8E69574432K637825K098160K762604J963615K597542K638741K545471K761917
1177.5E89580307L055611K858352J757698K204209J627807J160622J297226Q46100
$$ plain form
1114.9 557307701 556575928 556046791 555377579 555361061 555119171 554903030 555453453 555441208 556119232 555970993
1124.5 555970993 555892105 556236191 556382179 555850143 554865112 555916405 556528358 556958427 557102890 557005539
1134.1 557005539 557512512 557252884 557072029 556588097 555964584 554858894 554496651 554479904 553791733 553209419
1143.8 553209419 552291718 552396507 551937637 550684013 548819046 547585411 547573090 547313385 547860451
1152.5 547860451 547302170 547026520 547006798 547578430 549153595 549852371 551210861 552016182 552886391
1161.1 552886391 553448906 554243584 556028328 558138657 560898819 562818336 564934731 566879539 569574432
1169.8 569574432 572212257 574310417 577073021 579036636 581634178 584272919 586818390 589580307
1177.5 589580307 592635918 595494270 597251968 599456177 601083984 602244606 603541832 604387932
1185.3F04387932N39779J418229K140197J285630J537132J251068J310349J301879
1193F15172195L46146K44064M31862J374169O17141K03400J243935J531791J441231
1201.6F22605934P73125N90591j96304n22881k07138L22953J127815J54457J64108
1210.3F24812660R58252J004334P56073J27639m61654r51615n28717n5084M6654j19972
1220F25588570P2708N95855N17159N97305K29187k85949k91214n56717r75647p03240
1229.6F24788017p2326M13627N70565K35672O26068O37207K79503k23122n59693r2926
1239.3F26602592k29721J7167j27793j1749O93321M59747M46320K53143p4005o04553
1248.9F27424469k40593J03684m74854k1400K68211L12042J77994K90184J50146l13797
$$ plain form
1185.3 604387932 604927711 606345940 608486137 609771767 611308899 612559967 613870316 615172195
1193 615172195 615518341 615762405 616194267 617568436 618185577 618388977 619632912 621164703 622605934
1201.6 622605934 623379059 623969650 623773346 623250465 623043327 623366280 624494095 624648552 624812660
1210.3 624812660 625770912 626775246 627531319 627658958 627197304 626245689 625716972 625661888 625708542 625588570
1220 625588570 625661278 626257133 626774292 627371597 627600784 627314835 627023621 626466904 625491257 624788017
1229.6 624788017 624715691 625129318 625699883 625935555 626561623 627198830 627478333 627255211 626695518 626602592
1239.3 626602592 626372871 626390038 626262245 626250496 626943817 627403564 627849884 628103027 628029022 627424469
1248.9 627424469 627183876 627287560 626812706 626791306 627059517 627371559 627549553 627839737 627989883 627676086
1258.5F27676086l65104m87213L29780K92931J43776L53470K57034P78847P04116N12009
1268.2F30195732M08898J11923K06337J043701Q65898p5531N20706J142922Q16192
1276.9F35236778M07067O93702N76744Q1139J75476N37758J040153Q01011R82627J032792
1286.5F41565247O70700Q96072P69806O35223M89121P22732J049195J234359J151505
1295.2F49183960P99561R42001O35147M72488N04074M56086N20401L61175R39713R91897
1304.8F55806503N33753N10635M94766M70887P5836K16675M47921N97687N84183K73056
1314.5F60011902P90710P40967K58408j94321k0599Q91113M60510J35803K41089N13687
1324.1F63829269P68814M86374M81186K06604q6670K34528L08990N0583k81143o44607
$$ plain form
1258.5 627676086 627310982 626823769 627153549 627446480 627590256 627943726 628200760 628979607 629683723 630195732
1268.2 630195732 630604630 630716553 630922890 631966591 632832489 632756958 633277664 634420586 635236778
1276.9 635236778 635643845 636337547 636914291 636995430 637170906 637708664 638748817 639549828 640532455 641565247
1286.5 641565247 642235947 643132019 643901825 644537048 645026169 645748901 646798096 648032455 649183960
1295.2 649183960 649983521 650925522 651560669 652033157 652537231 652993317 653513718 653874893 654814606 655806503
1304.8 655806503 656340256 656850891 657345657 657816544 657892380 658109055 658556976 659154663 659738846 660011902
1314.5 660011902 660802612 661543579 661801987 661607666 661587067 662478180 662938690 663074493 663315582 663829269
1324.1 663829269 664598083 665084457 665565643 665772247 665685577 665920105 666229095 666279678 665998535 665353928
1333.8F65353928L22494O29730k060P69043K68631m71573m06341Q545N60837R5214
1343.4F67128448j7242l22723P3776M37851k24610k76260k56424k70309m94995m1657
1353.1F65735855l22113l97491J74560j59149J21689l45917j17187l90549p51495K00424
1362.7F63748627r35669j0376J74942l09906k58942j157913j035080l87726j69906
1371.4F59658051K15225k91443j531143m79813M08020N8823n99976o16226K0294m3945
1381F56797867K14538p7819j44349L17002J184692J454239j037521N87387J202392
1389.7F60498428R6283J74179N5542N75867l90015p16629P24869N01557N0048j926040
1399.3F59644089p52793J28937k41546m46854o03790j310959q79898P27615L82385
$$ plain form
1333.8 665353928 665676422 666306152 666304092 667073135 667341766 666870193 666463852 666472397 667033234 667128448
1343.4 667128448 667111206 666788483 666862259 667300110 667075500 666799240 666542816 666272507 665777512 665735855
1353.1 665735855 665413742 665016251 665190811 665031662 665153351 664807434 664690247 664299698 663548203 663748627
1362.7 663748627 662812958 662802582 662977524 662667618 662408676 661250763 660215683 659827957 659658051
1371.4 659658051 659873276 659581833 658050690 657570877 657978897 658037720 657437744 656821518 656841812 656797867
1381 656797867 657012405 656934586 656790237 657107239 658291931 659746170 658708649 659296036 660498428
1389.7 660498428 660594711 660768890 660824432 661400299 661010284 660293655 661018524 661520081 661570129 659644089
1399.3 659644089 658891296 659020233 658778687 658331833 657728043 656417084 655537186 656264801 656647186
1408F56647186k89535n62897n99899o17905r89151k26669K22778J56860n31387j91116
1417.7F53018265L57971k201614J087570J397018l28369j083832j257858K95410R66950
1426.3F52251511K59170N59540P84225l73611l6545p1792m37623j13449P01905P84149
1436F54307480m018097J09405K509537J170197N54352L06243k7923J44577J82342M1275
1445.6F55279388P7744l70407p12357Q71048R13925L02659L31039R36356J573944Q35876
1455.3F60039215j016083l895340j5106K561646J545562K336045J417846P90558J134720
1464F64899063j392059K34527J331025R74350J064605J230088K081146J267700m00314
1472.6F71290131O47125K496948K532806L04871J381760J861267O81763O12716j526
$$ plain form
1408 656647186 656357651 655794754 655194855 654576950 653587799 653361130 653583908 653740768 653209381 653018265
1417.7 653018265 653376236 651174622 652262192 653659210 653330841 652247009 650989151 651284561 652251511
1426.3 652251511 652510681 653070221 653854446 653480835 653444290 653372498 652934875 652821426 653523331 654307480
1436 654307480 650289383 650398788 652908325 654078522 654632874 654939117 654911194 655055771 655238113 655279388
1445.6 655279388 655357132 654986725 654274368 655145416 656059341 656362000 656693039 657629395 659203339 660039215
1455.3 660039215 659023132 655127792 655112686 657674332 659219894 661555939 662973785 663764343 664899063
1464 664899063 663507004 663741531 665072556 666046906 667111511 668341599 670422745 671690445 671290131
1472.6 671290131 671937256 674434204 676967010 677271881 678653641 680514908 681196671 681809387 681807861
1481.3F81807861P37152J320420Q59604M29840M36859k2888q92182M38385k181778
1490F82933273j546936J496659P69500k01263J31378M28619m512786N44738j003265
1498.7F79039917k894745N78766p24106q23974o37207R45968L4256o953735m931717
1507.3F63633423j122055J341018j104049J036835j215439k550888j79139j010742
1515.1F58828964r5825l225250k826691J715241K317810j456299n235901K04391J8540
1523.7F50244980P44324l174820p70264N09644p26014l26004n48629k91748j106797
1532.4F44554672j443557l190384J148376R28726J22681K189484l007737n681152K007904
1541.1F37629013M71382r78088R47952J092186k099266J405449O12183M68254m3755
$$ plain form
1481.3 681807861 682545013 683865433 684725037 685154877 685591736 685568848 684676666 685115051 682933273
1490 682933273 681386337 682882996 683652496 683451233 683582611 684011230 679498444 680043182 679039917
1498.7 679039917 676145172 676723938 675999832 675175858 674538651 675484619 675518875 668565140 663633423
1507.3 663633423 662511368 663852386 662748337 663785172 662569733 660018845 659839706 658828964
1515.1 658828964 658733139 655507889 652681198 654396439 656714249 655257950 650022049 650226440 650244980
1523.7 650244980 650989304 647814484 647044220 647553864 646827850 646501846 645953217 645661469 644554672
1532.4 644554672 643111115 639920731 641069107 641997833 642120514 644309998 641302261 635621109 637629013
1541.1 637629013 638100395 637122307 638070259 639162445 637063179 638468628 639080811 639549065 639505310
1549.8F39505310j249237J435318J100311J527329j435623M11682L050766K937774
1557.5F47283630L04261j6816712N780106N717621L274612J529999L89786m77143L41034
1566.2F47327194J995774J370162N13840l409195R34143J663819J54571K77634J13220
1574.9F50941162K7008l841858J213532Q30688j34506K68402q36716l37371o89927
1583.5F47440414j41906o71311j206970o62003j320648q98590j864929q59756r26667
1592.2F38887634q80890j318397k475166j119500j852493j181831k038155j400146
1599.9F26621056j564217j931915o76728k190666j270408j976891j684723k602920
1607.6F12722588k233010j945801l301696r39331k153397j381836j957779m33998K01683
$$ plain form
1549.8 639505310 638256073 639691391 640791702 642319031 640883408 641295090 644345856 647283630
1557.5 647283630 647587891 630771179 636551285 642268906 645543518 647073517 647463303 646986160 647327194
1566.2 647327194 649322968 650693130 651206970 647797775 648731918 650395737 650550308 650827942 650941162
1574.9 650941162 650968170 647126312 648339844 649170532 649036026 649304428 648467712 648130341 647440414
1583.5 647440414 647298508 646627197 645420227 644758224 643437576 642538986 640674057 639814301 638887634
1592.2 638887634 638006744 636688347 634213181 633093681 631241188 630059357 628021202 626621056
1599.9 626621056 625056839 623124924 622448196 620257530 618987122 617010231 615325508 612722588
1607.6 612722588 610489578 608543777 605242081 604302750 602149353 600767517 598809738 598375740 598577423
1616.3E98577423r290123k96516j229210r47533k226486n79071j008225o277694l69797
1625E76352768p40852K09579l428764k629319q53195j627350j123199k101402M54063
1633.7E64512329l56560l505020k559166L87764j3504m71687L65944j476097L58314
1642.4E57242317o57882R49096J401482k095185R85222j917610K457123J154671K626762
1651E62145996M491425M717445j2391014j311874L904228J488304J830139J223068
1658.8E66097717J250000J453095J286850J445541j492233J958847J248588J201745
1666.5E74450150J593437J488037P78236j49116K910156N66101K374115K534637N23530
1675.1E87069283j54381K026176L294792J529045J636239O01120L152427M787750J153069
$$ plain form
1616.3 598577423 589287300 588990784 587761574 586814041 584587555 584008484 583000259 576722565 576352768
1625 576352768 575611916 575821495 572392731 569763412 568910217 567282867 566159668 564058266 564512329
1633.7 564512329 564155769 560650749 558091583 558479347 558465843 557994156 558360100 556884003 557242317
1642.4 557242317 556584435 557533531 558935013 556839828 557825050 555907440 558364563 559519234 562145996
1651 562145996 566637421 571354866 558963852 557651978 561556206 563044510 564874649 566097717
1658.8 566097717 567347717 568800812 570087662 571533203 570040970 571999817 573248405 574450150
1666.5 574450150 576043587 577531624 578309860 578160744 581070900 581637001 584011116 586545753 587069283
1675.1 587069283 586914902 588941078 592235870 593764915 595401154 596002274 599154701 603942451 605095520
1683.8F05095520l929634N46646M900780K616348J552811K206344J502114K916870
1691.5F17407799K390556K792549K876587K695732q52813L398323M718132L633270
1699.3F39060135J190033l799019N989189M358139L085938K293853J830445J804809
1707F55813522K179947L158798J945267J518555K140884K339020K374344K53677J021118
1715.6F72745132K696305J291351l930588K723236K720032N96237N71747K25601L52555
1724.3F79991608R79614J038055J145935J034317J783905L6011j13678K305374J960068
1733F90161209l156357n785446M688568L185730J610642K424164l16697j200561L176193
1741.7F94787445K011566j075287L87650K481918J827317J330261J297531O35452L056870
$$ plain form
1683.8 605095520 601165886 601712532 606613312 609229660 610782471 612988815 614490929 617407799
1691.5 617407799 619798355 622590904 625467491 628163223 627310410 630708733 635426865 639060135
1699.3 639060135 640250168 636451149 642440338 646798477 649884415 652178268 654008713 655813522
1707 655813522 657993469 661152267 663097534 664616089 666756973 669095993 671470337 671724014 672745132
1715.6 672745132 675441437 676732788 672802200 675525436 678245468 678841705 679413452 679639053 679991608
1724.3 679991608 680971222 682009277 683155212 684189529 685973434 686009445 685895767 688201141 690161209
1733 690161209 687004852 681219406 685907974 689093704 690704346 693128510 692811813 691611252 694787445
1741.7 694787445 696799011 695723724 696111374 698593292 700420609 701750870 703048401 703683853 706740723
1750.4G06740723J207351k10800L485642K030105J376496J669387j321640R53598K305909
1759G18236771J831894K286911q65784K54516K290574O08596M20456J063309R06982
1767.7G27034225j675796Q69598K569886N81970k365570j584397L216172J682129p64389
1776.4G29563828J470718O60553L34244n46875j535569J033020J776658J372909m51813
1785.1G33677673n10559R38950N47943K75955P62329j31912j7242j389389q24509K212829
1794.7G35542068P87507m73328J028366J439362n33524j482773R44824n68847J68609
1803.4G36852264J434174M47693L08380r7504J34125J067352M94004j776581m47617
1812.1G38416290O86875M64706O92291j38931n8975k70081O13785Q65326j80969N41153
$$ plain form
1750.4 706740723 707948074 707737274 711222916 713253021 714629517 716298904 714977264 715930862 718236771
1759 718236771 720068665 722355576 721489792 721744308 724034882 724643478 725063934 726127243 727034225
1767.7 727034225 725358429 726228027 728797913 729379883 727014313 725429916 728646088 730328217 729563828
1776.4 729563828 731034546 731695099 732029343 731482468 729946899 730979919 732756577 734129486 733677673
1785.1 733677673 733167114 734106064 734654007 734929962 735692291 735560379 735543137 734153748 733329239 735542068
1794.7 735542068 736329575 735856247 736884613 738323975 737790451 736307678 737252502 736683655 736852264
1803.4 736852264 738286438 738734131 739042511 738945007 739079132 740146484 740640488 738863907 738416290
1812.1 738416290 739103165 739567871 740260162 740121231 740062256 739792175 740405960 741271286 741090317 741631470
1821.7G41631470L9825N61905L48282k673340P0877J626434J375504j70441k890777
1830.4G39919739J244278J606292m75082k27737J58691K84119k94342o35376N17425
1839.1G42098007K31476P05109N76324R64356J47857m099655J260376J301193o46515
1847.8G42538528n40390M08249O33774L10440N54733O6224L77502k14615m13666L35617
1857.4G44056396l34625j75171r5062J85471R4223M03061L14560j65863N29479o1721
1867.1G44750748K288j596069j576462J000367P36465M04129K2583M99878K18811K289
1876.7G44465027L14407r6512q2855l83606k24151k8840K63978k56043m94308N59082
1886.3G44036179M06646O20728m88358j983947M84771Q22373m9286J82037k87094n01862
$$ plain form
1821.7 741631470 741671295 742233200 742581482 739908142 739979019 741605453 742980957 742810516 739919739
1830.4 739919739 741164017 742770309 742295227 742067490 742226181 742510300 742215958 741580582 742098007
1839.1 742098007 742329483 743034592 743610916 744575272 744723129 740623474 741883850 743185043 742538528
1847.8 742538528 741998138 742406387 743040161 743350601 743905334 743971558 744349060 744134445 743720779 744056396
1857.4 744056396 743721771 743546600 743451538 743637009 743731232 744134293 744448853 744282990 744812469 744750748
1867.1 744750748 744753036 743156967 741580505 742580872 743317337 743721466 743744049 744243927 744462738 744465027
1876.7 744465027 744779434 744682922 744600067 744216461 743992310 743963470 744227448 743971405 743477097 744036179
1886.3 744036179 744442825 745063553 744575195 742591248 743076019 743898392 743849106 744031143 743744049 743242187
1896G43242187M13895K4872k09732M6997J89514k26135j09406O18439k57645m18548
1905.6G43314438n6076o8894j34735o5994j40381k38571M94919k95563o7596K02102
1915.3G42943649k5253O08139j580658n11856J053696N10635J39084j178436m91486
1923.9G41467514L20053K03247j5487K3651j05515k20947N4626j86996K48184O7749
1933.6G41856079k39029l32489m57306q2550j36108o5384j61667O71158O3705j511612
1943.2G39604797N50614N79300k95105k81525j78833k441j26038k76260j11618K63900
1952.9G39726791L23334J42288m37545l68348j92718k58484J69754j55334q8501K37960
1962.5G39099197R1553l5019j59683J16959m73404n95169K16751k80686l64914L19825
$$ plain form
1896 743242187 743656082 743680954 743471222 743518219 743707733 743481598 743372192 743990631 743732986 743314438
1905.6 743314438 743258362 743189468 743054733 742988739 742848358 742609787 743104706 742809143 742741547 742943649
1915.3 742943649 742918396 743526535 741945877 741434021 742487717 742998352 743137436 741959000 741467514
1923.9 741467514 741787567 741990814 741975327 741998978 741893463 741672516 741727142 741540146 741788330 741856079
1933.6 741856079 741617050 741284561 740827255 740744705 740608597 740543213 740381546 741052704 741116409 739604797
1943.2 739604797 740155411 740734711 740439606 740158081 739979248 739976807 739850769 739574509 739462891 739726791
1952.9 739726791 740050125 740192413 739754868 739386520 739193802 738935318 739105072 738949738 738861237 739099197
1962.5 739099197 739190750 739155731 738996048 739113007 738639603 738044434 738261185 737980499 737615585 737935410
1972.2G37935410k6627k11411J22300M5242J39770N1423m00544m26483k21405j79825
1981.8G36827850o8359j38397l14331j21155K09274R0943p26853l12729P30896n6991
1991.5G36120148j413422m01535O42242K3499j28784J63803j19248l06320l02276j12534
2001.1G34165573l93982k15835l662k08054K441j94091k15760j66397j02615r1171
2010.7G32576447k57569j34353m07715j79138L30352k28653n98602O0883o714j32218
2020.4G31022720L02964P8888k24610m71191m60053j61590j4878j71203j77307J64337
2030G29888077j30921k59933l97720l37143j37253k22168q4763l02276K36129P0954
2039.7G28322983l83530J49994O104k09656n03083K2660P3013l31879q7585l97949
$$ plain form
1972.2 737935410 737908783 737697372 737819672 737864914 738004684 738056107 737655563 737229080 737007675 736827850
1981.8 736827850 736759491 736621094 736306763 736185608 736394882 736485825 735758972 735446243 736177139 736120148
1991.5 736120148 734706726 734305191 734947433 734970932 734842148 735005951 734886703 734580383 734278107 734165573
2001.1 734165573 733771591 733555756 733552094 733344040 733346481 733152390 732936630 732770233 732667618 732576447
2010.7 732576447 732318878 732184525 731776810 731597672 731928024 731699371 731100769 731161652 731154938 731022720
2020.4 731022720 731325684 731404572 731179962 730708771 730248718 730087128 730072250 729901047 729723740 729888077
2030 729888077 729757156 729497223 729099503 728762360 728625107 728402939 728318176 728015900 728252029 728322983
2039.7 728322983 727939453 728089447 728095551 727885895 727382812 727405472 727478485 727146606 727059021 726661072
2049.3G26661072j55335Q0719M25873K26517m66538m17480m83322m4632j84555n87845
2059G25054474k88468K2355J1749r7656L60260J10015k70385K3422q9035m52347n97076
2069.6G23787308k67258J9989k68784k82211L51868J2665l25241J27868N4932j25961
2079.2G23085175l02277j91574j99585m54636j93786J93481M7379k56348O3248J77383
2088.9G21968460K08511l5476m84238m50821m49066J49002N19257O2790m30832m22898
2098.5G20634689P0877M7074k58866k78015j38702j06354j00326O1264O26983M46854
2108.1G21005478l92761j98288r766N875l81089m14428J95999j92337k12937j32141
2117.8G19273605m2190K08206J1597K43225K91748j87302m31595m1198j38627l40499
$$ plain form
2049.3 726661072 726505737 726586456 727012329 727238846 726772308 726354828 725871506 725826874 725642319 725054474
2059 725054474 724766006 724788361 724800110 724702454 725062714 725172729 724902344 724925766 724836731 724384384 723787308
2069.6 723787308 723520050 723540039 723271255 722989044 723340912 723353577 723028336 723156204 723211136 723085175
2079.2 723085175 722782898 722591324 722391739 721937103 721743317 721936798 721984177 721727829 721791077 721968460
2088.9 721968460 722176971 722141495 721657257 721206436 720757370 720906372 721425629 721488419 721057587 720634689
2098.5 720634689 720705566 720752640 720493774 720215759 720077057 719970703 719870377 719931641 720558624 721005478
2108.1 721005478 720612717 720414429 720404663 720410538 720029449 719615021 719811020 719618683 719405746 719273605
2117.8 719273605 719231415 719439621 719451218 719694443 719986191 719798889 719367294 719326096 719187469 718846970
2127.4G18846970j67389j25733K52915K38037J71737k49176n13839M4327n6992j65329
2137.1G18275528N0964L3570k67640p3394J60675n9738M07943N05905j85928n16586
2146.7G18331299l58658m18472l22571J14746K48947J97373M577K52838L09220q6212
2156.4G18273087k81449k63748l62396n92575K07290M21677Q1253M28009K44217J0147
2166G18165512j41449j53885j61972l40881l20893q5372J97677J45874N6000j85089
2175.6G17175522m7226R1095o7215J5335l18832m7760M46624J1673k61001q0872j8997
2186.3G16898346J56403J71127l78571l16620o3247k5788L71399K47727l60871k90832
2195.9G16409073J97525j0758l3493L06549r1476m12521o9733o0959k49557p0420r0942
$$ plain form
2127.4 718846970 718679581 718553848 718806763 719044800 719216537 718967361 718453522 718497849 718440857 718275528
2137.1 718275528 718326492 718360062 718092422 718019028 718179703 718119965 718527908 719033813 718847885 718331299
2146.7 718331299 717972641 717554169 717231598 717346344 717595291 717792664 717797241 718050079 718359299 718273087
2156.4 718273087 717991638 717727890 717365494 716772919 716980209 717401886 717483139 717911148 718155365 718165512
2166 718165512 718024063 717870178 717708206 717367325 717046432 716961060 717158737 717304611 717360611 717175522
2175.6 717175522 717128296 717219391 717152176 717167511 716848679 716800919 717247543 717259216 716998215 716917343 716898346
2186.3 716898346 717054749 717225876 716847305 716530685 716467438 716441650 716813049 717060776 716699905 716409073
2195.9 716409073 716606598 716595840 716562347 716868896 716777420 716364899 716295166 716234207 715984650 715914230 715823288
2206.5G15823288K60391K61536k28043p9345o9504N7983j90658m36020R9411K41623
2216.1G15740662j8387k88620j78299O5536K76413J28937j92795N6305P9575k49863
2225.8G15419464n29556k56272J71586J97219J84632k823j86234n2642Q7661l82766
2235.4G14650269m02604L8529j16348o8741m1046k84119j43738M01001K67258l71704
2245.1G13928757l03116j35498j16348m960p1716k66952q5755J83182L01437K98233
2254.7G13727264Q3466k3041n20630n76172n8364J18408r3537m97512L81L10822K3956
2265.3G12495041O7596K44446R2468k99072r0332j54190k18506P4768K17743K39029
2275G12668991n6763r9563l1510L2730m04586n57480m5319q316o7596j66626J89438
$$ plain form
2206.5 715823288 716083679 716345215 716117172 716037827 715968323 716026306 715835648 715399628 715499039 715740662
2216.1 715740662 715722275 715433655 715255356 715320892 715597305 715726242 715533447 715589752 715669327 715419464
2225.8 715419464 714889908 714633636 714805222 715002441 715187073 715184250 714998016 714945374 715033035 714650269
2235.4 714650269 714247665 714286194 714169846 714101105 714060059 713775940 713632202 714033203 714300461 713928757
2245.1 713928757 713625641 713490143 713373795 713368835 713297119 713030167 712944412 713127594 713429031 713727264
2254.7 713727264 713810730 713787689 713267059 712690887 712632523 712750931 712657394 712159882 712160263 712471085 712495041
2265.3 712495041 712562637 712807083 712899551 712600479 712510147 712355957 712137451 712212219 712429962 712668991
2275 712668991 712612228 712512665 712481155 712513885 712109299 711551819 711506500 711498184 711430588 711263962 711453400
2285.6G11453400J80587K9755Q2092l07312N875r7809j84479m2038k99148K3193K90222
2296.2G11134338P7210j20545M48990K78549k52914j55640m85077l23715n4626M72946
2305.8G11019516K13242m23508L79028O53992K59552k69470k6627J9760m17709k22016
2315.5G11185760o53610m9438o7368l89862N91812K28043M40216M10767o15235n41916
2325.1G10539169p7820M11530J93787j07727J25274M8142m46015M15192J287003O179
2334.8G12394714o48803r35517Q40R76867l72162l5934L80478Q8348J61438p25021
2344.4G11285248o84815J90888N13916l44010M044M51431l22571J161957J339722l90472
2354.1G13205338l35694o44913k75192J29929N51605J48239n5466m57305j503449l20435
$$ plain form
2285.6 711453400 711633987 711663742 711745834 711438522 711444397 711346588 711162109 711120071 710820923 710844116 711134338
2296.2 711134338 711211548 711091003 711539993 711818542 711565628 711409988 710924911 710601196 710546570 711019516
2305.8 711019516 711232758 710809250 711188278 711842270 712101822 711832352 711805725 711825485 711407776 711185760
2315.5 711185760 710532150 710482712 710415344 710025482 710617294 710845337 711285553 711696320 711081085 710539169
2325.1 710539169 710461349 710872879 711066666 710958939 711084213 711132355 710686340 711101532 712388535 712394714
2334.8 712394714 711745911 710810394 710811234 711788101 711415939 711380005 711760483 711848831 712010269 711285248
2344.4 711285248 710600433 710791321 711305237 710961227 710965271 711416702 711094131 712256088 713595810 713205338
2354.1 713205338 712869644 712224731 711949539 712079468 712631073 712779312 712723846 712266541 710763092 710442657
2363.7G10442657M30146O38427k85568n20630k18811j210556k0675O48269j71127N0049
2373.3G09782181M17328J18026j65939O7139K58331R5596m50210n48554j58920J17111
2383G09532089J32141j55334l37982k57263J74407M35486L47748R2850j49765j06278
2392.6G09708099l37448l37829j04981O8436J18561m20914j76849K79541j57547p1412
2402.3G08567657l1356l26386J59073K65121k85568k98309p4387j25045j04752M00009
2411.9G08146057M36936k34681m71191l19214k06604j67236j43967j41449K43988L13263
2421.6G07455902j07117K74353J82953l70025l54004l28598r4910k72598m44870Q0795
2431.2G06021881K35443J77765J15967p1793P2556R7198j15738m27932p45240l91159
$$ plain form
2363.7 710442657 710872803 711511230 711225662 710705032 710486221 709275665 709254990 709903259 709732132 709782181
2373.3 709782181 710199509 710317535 710151596 710218735 710477066 710572662 710122452 709573898 709414978 709532089
2383 709532089 709664230 709508896 709170914 708913651 709088058 709523544 709871292 709964142 709814377 709708099
2392.6 709708099 709370651 709032822 708927841 708996277 709114838 708693924 708517075 708796616 708639069 708567657
2402.3 708567657 708536301 708209915 708368988 708634109 708348541 708050232 707975845 707850800 707746048 708146057
2411.9 708146057 708582993 708348312 707877121 707557907 707351303 707184067 707040100 706898651 707142639 707455902
2421.6 707455902 707348785 707623138 707806091 707436066 707082062 706753464 706658554 706385956 705941086 706021881
2431.2 706021881 706257324 706435089 706551056 706479263 706551819 706649017 706533279 706105347 705360107 704968948
2440.8G04968948L3265J71737J86081J61133J45264j79596j02692j09558l13492j17493
2450.5G04843597j44653j54419j64261P0496K97775Q1330K05230L4561m66308m18396
2460.1G04184952m47846m99344k36892j38245L13034L68500p1106J05743j71661m85306
2469.8G02921829l45230p9880K7924j99661n4245j03760R8801J75857q1482j9378m02222
2480.4G01938553l48587k25525j92413r8725j56479P0801k02637Q9951L88107J39237
2490G01402283Q2168n82123o14166l57513k10343K30179j55334k75650J23901O9275
2499.7F99712677n188K670j9531j07880m24194m03290j61972l01971J52P3853m01535
2510.3F97963791j87225j36109m501K92282k9984j14975l82843l77960J51749L5324
$$ plain form
2440.8 704968948 705002213 705173950 705360031 705521164 705666428 705486832 705384140 705274582 704961090 704843597
2450.5 704843597 704698944 704544525 704380264 704450760 704748535 704829865 705035095 705069656 704603348 704184952
2460.1 704184952 703737106 703237762 703000870 702862625 703175659 703544159 703473053 703578796 703407135 702921829
2469.8 702921829 702576599 702496719 702524643 702324982 702270737 702166977 702265778 702441635 702360153 702340775 701938553
2480.4 701938553 701589966 701364441 701172028 701073303 700916824 700987625 700784988 700874939 701263046 701402283
2490 701402283 701484451 700902328 700288162 699930649 699720306 699950485 699795151 699519501 699643402 699712677
2499.7 699712677 699707489 699710159 699690628 699582748 699158554 698755264 698593292 698291321 698291473 698365326 697963791
2510.3 697963791 697776566 697640457 697635956 697928238 697898254 697783279 697400436 697022476 697174225 697209549
2519.9F97209549j8997J69830J25351l13568n93796r003M86527J77841l76205m58908
2529.6F96398621l97416m33654j02692L19519K20642J11847J09482l46985j76239J91803
2539.2F95894928j10931m26636l56293J22452j57395l50952l8299M9820J88064j16195
2548.9F94698563j62201j88141k37122r0713k49405K1972L27073J02386l76739j08338
2558.5F93737335n1880m58908R6588K3194m66538k87628K8610j93100j01394O62918
2568.1F92989197M1885o28052n25131l74908M1198P6752j80664m13666n1498K52914
2577.8F91228027O5918n0583q3923k08206o22559l16314k1897k72140j3123K40250
2587.4F89945450N7144k17133k12097k38647j59760j21612n27878m54025Q5525K00348
$$ plain form
2519.9 697209549 697190552 697360382 697485733 697172165 696578369 696569366 697055893 697233734 696857529 696398621
2529.6 696398621 696001205 695567551 695464859 695784378 696005020 696116867 696226349 695879364 695703125 695894928
2539.2 695894928 695783997 695357361 695001068 695123520 694966125 694615173 694576874 694626694 694814758 694698563
2548.9 694698563 694536362 694348221 694111099 694020386 693770981 693792953 694120026 694222412 693845673 693737335
2558.5 693737335 693685455 693226547 693323135 693346329 692879791 692592163 692620773 692427673 692326279 692989197
2568.1 692989197 693031082 692403030 691877899 691502991 691544189 691620941 691440277 691026611 690975113 691228027
2577.8 691228027 691293945 691243362 691159439 690951233 690328674 690012360 689990463 689718323 689705200 689945450
2587.4 689945450 690002594 689785461 689573364 689334717 689174957 689053345 688525467 688071442 688156967 688357315
2597.1F88357315p7743l37677n29557j98593J90506q0795n22003o17447j11466J24970
2606.7F86197510M9286j99890m31748Q2474K37884p3547m31213l81928J15433q4076
2616.4F85080185l58734m45938l51563K32849K23618n69458o76804R0409K40478j45187
2626F83319855l50037m28162j56707R918k44217l82233l25317j09329o8131k75268
2635.6F80990372j51673r4833k45590l41339k68250j41754k86789k16751k34375k7008
2645.3F78982010J13754n95550l26081J30463j88828j84860l07770k44293j44882j11237
2654.9F77122726K46659J04065l56751n19409k83203m02069n39780J82190J38702l25775
2664.6F75367355l39584l84903j22681j2664K35138j71204r78012k69013K47269j96762
$$ plain form
2597.1 688357315 688279572 687941895 687412338 687213745 687404251 687323456 686801453 686184006 686072540 686197510
2606.7 686197510 686246796 686046906 685615158 685697632 685935516 685861969 685430756 685048828 685164261 685080185
2616.4 685080185 684721451 684275513 683923950 684156799 684380417 683810959 683134155 683224564 683465042 683319855
2626 683319855 682969818 682541656 682384949 682394867 682150650 681768417 681443100 681333771 681265640 680990372
2635.6 680990372 680838699 680743866 680498276 680156937 679888687 679746933 679460144 679243393 679009018 678982010
2645.3 678982010 679095764 678500214 678174133 678304596 678115768 677930908 677623138 677378845 677233963 677122726
2654.9 677122726 677369385 677473450 677116699 676597290 676314087 675912018 675372238 675554428 675693130 675367355
2664.6 675367355 675027771 674642868 674520187 674507523 674742661 674571457 673593445 673324432 673571701 673374939
2674.2F73374939l49655l662m1504k12631K1057k08969l13645m77371m09622q621j46256
2684.8F71224060J72653K0829o09589l49884K975j93939j22528K70004q6975l32489
2694.5F69995117m51889o56814l28217j40076o0119m3030j66855k04773n8517k54364
2704.1F67630463m73328j18790j21689k65045j81121J38320O5308m66232m78821l91617
2713.8F65337448k11410k98767k41547J03378j71585l22418l70331k93732j51901J8006
2723.4F63397141L29055J11466j53504l91311o79322o92215n34515l04031j45874j47934
2733F60788956k16217L3569J42593l34396n98450q4991L61938r6130m50134k20414
2742.7F59326324l94439n40543L8223K09656l01056l77426j78299m69665n84717k04086
$$ plain form
2674.2 673374939 673025284 673021622 672980118 672767487 672788544 672579575 672265930 671788559 671378937 671370316 671224060
2684.8 671224060 671396713 671417542 670807953 670458069 670461044 670267105 670144577 670414581 670327606 669995117
2694.5 669995117 669543228 668886414 668558197 668418121 668358002 668314972 668148117 667943344 667884827 667630463
2704.1 667630463 667157135 667038345 666916656 666651611 666470490 666608810 666674118 666207886 665729065 665337448
2713.8 665337448 665126038 664827271 664585724 664689102 664517517 664195099 663824768 663531036 663379135 663397141
2723.4 663397141 663726196 663837662 663684158 663292847 662613525 661921310 661386795 661082764 660936890 660788956
2733 660788956 660572739 660606308 660748901 660414505 659816055 659731064 660093002 659996872 659546738 659326324
2742.7 659326324 658931885 658391342 658429565 658639221 658338165 657960739 657782440 657312775 656728058 656523972
2752.3F56523972N4321J11389k03629l3950R5520m60129j84555j26724l91388l29132
2762F55055695j84479J00250m86298o70471j78604J02081K12021l94821p54623n86396
2771.6F52214355l59497k07672j66397j66168k39487k86178m28467k49176r4147P9041
2781.3F50096207J48391m65240o72455o71921n31082R3308Q7890m19388j16729J73416
2790.9F47722397o94885o22788R4223l39203m77829l12423m07410l72315n43670m85993
2800.5F43560104K2812l6468o59790n58396k04925m07410l24249k82593m24347k57416
2810.2F40427322l70788n71594m80347l32298k66953j68877l51219n02052j72310o75201
2819.8F36535683q43544m9057j69411l90587l77006p90329r32427l35541l47595p61871
$$ plain form
2752.3 656523972 656578293 656689682 656486053 656452103 656547623 656087494 655902939 655776215 655384827 655055695
2762 655055695 654871216 654971466 654485168 653814697 653636093 653738174 653950195 653555374 652800751 652214355
2771.6 652214355 651854858 651647186 651480789 651314621 651075134 650788956 650360489 650111313 650017166 650096207
2781.3 650096207 650244598 649779358 649106903 648434982 647903900 647997208 648085098 647665710 647548981 647722397
2790.9 647722397 647027512 646404724 646498947 646159744 645681915 645369492 644962082 644589767 644046097 643560104
2800.5 643560104 643582916 643546448 642886658 642328262 642123337 641715927 641391678 641109085 640684738 640427322
2810.2 640427322 640056534 639484940 639004593 638672295 638405342 638236465 637885246 637383194 637210884 636535683
2819.8 636535683 635692139 635643082 635473671 635083084 634706078 633915749 632983322 632647781 632300186 631538315
2829.5F31538315j51024k03171p04841n36576m44755o31943o80695j73568n23224j095352
2839.1F26393166r42574j299133j461869j038665p82967j192703j425324j215324j469612
2847.8F15564995j291771j193237j400948q87413p15141o96984m30336o3133L71285
2856.5F09257317j12763j488N23339k81143n20287l65562m38004l63541o23474o31256
2866.1F06443138m90303k37541l43132n88875l75938m55819l47557k40211m35791m22135
2875.8F02505836k75306l48816m37584k34718o4507j10168n47791m43344k46239k28157
2885.4E99569206l0975p89986r13734o08292n15785J21269j07803p56836q86116n40695
2895.1E94540253n24750r29375j042251q11615k66343k78511l92684j69983j96724
$$ plain form
2829.5 631538315 631387291 631184120 630479279 629942703 629497948 628866005 628185310 628011742 627488518 626393166
2839.1 626393166 625450592 624151459 622689590 621650925 620867958 619675255 618249931 617034607 615564995
2847.8 615564995 614273224 613079987 611679039 610791626 610076485 609379501 608949165 608886032 609257317
2856.5 609257317 609144554 609143066 609666405 609385262 608864975 608499413 608061409 607697868 607074394 606443138
2866.1 606443138 605952835 605715294 605372162 604783287 604407349 603951530 603603973 603363762 602927971 602505836
2875.8 602505836 602230530 601881714 601444130 601209412 601144905 601034737 600486946 600043602 599797363 599569206
2885.4 599569206 599538231 598748245 597834511 597226219 596710434 596831703 596723900 595967064 595080948 594540253
2895.1 594540253 594015503 593086128 592043877 591232262 590965919 590687408 590294724 590124741 589928017
2903.7E89928017m96445n18494m30832o90155o02493o27403n96733o42548q94928p07168
2913.4E83720818r71451j152878o67267l56216p70531p26967o55327j283607j082993
2922.1E76053581l84178N35507L6660m03710L7460o18057K85034L72124o31370r1973
2931.7E75191078J65634K27623K37847L61671J39160J90125O55098L31764J86806L79295
2941.3E78066101O25305M75617J68762j31836j0872L27950l09410l79410m1161O4736
2951E78855782j24894p32879q54950j078186n27649J21345k35977j65787k49519m50821
2960.6E74556465J24741O50825J33209k71987K6626J24664N25208L43590J40877P58132
2970.3E77112350K65198K56844Q84285M11415j36261j88255O89964R27238K09122K68211
$$ plain form
2903.7 589928017 589431572 588913078 588482246 587792091 587189598 586562195 585965462 585322914 584427986 583720818
2913.4 583720818 582749367 581596489 580929222 580573006 579802475 579075508 578420181 577136574 576053581
2922.1 576053581 575669403 576204910 576241570 575837860 575875320 575257263 575542297 575914421 575283051 575191078
2931.7 575191078 575356712 575584335 575822182 576183853 576323013 576513138 577168236 577500000 577686806 578066101
2941.3 578066101 578691406 579167023 579335785 579203949 579193077 579521027 579211617 578832207 578791046 578855782
2951 578855782 578730888 577998009 577143059 576064873 575537224 575658569 575422592 575256805 575007286 574556465
2960.6 574556465 574681206 575332031 575465240 575193253 575219879 575344543 575869751 576213341 576354218 577112350
2970.3 577112350 577377548 577634392 578518677 578930092 578793831 578605576 579295540 580222778 580431900 580700111
2979.9E80700111M27323K97584J69220R4300N2871N31884M80842r7885L10822J37290
2989.6E83104362j2664M24385M38347K55508l1090J29242p3433k29912M8676P935M5204
3000.2E84106560l0136M081P1183k33956p23648o56509m75426l93906L88565J9913
3009.8E82076721n90019J00746k2735m29078l78723m13399k75955k28309j91346l54576
3019.5E79293327o03103l47786l23830l47786j86729n11093q81997o44035K899k56271
3029.1E75193596p50885m74396m47006k25830k0981n74379p67708j43242j9493k44064
3038.7E71525612k32964p32917p37763k07214n70298r66949l37372m48990j006622
3047.4E66284523l86086m05235l80325m02641j078377n12276k13203l76168r9716k34909
$$ plain form
2979.9 580700111 581127434 581425018 581594238 581688538 581741409 582273293 582754135 582656250 582967072 583104362
2989.6 583104362 583091698 583516083 583954430 584209938 584178848 584308090 584234657 584004745 584053421 584061356 584106560
3000.2 584106560 584076424 584080505 584151688 583917732 583194084 582537575 582062149 581668243 582056808 582076721
3009.8 582076721 581486702 581587448 581564713 581135635 580756912 580343513 580067558 579839249 579647903 579293327
3019.5 579293327 578690224 578342438 578018608 577670822 577484093 576973000 576091003 575446968 575449867 575193596
3029.1 575193596 574442711 573968315 573521309 573295479 573274498 572700119 571932411 571789169 571769676 571525612
3038.7 571525612 571292648 570559731 569821968 569614754 569044456 568077507 567740135 567291145 566284523
3047.4 566284523 565898437 565493202 565112877 564710236 563631859 563119583 562906380 562530212 562430496 562195587
3057.1E62195587n55343n76516n57365l15781k75421p62558n27344n55648l16430j6555
3066.7E57736626p68586m87556m74091p18841o09932n88226k49062k90031l70217p44858
3076.4E52435226n08461J68992J54457j95389m61540l93792q05473o04286k91290l65982
3086E49132462k26708k11868j41525p33338q73070p66220p02781l38326l15285l62701
3095.6E44460640o94809l46069l06282l82538k66953n70183k70385q02307n30014J75094
3105.3E40466194m67949n02014l28865m71725r51119r06525m77256o08216j43432Q8386
3114.9E35697479m72259r8000N2147j224098j398735p39098n33829k27165m41932n79758
3124.6E30034752l22380j93405n38140p05413j91346m01573q46443n24063n93605q76961
$$ plain form
3057.1 562195587 561640244 561063728 560506363 560190582 559915161 559152603 558625259 558069611 557753181 557736626
3066.7 557736626 556968040 556480484 556006393 555287552 554677620 554089394 553840332 553550301 553180084 552435226
3076.4 552435226 551926765 552095757 552250214 552054825 551593285 551199493 550394020 549789734 549498444 549132462
3086 549132462 548905754 548693886 548552361 547819023 546945953 546179733 545476952 545138626 544823341 544460640
3095.6 544460640 543765831 543419762 543113480 542730942 542463989 541893806 541623421 540821114 540291100 540466194
3105.3 540466194 539998245 539496231 539167366 538695641 537744522 536837997 536360741 535752525 535609093 535697479
3114.9 535697479 535225220 535127220 535179367 533955269 532556534 531817436 531283607 531056442 530614510 530034752
3124.6 530034752 529712372 529518967 528980827 528275414 528084068 527682495 526836052 526311989 525718384 524841423
3134.2E24841423o24618k82517k91824q56362n07736k97356j015739m32243m22593
3142.9E20110435q79898n44128m31404j38474l19557q48579j199150r28192l21846
3151.6E14499207k80495o15692p10602j68877k86026p34710r42421r57375n13344n88913
3161.2E08700752j042518q71888k50473l47213l52249m57802r93271o54640l49045
3169.9E03381653l70293o85959p02629n79757p32422o70510p55119n57861o53458m08096
3179.5D97265549k72332r90791r25140m06685l07350q79555r61647m83360j14823l23219
3189.2D91600647p27806n72281p45316m26139p33185j145630p52716q05512l32489
3197.9D85359573l77769p01523p94334k90947J01890p83806q45871n07927l39508o18438
$$ plain form
3134.2 524841423 524216805 523934288 523642464 522786102 522278366 521981010 520965271 520533028 520110435
3142.9 520110435 519230537 518686409 518255005 518116531 517796974 516948395 515749245 514821053 514499207
3151.6 514499207 514218712 513603020 512892418 512723541 512437515 511702805 510760384 509803009 509289665 508700752
3161.2 508700752 507658234 506786346 506535873 506188660 505836411 505378609 504385338 503730698 503381653
3169.9 503381653 503011360 502325401 501622772 501043015 500310593 499640083 498884964 498327103 497673645 497265549
3179.5 497265549 496993217 496002426 495077286 494670601 494363251 493483696 492522049 492038689 491923866 491600647
3189.2 491600647 490872841 490300560 489555244 489129105 488395920 487250290 486497574 485692062 485359573
3197.9 485359573 484981804 484280281 483485947 483195000 483296890 482513084 481667213 481159286 480819778 480201340
3207.5D80201340p27272m93851r02214q79440n57099N455k49290n90782m04320q13294
3217.2D74589233o44531n70526m55894k03057n85632o12526n22003j029053q09174
3225.8D69156837p3204n29785n41038k70958o53725l39889l319n96047r06295o77681
3235.5D64564896o15464N4589q3390o21719n77774p08580k72217l61671m05426p18155
3245.1D60255089p82471J34125n96733r58710m84962m58947l58352l04680r232j62315
3254.8D56272812p35512p84836k91671l4714k20871n27725n15786n70831m02946L23028
3264.4D52510948j46179r27887r99832n13954k35482n04684l02506o6490j15814j046333
3274D47651787p60689j6212p28722n42641k12097L4447k5215l33825n26580n52674
$$ plain form
3207.5 480201340 479474068 478980217 478078003 477198563 476641464 476646919 476397629 475806847 475402527 474589233
3217.2 474589233 473944702 473374176 472918282 472715225 472129593 471517067 470995064 469966011 469156837
3225.8 469156837 469083633 468553848 468012810 467741852 467088127 466748238 466744919 466148872 465242577 464564896
3235.5 464564896 463949432 464004021 463920631 463298912 462721138 462012558 461740341 461378670 460973244 460255089
3245.1 460255089 459472618 459606743 459010010 458051300 457566338 457107391 456749039 456444359 456435127 456272812
3254.8 456272812 455537300 454752464 454460793 454426079 454205208 453677483 453161697 452590866 452187920 452510948
3264.4 452510948 452364769 451436882 450437050 449923096 449687614 449182930 448880424 448813934 448698120 447651787
3274 447651787 446891098 446874886 446146164 445603523 445391426 445425873 445400658 445066833 444540253 443987579
3283.7D43987579j95617r44939r23767J5068K88048l09906p65457k86217n24521m26521
3293.3D39913750j54648o14853q54378o50215l31650j21460k15606p29485l92952k31743
3303D35616760k40402k27318o67877m07562m99840n66597m04739l56102n89028q01811
3312.6D30855484n12009m53758k25906r31931r65652j85700n24139m51851k31133k23770
3322.3D26149635k16484o8741p99942j396446o82487k86446k69394o29692m72488n25437
3331.9D20802078n87272l26729n43213j39999m56887r81025o19851l3950k01035o45828
3341.6D16266289n41191r02024m99572j43662k85492m50172l90587m2000p39632j077385
3351.2D11194572q52623k28080j4382m55208p89947r27048j06163n16166p75147P4730
$$ plain form
3283.7 443987579 443791962 442847023 441923256 441938324 442226372 441916466 441151009 440864792 440340271 439913750
3293.3 439913750 439759102 439144249 438289871 437639656 437308006 437186546 436970940 436241455 435848503 435616760
3303 435616760 435376358 435149040 434481163 434073601 433573761 433007164 432602425 432246323 431657295 430855484
3312.6 430855484 430343475 429889717 429663811 428731880 427766228 427580528 427056389 426604538 426373405 426149635
3322.3 426149635 425933151 425864410 425064468 423668022 422985535 422699089 422429695 421800003 421327515 420802078
3331.9 420802078 420214806 419888077 419344864 419204865 418747978 417766953 417147102 417113152 416912117 416266289
3341.6 416266289 415725098 414823074 414323502 414179840 413894348 413444176 413053589 413011589 412271957 411194572
3351.2 411194572 410341949 410113869 410099487 409644279 408854332 407927284 407821121 407304955 406529808 406604538
3360.8D06604538l82614j039772l81851K98729l43285m37775n03807p28760m51316
3369.5D02634087m18015j65520m22248o16189p44133n89141L662k56691n60913m31252
3379.2C98433647n65376o72379o9732q9875l23104j34087j32942l23334o12831j03912
3388.8C95406075k88239k70348L45078k14615o22787m98391l31039m26102j70746K1248
3398.4C92950134q3961j06735n9014J86081l35235k03209j7510k22092o18133q33626
3408.1C90656700K34718K6398m46777p7782L90740M35218l78074m62914J01776O7215
3417.7C90547218l29399N11246K4528q38699k25181k34299O64596K58713n75142l28636
3427.4C89474945l44429p477M54331O91871k12860k53372J8883J73874M75578J50986
$$ plain form
3360.8 406604538 406221924 405182152 404800301 405099030 404755745 404317970 403814163 403085403 402634087
3369.5 402634087 402216072 402050552 401628304 401012115 400267982 399678841 399682503 399425812 398864899 398433647
3379.2 398433647 397868271 397195892 397126160 397036285 396713181 396579094 396446152 396122818 395509987 395406075
3388.8 395406075 395117836 394847488 395192566 394977951 394355164 393856773 393525734 393099632 392928886 392950134
3398.4 392950134 392866173 392759438 392700424 392886505 392551270 392348061 392330551 392108459 391490326 390656700
3408.1 390656700 390891418 390917816 390471039 390393257 390783997 391219215 390841141 390378227 390480003 390547218
3417.7 390547218 390217819 390729065 390753593 389914894 389689713 389455414 390120010 390378723 389803581 389474945
3427.4 389474945 389130516 389123039 389577370 390269241 390056381 389803009 389821892 389995766 390471344 390622330
3437C90622330K98919j78032N6115J02005k78092m4517O9542M54406L87459O92673
3446.7C92182808j80931k45361N20019J39809L82499j56974Q0337N77469M57382M91677
3456.3C94248734K16865K72942J34620J42250j83639R7961l433k73704O70967O71463
3466C95995026L83873R6168N38674R86747J139717R50470O49r3498m48647k49863J55106
3476.6C99454422M34647J223907J078110K74467l96919r193P858M65927Q10356M72107
3486.2D03815689O88477r9450Q7586P77588M36973L30773M89845M30794O01921J187134
3495.8D08747330L41606l54958J13983O09627N38635O76423J069488k44179m46663
3504.5D11051292P05681J057358N37720N63125M54941j44424R41505Q39157L85742
$$ plain form
3437 390622330 390921249 390743217 390799332 390901337 390623245 390578728 390648270 391102676 391490135 392182808
3446.7 392182808 392001877 391756516 392276535 392416344 392798843 392641869 392722206 393299675 393757057 394248734
3456.3 394248734 394465599 394738541 394873161 395015411 394831772 394929733 394926300 394652596 395323563 395995026
3466 395995026 396378899 396475067 397013741 398000488 399140205 400090675 400091324 399997826 399549179 399299316 399454422
3476.6 399454422 399889069 401112976 402191086 402465553 402068634 402059441 402067299 402533226 403343582 403815689
3486.2 403815689 404504166 404404716 404492302 405269890 405706863 406037636 406527481 406958275 407560196 408747330
3495.8 408747330 409088936 408733978 408847961 409457588 409996223 410672646 411742134 411497955 411051292
3504.5 411051292 411756973 412814331 413352051 413915176 414370117 414225693 415167198 416006355 416392097
3513.2D16392097P1564J2779R38492Q38852J56708l91312M79431Q99582R96132J551819
3522.9D21946144K30942m42886L45497J284141L59307n54581K41012Q88787O95686
3531.5D24994049L54881J055298P65228R26743L75748l47672J045685P64008L65333
3540.2D30299301N30472J172180L77007J32370J241569J07384N17616J75667P69043
3548.9D35322609Q62884N94712R19838n33448J036492N46951N18990J202774K54478
3557.6D40726280Q79860O54526J160583O28586R21059L29437j00403L350296P93877
3566.2D49344101p75452p85522j286392K337455J347657J225738J607208O95534l53813
3574.9D53356514M01955J362686K35367J571693R43260j74904J111031J434402P26242
$$ plain form
3513.2 416392097 416463661 416476440 417414932 418253784 418410492 418019180 418498611 419398193 420394325 421946144
3522.9 421946144 422177086 421734200 422079697 423363838 423723145 423168564 423409576 424298363 424994049
3531.5 424994049 425348930 426404228 427169456 428096199 428471947 428124275 429169960 429933968 430299301
3540.2 430299301 430829773 432001953 432378960 432511330 433752899 433860283 434377899 434553566 435322609
3548.9 435322609 436185493 436780205 437700043 437166595 438203087 438750038 439269028 440471802 440726280
3557.6 440726280 441606140 442260666 443421249 444049835 444970894 445300331 445199928 448550224 449344101
3566.2 449344101 448568649 447783127 446496735 448834190 450181847 451407585 453014793 453710327 453356514
3574.9 453356514 453758469 455121155 455356522 456928215 457871475 457696571 458807602 460242004 460968246
3583.6D60968246O2790K570038R43146j765404J279030p16896J454086K248879K492714
3592.3D69536629J109581m65813K604179q00056j59149K142944M63600J333008k13013
3601D75551910L32375J626892P71942Q41561J984176K296677j574860J686669M60319
3609.6D83977661j363602N118218J665916k053413K047653j225281K237168K677841
3617.4D93082161o88591J535797r727j75515J963501K301903J439552J234627J646233
3626E02329941J934662M444046K36587p257690K691803K968902L888436J731949j044159
3634.7E11924477J689872K410508J604080n9967N60646J651191K405091R17206o38848
3643.4E22464256J820069L198700M984932q5297l088188M893532j873856l100319O64444
$$ plain form
3583.6 460968246 461031036 463601074 464544220 462778816 464057846 463340950 464795036 467043915 469536629
3592.3 469536629 470646210 470180397 472784576 471984520 471825371 473968315 474431915 475764923 475551910
3601 475551910 475884285 477511177 478283119 479124680 481108856 483405533 481830673 483517342 483977661
3609.6 483977661 482614059 487732277 489398193 487344780 489392433 488167152 490404320 493082161
3617.4 493082161 492393570 493929367 493919640 493744125 495707626 498009529 499449081 500683708 502329941
3626 502329941 504264603 508708649 508945236 501687546 504379349 507348251 511236687 512968636 511924477
3634.7 511924477 513614349 516024857 517628937 517568970 518129616 519780807 522185898 523103104 522464256
3643.4 522464256 524284325 527483025 532467957 532382660 529294472 534188004 532314148 529213829 529878273
3652.1E29878273L964119L483658K878723K892799n603943J640778L891754J223068
3659.8E44249229J476479R29298J561051J156578J605797Q66623R6588L126373J991577
3668.5E57059593p50618Q14629l284149Q88519N663567O141319j746445j2677383L147583
3677.1E55256615O255264L297272j520043J85509K048302J427726Q14057K55928M67605
3685.8E68488235K969857M218406o912613l013267N945206l582001m69055L472404
3693.5E71117172K34261J189956L79258m77906O08330J37062J282730J132622k929993
3702.2E72673492n31501L734321J632309o3247L56903J700439K990570m376221J580697
3710.9E79697762Q34999r569855M812698M282608Q45719K99911J792679Q86383l305130
$$ plain form
3652.1 529878273 533842392 537326050 540204773 543097572 537493629 539134407 543026161 544249229
3659.8 544249229 545725708 546655006 548216057 549372635 550978432 551845055 551941643 555068016 557059593
3668.5 557059593 556308975 557123604 553839455 554727974 560391541 566532860 564786415 552109032 555256615
3677.1 555256615 561511879 564809151 563289108 563474617 565522919 566950645 567764702 568020630 568488235
3685.8 568488235 571458092 575676498 568763885 565750618 571695824 568113823 567644768 571117172
3693.5 571117172 571351433 572541389 572920647 572442741 573051071 573188133 574470863 575603485 572673492
3702.2 572673492 572141991 575876312 577508621 577445374 577802277 579502716 582493286 578117065 579697762
3710.9 579697762 580532761 570962906 575775604 580058212 580903931 581203842 582996521 583882904 580577774
3719.6E80577774M28124M469947j821212m323960M100189K205353k66723k162209p17659
3728.3E82489624K799950J117248L729325l207665n894852O945382m68331o517677
3736E80993004J704597K032814k62909J520005K118606l180008K432099Q409538p687340
3744.7E88080406j2467155P585678M385452M032555l262558r284439Q281707l965263
3752.4E83386383l694572N286636L378944K721291l790817P68661L020477n772628
3760.1E85304375n89600L022232R79729J29852K405357k103042m062920J829911L257484
3768.8E90173378J89323o456222J239662K300110K39525J001320L65867L21579l5362
3777.4E89339180J819191l01971o012536J401902J803894M51622J375007k054138q08716
$$ plain form
3719.6 580577774 581005898 585475845 583654633 579330673 583430862 585636215 585369492 583207283 582489624
3728.3 582489624 585289574 586406822 590136147 586928482 581033630 587979012 587510681 580993004
3736 580993004 582697601 584730415 584467506 585987511 588106117 584926109 587358208 595767746 588080406
3744.7 588080406 575613251 583198929 587584381 591616936 588354378 579069939 587351646 583386383
3752.4 583386383 579691811 584978447 588357391 591078682 587287865 588056526 591077003 585304375
3760.1 585304375 584714775 587737007 588716736 588846588 591251945 589148903 585085983 586915894 590173378
3768.8 590173378 590362701 583906479 585146141 587446251 587685776 588687096 589052963 589374542 589339180
3777.4 589339180 591158371 590856400 584843864 586245766 588049660 588501282 589876289 587822151 587013435
3786.1E87013435J545067L27225K0294N8937J75324n60456j34124J5182O89697K591324
3795.8E91741905k663498l366584J736221K600441L191643o054497o549072L349266
3803.5E83985825K771911L653832L453445p360649l345261M053498K256736K13891
3811.2E89683228l08152o97136M05541L826332p59926r904518L917046M059753L119087
3819.9E93341255J595154j2286758J760444L408013P49473Q76312o45942k645607J44996
3828.6E86297340J159478K356453J463928o206436K114486N362931n178681p29599
3836.3E86639900O534348o392327m615593O103363l422927m69513M976883j399346
3844E87954788k461700J851425J019249k6436Q32558j169396P30858M254837l866463
$$ plain form
3786.1 587013435 588558502 588885727 588906021 588964958 589140282 588579826 588445702 588460884 589150581 591741905
3795.8 591741905 589078407 585711823 587448044 590048485 593240128 587185631 580636559 583985825
3803.5 583985825 586757736 590411568 593865013 586504364 583159103 587212601 589469337 589683228
3811.2 589683228 589375076 588677940 589083481 592909813 592149887 582245369 586162415 590222168 593341255
3819.9 593341255 594936409 582649651 584410095 587818108 588567581 589443893 588797951 586152344 586297340
3828.6 586297340 587456818 589813271 591277199 585070763 587185249 592548180 587369499 586639900
3836.3 586639900 593174248 586781921 582166328 588269691 584846764 584377251 589354134 587954788
3844 587954788 585493088 587344513 588363762 588337326 589169884 588000488 588731346 592986183 589119720
3852.7E89119720k161560r968528K656212P491912n3825j706924J210708J576424R61609
3861.3E89125748m534531q6212N209083m917640l618737L789902L390846M001618o997032
3870E85363045o171379L594818M484634K485695p620964J019402K679595n45692J003189
3878.7E86292343L089447k916984n865670M702988J135101L43171L763694r555282
3886.4E80988808N3787L161926J028824L085709j030o321411M16030K021409j455651
3895.1E82978401Q28209R11408K349052J845741q425331K092552P71523k019653N087242
3903.8E86419144k694283k170639P81326M00010O99920l36265M90341K04544L34053
3912.5E84128151k28119j027451R00651J184082k851067k296066L526458J183815l229560
$$ plain form
3852.7 589119720 586958160 576989632 579645844 587137756 587083931 585377007 586587715 588164139 589125748
3861.3 589125748 584591217 584505005 589714088 584796448 581177711 584967613 588358459 592360077 585363045
3870 585363045 579191666 582786484 587271118 589756813 582135849 583155251 585834846 585289154 586292343
3878.7 586292343 589381790 586464806 580599136 585302124 586437225 586780396 590544090 580988808
3886.4 580988808 581042595 584204521 585233345 588319054 588318024 581996613 582412643 584434052 582978401
3895.1 582978401 583806610 584718018 587067070 588912811 580487480 582580032 583351555 581331902 586419144
3903.8 586419144 583724861 581554222 582335548 582735558 583435478 583099213 583589554 583794098 584128151
3912.5 584128151 583900032 582872581 583773232 584957314 582106247 579810181 583336639 584520454 581290894
3921.1E81290894O62841R15490O68716j531982k553292J828423J552276K05384q08754
3929.8E82229996K94075J639786k371636j325531J341133P3357n7526M56238o45371
3938.5E81634521r05227k05651P90291J005287k437629n82695J001587Q42018J677933
3947.2E82820435j693192m96521N11780j317902N00374j58691l43666J85546K66839
3955.8E80275002P896l19748L34244o77643j83182K31896p25174O16913Q88023J29242
3965.5E80577469O5231o15959k58255j73340q61358O35910N96046l40767K33002J61972
3975.1E80019951n96352q23898K21062p7057j12763K84500R4376O10580j16081j59645
3984.8E79344673m0436l04908Q9302J30767j01699m37165k86255q21914j52474P10183
$$ plain form
3921.1 581290894 581953735 582869225 583537941 582005959 579452667 581281090 582833366 583038750 582229996
3929.8 582229996 582524071 584163857 581792221 580466690 581807823 581881180 581823654 582279892 581634521
3938.5 581634521 580729294 580523643 581313934 582319221 579881592 579298897 580300484 581142502 582820435
3947.2 582820435 581127243 580630722 581142502 579824600 580324974 580166283 579822617 580008163 580275002
3955.8 580275002 580282898 579963150 580297394 579619751 579436569 579668465 578943291 579560204 580448227 580577469
3965.5 580577469 580642700 580026741 579768486 579595146 578733788 579369698 579965744 579624977 579857979 580019951
3975.1 580019951 579423599 578599701 578820763 578743706 578630943 578915443 579009819 579620399 579504318 579344673
3984.8 579344673 579304237 578999329 579088631 579219398 579117699 578680534 578394279 577572365 577419891 578130074
3994.4E78130074k65007m08516J26724L29399M2572M00505
4000.2E78355751
$$ plain form
3994.4 578130074 577865067 577456551 577583275 577912674 577955246 578355751
4000.2 578355751
##END=$$ End of the data block
