##TITLE=$$ Begin of the data block
##JCAMP-DX=5.00 $$ ACD/SpecManager v 10.08
##SPECTROMETER/DATA SYSTEM=16PC
##DATE=Mon Sep 30 09:40:21 2013
##DATA TYPE=INFRARED SPECTRUM
##DATA CLASS=XYDATA
##ORIGIN=
##OWNER=
##NPOINTS=3601
##FIRSTX=400.00000000
##LASTX=4000.00000000
##MAXX=4000.00000000
##MINX=400.00000000
##MAXY=36.33475494
##MINY=1.71031952
##XFACTOR=1.0000000000
##YFACTOR=0.000000100000000
##FIRSTY=33.25059509
##DELTAX=1.00000000
##XUNITS=1/CM
##YUNITS=TRANSMITTANCE
##XYDATA=(X++(Y..Y))
$$ plain form
400 332505951 320745010 312568436 313214302 315065384 309101334 304768791 309663296 320317497 339297066
409 339297066 356096497 357797394 354201088 350776901 347602386 348211746 347701302 339605789 332142105
418 332142105 332116356 337292671 352046013 363347549 355232697 340883026 326831589 317058334
426 317058334 321614494 328817596 328614235 326166611 322417984 319969406 322163811 327718506 338080635
435 338080635 348402748 354522934 355829010 348203888 338000069 329626312 324795952 329223175
443 329223175 335312347 336823235 335404625 328849068 322482605 322361717 324086685 325196991 325928688
452 325928688 324492226 324500580 332058182 337897797 331246605 322722206 320663910 321132431 323277702
461 323277702 326168785 328931084 330542564 329029808 326370697 322821388 321571808 328059921 335797081
$$ packed form
400C32505951j1760941q176574O45866J851082n964050m332543M894505J0654201J8979569
409C39297066J6799431J700897l596306l424187l174515O09360n10444q095513p463684
418C32142105k5749N176315J4753342J1301536q114852j4349671j4051437r773255
426C17058334M556160P203102k03361k447624l748627k448578K194405N554695J0362129
435C38080635J0322113O120186J306076p625122j0203819q373757m830360M427223
443C29223175O089172J510888j418610o555557o366463j20888J724968J110306P31697
452C25928688j436462Q354P557602N839615o651192q524399k058296M68521K145271
461C23277702K891083K762299J611480j512756k659111l549309j249580O488113P737160
$$ plain form
470 335797081 339286804 340989342 341514130 340913773 338655243 337101936 339341888 342665901 345341454
479 345341454 347524414 348298569 349147072 352099915 354597549 354137878 352579117 350768318 349236259
488 349236259 349551697 349447021 346281509 342740555 340342293 339946976 344684143 349262695 348339806
497 348339806 345198631 340910416 336767426 334449539 333864212 336265106 339290390 341074715 341379166
506 341379166 337965469 334964294 337017059 340349426 342629929 344169846 344703445 343628883 339253426
515 339253426 334583740 332338791 331689110 332866440 335406303 339578400 343409309 344917297 344394684
524 344394684 340359459 336150169 335143585 335739861 338509331 340317955 337140579 332219620 326861877
533 326861877 322847595 323180923 325496445 329169273 331980476 330620995 327733536 324183464 321991425
$$ packed form
470C35797081L489723J702538N24788o00357k258530j553307K239952L324013K675553
479C45341454K182960P74155Q48503K952843K497634m59671j558761j810799j532059
488C49236259L15438j04676l165512l540954k398262l95317M737167M578552r22889
497C48339806l141175m288215m142990k317887n85327K400894L025284J784325L04451
506C41379166l413697l001175K052765L332367K280503J539917N33599j074562m375457
515C39253426m669686k244949o49681J177330K539863M172097L830909J507988n22613
524C44394684m035225m209290j006584N96276K769470J808624l177376m920959n357743
533C26861877m014282L33328K315522L672828K811203j359481k887459l550072k192039
$$ plain form
542 321991425 325472336 328605652 325259705 320079803 315954208 312021980 308321476 305040359 302155972
551 302155972 300334930 300663948 301859627 303091278 304087410 304347992 303724518 301427116 298879147
560 298879147 297386169 296509743 296616325 296594620 295290718 293195496 289849281 286948204 286448002
569 286448002 287110100 288292656 290159950 292860260 295796871 298648109 300734043 300862541 300246716
578 300246716 299828053 299226761 298599968 297277679 294098129 290692329 288265457 286931763 287370682
587 287370682 289088249 292414436 295554638 296468735 296220779 295006027 293389797 291981468 290842781
596 290842781 290532837 290167809 289078941 287178993 283318748 280013561 280217648 281463623 282109985
605 282109985 282631397 282794228 283080101 283998718 285228958 286517620 288168182 290716896 293210754
$$ packed form
542C21991425L480911L133316l345947n179902m125595l932228l700504l281117k884387
551C02155972j821042L29018J195679J231651R96132K60582o23474k297402k547969
560B98879147j492978q76426J06582k1705j303902k095222l346215k901077n00202
569B86448002O62098J182556J867294K700310K936611K851238K085934J28498o15825
578C00246716m18663o01292o26793j322289l179550l405800k426872j333694M38919
587B87370682J717567L326187L140202R14097k47956j214752j616230j408329j138687
596B90842781l09944l65028j088868j899948l860245l305187K04087J245975O46362
605B82109985N21412J62831K85873R18617J230240J288662J650562K548714K493858
$$ plain form
614 293210754 294674397 295709133 296554794 297317028 298196564 299144516 300570965 301299324 300106049
623 300106049 297538757 293025970 288701534 286744843 286447296 288559437 290883293 291327705 290322533
632 290322533 287229538 283161888 278604984 274803391 273732185 273684978 273745308 273515930 272163620
641 272163620 270077705 266986370 264039268 262729416 261753311 260098686 258383751 256898403 255615005
650 255615005 254322529 253859520 255604019 257726192 258343468 258989811 261041412 263087502 264015427
659 264015427 264306068 263665676 263305187 263545761 266759644 280009041 289544830 278627872 263288269
668 263288269 254298935 250691643 258205643 267488251 269204865 269037476 270105839 270761967 270020256
677 270020256 269010315 268335819 268586388 270817032 274234295 278901100 283303032 285990486 286831131
$$ packed form
614B93210754J463643J034736Q45661P62234Q79536R47952J426449P28359j193275
623C00106049k567292m512787m324436j956691k97547K112141K323856M44412j005172
632B90322533l092995m067650m556904l801593j071206m7207O0330k29378j352310
641B72163620k085915l091335k947102j309852r76105j654625j714935j485348j283398
650B55615005j292476m63009J744499K122173O17276O46343K051601K046090R27925
659B64015427K90641o40392l60489K40574L213883J3249397R535789j0916958j5339603
668B63288269q989334l607292P514000R282608J716614j67389J068363O56128p41711
677B70020256j009941o74496K50569K230644L417263M666805M401932K687454Q40645
$$ plain form
686 286831131 284103165 281124592 281235695 282645226 285039902 287325859 288036118 287975540 287184715
695 287184715 286489964 286975632 287906647 288683414 289984226 293089867 295591354 294636002 292832375
704 292832375 292094707 291652908 291093349 291257858 293665886 295868149 295421371 293823719 291216850
713 291216850 289223671 289999008 292086124 295279980 297977924 298190117 296870232 293750286 290505409
722 290505409 289018154 288394699 288499355 288937798 289997826 289496651 284256458 277546883 271408806
731 271408806 266347408 263573875 263007889 265626678 269467831 272902718 275905380 277585030 278904438
740 278904438 280474892 282458534 285439968 288759708 292561760 295019150 293114185 290561199 290290833
749 290290833 291634560 295741806 300087929 302113056 303072205 303093433 302997818 303720245 305047760 307420502
$$ packed form
686B86831131k727966k978573J11103J409531K394676K285957P10259o0578p90825
695B87184715o94751M85668R31015P76767J300812L105641K501487r55352j803627
704B92832375p37668m41799n59559J64509K408028K202263m46778j597652k606869
713B91216850j993179P75337K087116L193856K697944K12193j319885l119946l244877
722B90505409j487255o23455J04656M38443J060028n01175n240193o709575o138077
731B71408806n061398k773533n65986K618789L841153L434887L002662J679650J319408
740B78904438J570454J983642K981434L319740L802052K457390j904965k552986k70366
749B90290833J343727M107246M346123K025127R59149K1228r5615P22427J327515K372742
$$ plain form
759 307420502 309811363 311329842 312005768 311442604 310025940 307796478 305391312 303676605 302003860
768 302003860 300103416 297702065 294981956 290304909 281696091 270344734 256529808 241005669
776 241005669 223749886 207369080 194791565 185029984 178639183 173920631 168448448 164957771
784 164957771 165051937 169698944 181440582 197157631 215528259 233700752 247630348 259574661
792 259574661 270580769 280231953 288752556 295266380 298353424 299866447 301141739 302306900 304337730
801 304337730 306024075 305981407 305708656 306861153 307582855 305884590 303819427 302716980 302756538 305166473
811 305166473 308126450 310070515 311463833 312301865 312424889 311369667 310040951 309101105 308810711
820 308810711 310317764 311619034 310519447 308742523 307279816 306130409 305790901 305759907 305712223
$$ packed form
759C07420502K390861J518479O75926n63164j416664k229462k405166j714707j672745
768C02003860j900444k401351k720109m677047q608818j1351357j3814926j5524139
776B41005669j7255783j6380806j2577515r761581o390801m718552n472183l490677
784A64957771R4166M647007J1741638J5717049J8370628J8172493J3929596J1944313
792B59574661J1006108R651184Q520603O513824L087044J513023J275292J165161K030830
801C04337730J686345m2668k72751J152497P21702j698265k065163j102447L9558K409935
811C05166473K959977J944065J393318Q38032J23024j055222j328716r39846k90394
820C08810711J507053J301270j099587j776924j462707j149407l39508l0994m7684
$$ plain form
829 305712223 305614700 305405846 304842949 303603897 301862240 299299011 297066689 296625137 296733379 296788940
839 296788940 296335697 294378510 291929970 289726486 287599792 285567513 283806572 282871475 281646252
848 281646252 279191742 275531998 270107498 263728619 256408463 249975929 246045837 245270500 249921570
857 249921570 256755104 263524780 269506931 272608528 274690628 277517090 279284248 278204689 275990257
866 275990257 274094810 271504631 267403831 262649536 257831345 252936134 248026123 243462334 239278316
875 239278316 236515999 236485004 238414536 242731323 247151146 249103317 249870529 249470711 249124756
884 249124756 250260124 252271881 255226135 258535156 261752357 264520168 266296387 267185688 266960621
893 266960621 266074409 264785995 263450394 262445679 261958122 262681961 263469696 263228645 262487888 261095524
$$ packed form
829C05712223r7523k08854n62897j239052j741657k563229k232322m41552J08242N5561
839B96788940m53243j957187k448540k203484k126694k032279j760941r35097j225223
848B81646252k454510l659744n424500o378879p320156o432534l930092p75337M651070
857B49921570O833534O769676N982151L101597K082100K826462J767158j079559k214432
866B75990257j895447k590179m100800m754295m818191m895211m910011m563789m184018
875B39278316k762317l0995J929532M316787M419823J952171P67212l99818l45955
884B49124756J135368K011757K954254L309021L217201K767811J776219Q89301k25067
893B66960621q86212j288414j335601j004715m87557P23839P87735k41051p40757j392364
$$ plain form
903 261095524 260000458 260532379 261397133 261557808 261571407 261755466 261791458 261350155 260779381 260204086
913 260204086 259961357 260688057 261609077 262167206 262342930 261689415 260927925 260798683 260795116 260573864
923 260573864 260384331 260445595 260504723 260416756 260073433 259131660 258149147 257854233 257389297 255932083
933 255932083 254104614 251810074 250379333 251522789 254003296 257415047 260973930 263688087 265774002
942 265774002 267105827 267717838 267546654 266758690 265166054 263766766 264003983 264353981 263562202 262263527
952 262263527 260660896 258792648 256785870 254577160 251820564 249489307 248761177 248674164 248561859
961 248561859 248711815 248979568 249991417 252658367 255979538 259232044 262492180 265577316 268539906
970 268539906 271568298 274072170 275209198 275921822 277002335 278056374 279170036 279694080 278663635
$$ packed form
903B61095524j095066N31921Q64754J60675J3599J84059L5992m41303n70774n75295
913B60204086k42729P26700R21020N58129J75724o53515p61490j29242l567k21252
923B60573864j89533O1264N9128q7967l43323r41773r82513k94914m64936j457214
933B55932083j827469k294540j430741J143456K480507L411751L558883K714157K085915
942B65774002J331825O12011j71184p87964j592636j399288K37217L49998p91779j298675
952B62263527j602631j868248k006778k208710k756596k331257p28130q7013j12305
961B48561859J49956K67753J011849K666950L321171L252506L260136L085136K962590
970B68539906L028392K503872J137028P12624J080513J054039J113662N24044j030445
$$ plain form
979 278663635 277110100 275759697 274563313 273747215 273209801 273134232 272890320 271731148 270188103
988 270188103 268131027 266796112 267813683 269869576 272307873 274781456 276619911 278137436 279382706
997 279382706 280479908 281645050 282649994 283285618 283710251 284053326 284189453 284089317 283591995 282229424
1007 282229424 280891190 280543804 280485153 280514946 280093193 278408051 276071548 273091545 270468712
1016 270468712 269570580 269301186 268857727 268725395 269134998 270044804 271645775 273468494 275207043
1025 275207043 276560059 276896477 276899567 277292728 277324905 276193390 274773369 273802528 272890816 271672478
1035 271672478 270810127 271062374 271773567 272392750 273362389 275337944 277126541 277163029 277216911 278995285
1045 278995285 281120300 282732735 283982277 284532776 284982681 285830975 287038803 289024582 290915012
$$ packed form
979B78663635j553535j350403j196384q16098n37414p5569k43912j159172j543045
988B70188103k057076j334915J017571K055893K438297K473583J838455J517525J245270
997B79382706J097202J165142J004944O35624M24633L43075J36127j00136m97322j362571
1007B82229424j338234l47386n8651K9793m21753j685142k336503k980003k622833
1016B70468712q98132k69394m43459j32332M09603R09806J600971J822719J738549
1025B75207043J353016L36418L090L93161L2177j131515j420021r70841r11712j218338
1035B71672478q62351K52247P11193O19183R69639J975555J788597L6488N3882J778374
1045B78995285K125015J612435J249542N50499M49905Q48294J207828J985779J890430
$$ plain form
1054 290915012 291787624 292206764 292449226 292453537 292196999 291837215 291415691 291257381 291924000 292746773
1064 292746773 293206940 293414116 293220043 292877674 292712688 292357674 291668663 290298462 287281761 284327736
1074 284327736 282984505 282767773 284125557 285806656 286537895 286831379 286733856 286365280 285867691 285220871
1084 285220871 284259796 283559074 283792725 284495354 285563946 286585083 287108898 287141323 286391487 285296917
1094 285296917 284144630 283092499 282411804 282048225 282204857 282380333 281954536 281484375 281437149 281459579
1104 281459579 281273613 281119823 281075478 281352272 282261620 283581505 285151711 287095070 289733410
1113 289733410 292308331 294045677 295313606 296277046 296768665 296578636 295995712 295224667 294304123
1122 294304123 293392181 292333374 291101456 289464951 287022362 284257660 281658649 278810024 275523415
$$ packed form
1054B90915012Q72612M19140K42462M311k56538l59784m21524j58310O66619Q22773
1064B92746773M60167K07176j94073l42369j64986l55014o89011j370201l016701k954025
1074B84327736j343231k16732J357784J681099P31239K93484r7523l68576m97589o46820
1084B85220871r61075p00722K33651P02629J068592J021137N23815L2425p49836j094570
1094B85296917j152287j052131o80695l63579J56632J75476m25797m70161m7226K2430
1104B81459579j85966j53790m4345K76794R09348J319885J570206J943359K638340
1113B89733410K574921J737346J267929R63440M91619j90029n82924p71045r20544
1122B94304123r11942j058807j231918j636505k442589k764702k599011k848625l286609
$$ plain form
1131 275523415 271604767 266587486 261099339 255726337 250126610 243929863 237806797 232285976 227420578
1140 227420578 223386536 220341206 218413830 217861176 219292641 221777439 224614620 227722645 230826378
1149 230826378 233802795 236389885 238726139 240898361 242797375 244422684 245532265 245794067 245477905
1158 245477905 244681835 243587494 242453346 241147041 239661446 237879753 235496044 233070145 231045952
1167 231045952 229463100 228570213 228182316 228341827 228612175 228603592 228217602 227159729 225628128 223618984
1177 223618984 221440086 219400406 217491627 216028938 214347839 211880455 208651066 204376945 199408302
1186 199408302 193403244 188152313 185571194 184939861 186542740 189280739 192569733 195148239 195214748
1195 195214748 193802605 191322098 187837124 183594704 178454876 171851883 165309429 159940004 156408548
$$ packed form
1131B75523415l918648n017281n488147n373002n599727o196747o123066n520821m865398
1140B27420578m034042l045330j927376n52654J431465K484798K837181L108025L103733
1149B30826378K976417K587090K336254K172222J899014J625309J109581K61802l16162
1158B45477905p96070j094341j134148j306305j485595j781693k383709k425899k024193
1167B31045952j582852q92887l87897J59511K70348q583l85990j057873j531601k009144
1177B23618984k178898k039680j908779j462689j681099k467384l229389m274121m968643
1186A99408302o005058n250931k581119o31333J602879K737999L288994K578506O6509
1195A95214748j412143k480507l484974m242420n139828o602993o542454n369425l531456
$$ plain form
1204 156408548 156187057 157967091 161385059 165075779 167304993 168814182 169747353 170160065 170052528
1213 170052528 169731617 169650555 169370422 168391457 167348862 166873207 166475525 165914764 165076485 163716793
1223 163716793 161979904 159922361 157559872 155032158 152023315 148135900 143754005 139189005 134259224
1232 134259224 128793716 123071671 117306471 111521244 105919123 100172758 93843460 87465048 81234455
1241 81234455 75723648 71316481 68773270 69289207 71940184 77015162 82067013 84696054 85047483
1250 85047483 81430674 76950550 73797941 73023081 77047586 83947182 93219280 103017330 111425877
1259 111425877 118147850 121900320 123722076 123777390 123406410 124018669 125567198 128840446 132740498
1268 132740498 136531830 139912844 142278671 143802166 144445181 144232988 143039703 141279936 139466524
$$ packed form
1204A56408548k21491J780034L417968L690720K229214J509189R33171M12712j07537
1213A70052528l20911q1062k80133r78965j042595m75655l97682n60761q38279j359692
1223A63716793j736889k057543k362489k527714l008843l887415m381895m565000m929781
1232A34259224n465508n722045n765200n785227n602121n746365o329298o378412o230593
1241H1234455n510807m407167k543211N15937K650977N074978N051851K629041L51429
1250H5047483l616809m480124l152609p74860M024505O899596R272098R798050Q408547
1259A11425877O721973L752470J821756N5314l70980O12259J548529L273248L900052
1268A32740498L791332L381014K365827J523495O43015k12193j193285j759767j813412
$$ plain form
1277 139466524 137176991 134171009 130412102 125590801 120285273 114911079 109646320 104552507 100392580
1286 100392580 97834349 97221136 99360466 103526115 109622240 116565466 123387814 129645348 134595394
1295 134595394 138165712 139657021 140204906 140704155 141174555 142066479 142981052 143960953 144130945 142571926
1305 142571926 139457703 134226084 128165007 122353792 116853476 112096071 108047009 104809284 102402449
1314 102402449 101125717 100242138 98652124 97742319 98529339 101021290 106164932 112160683 117729425
1323 117729425 122255802 124508858 125053167 123918056 121477127 118001223 113824844 109201908 104641914
1332 104641914 100635052 97491264 95887423 95211744 95011711 95484734 96759796 98588705 101035357
1341 101035357 103292465 104437113 104878426 104773998 103955746 102268457 99828959 96508503 92885733
$$ packed form
1277A39466524k289533l005982l758907m821301n305528n374194n264759n093813m159927
1286A00392580k558231o13213K139330M165649O096125O943226O822348O257534M950046
1295A34595394L570318J491309N47885M99249M70400Q91924R14573R79901J69992j559019
1305A42571926l114223n231619o061077n811215n500316m757405m049062l237725k406835
1314A02402449j276732q83579j590014r09805P87020K491951N143642N995751N568742
1323A17729425M526377K253056N44309j135111k440929l475904m176379m622936m559994
1332A04641914m006862l143788j603841o75679k00033M73023J275062J828909K446652
1341A01035357K257108J144648M41313j04428q18252j687289k439498l320456l622770
$$ plain form
1350 92885733 89811563 86340427 81398010 76221228 71957827 67800283 62795162 58525324 56583405
1359 56583405 55985928 56130648 57464838 60719013 64441204 67416906 69662809 70348501 70800543
1368 70800543 72175503 74151993 77173948 80102205 81493616 82700968 84954262 87178946 88831186
1377 88831186 89546204 88597536 86525440 83402634 79903841 76933146 73872089 70188284 66525936
1386 66525936 63104153 60663462 60265541 61164618 63176155 65676689 67652702 70089817 73976755
1395 73976755 78287601 82253456 86090088 89332819 93250751 99902391 106454134 109879017 112812757
1404 112812757 117322206 122086048 126499414 130477667 133582592 136267185 138739347 141295671 144298315
1413 144298315 147755623 152957678 156419277 153792381 148953915 143606901 139924049 143173695 145771265
$$ packed form
1350I2885733l074170l471136m942417n176782m263401m157544n005121m269838j941919
1359E6583405n97477J44720J334190L254175L722191K975702K245903O85692M52042
1368G0800543J374960J976490L021955K928257J391411J207352K253294K224684J652240
1377H8831186P15018r48668k072096l122806l498793k970695l061057l683805l662348
1386F6525936l421783k440691l97921Q99077K011537K500534J976013K437115L886938
1395G3976755M310846L965855L836632L242731L917932O651640O551743L424883K933740
1404A12812757M509449M763842M413366L978253L104925K684593K472162K556324L002644
1413A44298315L457308N202055L461599k626896m838466n347014l682852L249646K597570
$$ plain form
1422 145771265 139001846 131524563 130645514 131705284 132465839 132968426 131780386 131083250 133084059
1431 133084059 136272192 141175508 143885851 138108730 131527662 130740404 132708073 137289286 142386913
1440 142386913 144910097 147695780 153221607 159474134 165759811 170594215 171254387 170762291 171959877
1449 171959877 172661057 169962654 168854942 177270412 183477402 174623489 162002792 152963400 146489143
1458 146489143 145371199 145533562 142771721 140260935 138970613 141311407 152153730 165084839
1466 165084839 174472580 182845345 192765465 198497295 191541901 182747841 182217598 183690071 183493385
1475 183493385 183962097 186556587 190224876 194795132 199086914 200920334 203121910 209086189 214927197
1484 214927197 217528114 217975388 216720581 212549438 201687813 192266693 193572273 198363075 203768501
$$ packed form
1422A45771265o769419p477283q79049J059770P60555N02587j188040o97136K000809
1431A33084059L188133M903316K710343n777121o581068p87258J967669M581213N097627
1440A42386913K523184K785683N525827O252527O285677M834404O60172m92096J197586
1449A71959877P01180k698403j107712Q415470O206990q853913j2620697r039392o474257
1458A46489143j117944J62363k761841k510786j290322K340794J0842323J2931109
1466A65084839R387741Q372765R920120N731830o955394q794060n30243J472473j96686
1475A83493385M68712K594490L668289M570256M291782J833420K201576N964279N841008
1484B14927197K600917M47274j254807m171143j0861625r421120J305580M790802N405426
$$ plain form
1493 203768501 205959091 197456837 186336517 178915977 172985802 168109417 165284157 165865421 168338776
1502 168338776 175039768 175773392 154857397 131089211 120632410 115705729 115244865 115259409 109545231
1511 109545231 103676558 102949858 101994276 95461130 88577271 85914850 84085941 81239223 77337265
1520 77337265 70292711 64403772 65340519 66898584 63160658 58933735 57780266 57514429 57285309
1529 57285309 56647301 54883718 51954269 46389341 41760445 42865276 44555426 42564392 39043903
1538 39043903 34014702 29601812 28909206 29019833 27484179 26002645 25724649 25851488 25908709 26072502
1548 26072502 26372433 26773453 27172804 27800560 28787374 30325413 33603907 35762310 33019543
1557 33019543 29324293 27590752 27138233 29016972 30948162 30224562 29180288 29920816 30423164
$$ packed form
1493B03768501K190590q502254j1120320p420540n930175m876385k825260N81264K473355
1502A68338776O700992P33624k0915995k3768186j0456801m926681m60864J4544n714178
1511A09545231n868673p26700r55582o533146o883859k662421j828909k846718l901958
1520G7337265p044554n888939R36747J558065l737926m226923j153469k65837k29120
1529E7285309o38008j763583k929449n564928m628896J104831J690150j991034l520489
1538C9043903n029201m412890o92606J10627j535654j481534k77996J26839N7221J63793
1548B6072502K99931M01020L99351O27756R86814J538039L278494K158403k742767
1557C3019543l695250j733541m52519J878739J931190p23600j044274P40528N02348
$$ plain form
1566 30423164 28894663 26748657 24587870 23050547 23530722 24363279 24361610 23483515 20613909 17781734
1576 17781734 17103195 17200470 17307043 17705441 18409014 19457579 20871162 22719622 25092602 27951002
1586 27951002 31418800 35094023 38438797 41981936 46193123 50711870 55337191 60056686 64792871
1595 64792871 69537640 74312210 78951120 83376408 87345123 90448141 93105078 95716000 97929716
1604 97929716 99670887 100510836 99665642 98123550 96599102 95126390 93897581 93150377 94699144
1613 94699144 94002724 84376574 74064970 70471048 69430828 69995880 69922209 65654516 60177803
1622 60177803 55170059 50994873 49327850 47909975 44021606 40717125 41025162 42299747 42749882
1631 42749882 42837858 42566061 41520596 38275480 35866737 37989855 41239500 42953730 44596434
$$ packed form
1566C0423164j528501k146006k160787j537323M80175Q32557j669q78095k869606k832175
1576A7781734o78539R7275J06573L98398P03573J048565J413583J848460K372980K858400
1586B7951002L467798L675223L344774L543139M211187M518747M625321M719495M736185
1595F4792871M744769M774570M638910M425288L968715L103018K656937K610922K213716
1604I7929716J741171Q39949q45194j542092j524448j472712j228809p47204J548767
1613I4699144o96420r626150j0311604l593922j040220N65052p3671m267693n476713
1622F0177803n007744m175186j667023j417875l888369l304481L08037J274585M50135
1631D2749882Q7976k71797j045465l245116k408743K123118L249645J714230J642704
$$ plain form
1640 44596434 46966553 49397230 51909924 53236008 50976515 48542023 48725605 50980568 57796240
1649 57796240 62855721 58467388 51242590 44850588 40423632 41807175 44528723 44795275 44411182
1658 44411182 44268131 43311357 40027857 36683798 35489082 35098791 35179377 34906387 32977343 30491352
1668 30491352 27835846 25841236 26244640 26709795 24709702 22551298 22048235 22153139 22418022
1677 22418022 22855043 23319960 23830414 24796009 24894476 21930456 18931389 18923998 19713402 20018578
1687 20018578 20123959 19633055 19304037 20092726 21008968 21157026 21207809 21431923 22134066 24185658
1697 24185658 26155233 26117802 26425123 29579639 33202410 35487413 37216663 38510084 39546728
1706 39546728 40495396 41506052 42798042 44330359 46062708 48208952 51471710 54342508 55200815
$$ packed form
1640D4596434K370119K430677K512694J326084k259493k434492J83582K254963O815672
1649E7796240N059481m388333p224798o392002m426956J383543K721548K66552l84093
1658D4411182j43051r56774l283500l344059j194716l90291Q0586k72990j929044k485991
1668C0491352k655506j994610M03404M65155k000093k158404n03063J04904K64883
1677B2418022M37021M64917N10454R65595R8467k964020k999067p391P89404L05176
1687B0018578J05381m90904l29018P88689R16242J48058N0783K24114P02143K051592
1697B4185658J969575l7431L07321L154516L622771K285003J729250J293421J036644
1706C9546728R48668J010656J291990J532317J732349K146244L262758K870798Q58307
$$ plain form
1715 55200815 55084467 53921700 53417683 56069851 59427261 61621666 63401699 64416170 66092730
1724 66092730 70380926 75362921 79122782 83603382 90863466 98639250 106453896 111005306 104629755
1733 104629755 99932194 111539125 125720263 131880760 135240555 136669159 138622046 145264864
1741 145264864 152335167 155645609 159134626 166896591 174275875 177285671 178011417 176381111 174880505
1750 174880505 175883770 179653645 189683437 198652744 197342873 194938660 199540138 205182800
1758 205182800 208633423 209796906 204935303 201741695 209960461 219696999 222577572 223780403 225993633
1767 225993633 228312016 232311478 233235130 222988358 213157883 215582123 221409321 224944115 228553047
1776 228553047 233845940 237397671 234012604 230609169 234901199 239303360 236637592 233395100 234115829
$$ packed form
1715E5200815j16348j162767n04017K652168L357410K194405J780033J014471J676560
1724F6092730M288196M981995L759861M480600P260084P775784P814646M551410o375551
1733A04629755m697561J1606931J4181138O160497L359795J428604J952887O642818
1741A45264864P070303L310442L489017P761965P379284L009796P25746j630306j500606
1750A74880505J003265L769875J0029792Q969307j309871k404213M601478N642662
1758B05182800L450623J163483m861603l193608Q218766R736538K880573J202831K213230
1767B25993633K318383L999462R23652j0246772r830475K424240N827198L534794L608932
1776B28553047N292893L551731l385067l403435M292030M402161k665768l242492P20729
$$ plain form
1785 234115829 237474213 245245705 252666245 255713692 253936539 241719723 230530739 233305454
1793 233305454 240020523 244499683 248136749 250484943 250888100 247454872 243440857 241680145 241544952
1802 241544952 243914127 247098694 249624023 251724968 253545990 253883362 250454178 246638527 245310059
1811 245310059 245703468 248948326 252232780 252391815 251612663 250916481 250635147 251389732 253332367
1820 253332367 258425484 261856556 256532898 251257172 255316257 260163536 259470215 255866528 247634659
1829 247634659 241487980 246680031 253870010 255624542 255472412 254258156 252599487 250569572 250643959
1838 250643959 257485867 264601707 267046452 264835587 252667656 241546860 244334946 250155449
1846 250155449 250922203 251123657 253259430 255209446 255288353 254690399 253952503 253358612 253480911 253988743
$$ packed form
1785B34115829L358384P771492P420540L047447j777153j2216816j1188984K774715
1793B33305454O715069M479160L637066K348194M03157l433228m014015j760712j35193
1802B41544952K369175L184567K525329K100945J821022L37372l429184l815651j328468
1811B45310059L93409L244858L284454J59035p79152o96182k81334P54585J942635
1820B53332367N093117L431072n323658n275726M059085M847279o93321l603687q231869
1829B47634659o146679N192051P189979J754532j52130j214256j658669k029915P4387
1838B50643959O841908P115840K444745k210865j2167931j1120796K788086N820503
1846B50155449P66754K01454K135773J950016P8907n97954p37896n93891J22299N07832
$$ plain form
1856 253988743 254933128 255738983 255634308 255257607 254646778 254830360 257487774 260702858 264040718
1865 264040718 264735451 257533550 249460945 246657848 246524582 249282837 252607117 253688583 254197350
1874 254197350 255095711 255697021 255457878 254908791 254407654 253926277 253529320 253293514 253008842 253599892
1884 253599892 257243385 259971848 257205009 252954960 249272118 247460365 251333008 255411148 254023781
1893 254023781 251559982 251038074 250897408 250351906 250095844 250865936 251748562 251862049 251843681 252159119
1903 252159119 252441406 252552261 252270222 251075268 249722004 248651733 248282909 249539852 251342545
1912 251342545 253253937 254266510 252735367 250135193 246546516 244505653 248663673 252755890 250305653
1921 250305653 246598015 245066872 244787216 246508598 248639336 249589691 250100613 250442028 250436554 249793777
$$ packed form
1856B53988743R44385Q05855j04675l76701o10829J83582K657414L215084L337860
1865B64040718O94733p201901q072605k803097j33266K758255L324280J081466N08767
1874B54197350Q98361O01310k39143n49087n01137m81377l96957k35806k84672N91050
1884B53599892L643493K728463k766839m250049l682842j811753L872643M078140j387367
1893B54023781k463799n21908j40666n45502k56062P70092Q82626J13487j8368L15438
1903B52159119K82287J10855k82039j194954j353264j070271l68824J256943J802693
1912B51342545J911392J012573j531143k600174l588677k040863M158020M092217k450237
1921B50305653l707638j531143k79656J721382K130738R50355N10922L41415n474o42777
$$ plain form
1931 249793777 249119530 249021530 249200821 249386063 250101089 252235413 254417896 255912056 255699883 250836601
1941 250836601 246365547 247893333 250783443 251790047 252345810 252864361 253155708 252997627 252898445
1950 252898445 253489017 254175911 254410019 254688988 255594025 256324768 255953064 255442848 255543480 255968323
1960 255968323 256665955 257678509 259569893 260722637 258892784 256521950 255335331 255237808 257318497
1969 257318497 259747734 260801086 261251450 261209488 260934601 260705223 260571480 260643234 261017323 261987457
1979 261987457 263071537 263856411 264426708 264708519 264764309 264323959 264309406 266140938 268050194 268611431
1989 268611431 268214951 266108990 264293194 265263786 266777039 267034302 267195702 268060455 268910179
1998 268910179 269175758 269208908 269110451 269061565 269268036 269757042 270882835 271870136 271828651 271453857
$$ packed form
1931B49793777o74247r8000J79291J85242P15026K134324K182483J494160k12173m863282
1941B50836601m471054J527786K890110J006604N55763N18551K91347j58081r9182
1950B52898445N90572O86894K34108K78969R05037P30743l71704n10216J00632M24843
1960B55968323O97632J012554J891384J152744j829853k370834j186619r7523K080689
1969B57318497K429237J053352M50364m1962k74887k29378j33743P1754L74089R70134
1979B61987457J084080P84874N70297K81811N5790m40350j4553J831532J909256N61237
1989B68611431l96480k105961j815796R70592J513253K57263J61400Q64753Q49724
1998B68910179K65579L3150r8457m8886K06471M89006J125793R87301m1485l74794
$$ plain form
2008 271453857 271100998 270899048 271099091 271689892 273128281 274258137 273619175 272578239 272130966
2017 272130966 271928558 271934032 272207031 272830963 273694267 274910202 275886059 275914917 275450478 274499168
2027 274499168 273694763 273849964 274433861 275309792 276104450 276307583 276191940 275762081 275312195 275170555
2037 275170555 275236607 275578270 276016960 276386261 276714802 277015209 277166138 276927948 276666412 276667366 276929855
2048 276929855 277712345 278519154 278936863 278976440 278312683 277540207 277151833 277126789 277747154 278594246
2058 278594246 279381523 279993782 280282974 280058861 278618088 277349949 277813187 278793106 279618740 280214787
2068 280214787 280163994 279820919 279318333 278900871 278878441 279186249 280060539 280906448 281134605 280962944
2078 280962944 280217896 279481659 279351006 279608002 280376205 281227589 281799088 282018890 281549683 280823936
$$ packed form
2008B71453857l52859k01950K00043N90801J438389J129856o38962j040936m47273
2017B72130966k02408N474K72999O23932Q63304J215935R75857K8858m64439r51310
2027B74499168q04405J55201N83897Q75931P94658K03133j15643m29859m49886j41640
2037B75170555O6052L41663M38690L69301L28541L00407J50929k38190k61536R54K62489
2048B76929855P82490Q06809M17709L9577o63757p72476l88374k5044O20365Q47092
2058B78594246P87277O12259K89192k24113j440773j268139M63238R79919Q25634N96047
2068B80214787n0793l43075n02586m17462k2430L07808Q74290Q45909K28157j71661
2078B80962944p45048p36237j30653K56996P68203Q51384N71499K19802m69207p25747
$$ plain form
2088 280823936 280045280 279561043 279981136 280719280 281461716 281997452 281959534 281499386 280448914 279396534
2098 279396534 278892040 278881302 279727211 280726204 281293869 281433582 280710449 279854546 279456615 279497623
2108 279497623 280396690 281426907 281969795 282116661 281629791 280876160 280027618 279429665 279647827 280193100
2118 280193100 280866852 281360855 281175385 280685196 279983521 279414902 279428711 279800892 280612717 281396141
2128 281396141 281726360 281553497 280452499 279121628 278035393 277436733 278022289 278904686 279394875
2137 279394875 279593239 279239426 278725624 278385162 278131485 277934799 277954826 278529892 279094696 279150238
2147 279150238 278835297 277920952 277011395 276694775 276787033 277450333 278233528 278777847 278966904 278406868
2157 278406868 277570000 276706219 276087284 276208649 276646137 277220001 277692318 277786255 277435303 276175499
$$ packed form
2088B80823936p78656m84237M20093P38144P42436N35736l7918m60148j050472j052380
2098B79396534n04494j0738Q45909R98993N67665J39713p23133q55903l97931M1008
2108B79497623Q99067J030217N42888J46866m86870p53631q48542n97953K18162N45273
2118B80193100O73752M94003j85470m90189p01675n68619J3809L72181Q11825P83424
2128B81396141L30219j72863j100998j330871j086235n98660N85556Q82397M90189
2137B79394875J98364l53813n13802l40462k53677j96686K0027N75066N64804N5542
2147B79150238l14941r14345r09557l16620R2258O63300P83195N44319J89057n60036
2157B78406868q36868q63781o18935J21365M37488N73864M72317R3937l50952j259804
$$ plain form
2167 276175499 274921646 274559498 274711838 275529137 276314507 276278267 275847912 275088539 274294853 273778915
2177 273778915 273552170 273817539 274310341 274977684 275386086 274915466 274072418 272964478 272166729 272584686
2187 272584686 273334026 273881187 274076691 273458481 272428741 271064987 269876251 269495487 269627342
2196 269627342 270405769 271172523 271236897 270826817 269819260 268575897 267269611 266343117 266550064 267129898
2206 267129898 267610321 267878056 267553558 266961327 266213894 265567303 265350819 265454769 266133080 266622314
2216 266622314 266025772 264996300 263745537 262697697 262480965 262693634 263250122 263829231 264092216
2225 264092216 264003525 263275146 262324333 261340141 260718822 261218548 261941433 262216091 262119293 261353493
2235 261353493 260369301 259475708 258798370 258610497 258777390 259440422 260041962 260010719 259527683 258414040
$$ packed form
2167B76175499j253853l62148J52340Q17299P85370l6240m30355p59373p93686n15938
2177B73778915k26745K65369M92802O67343M08402m70620q43048j107940p97749M17957
2187B72584686P49340N47161J95504o18210j029740j363754j188736l80764J31855
2196B69627342P78427P66754O4374m10080j007557j243363j306286r26494K06947N79834
2206B67129898M80423K67735l24498n92231p47433o46591k16484J03950O78311M89234
2216B66622314n96542j029472j250763j047840k16732K12669N56488N79109K62985
2225B64092216q8691p28379r50813r84192o21319M99726P22885K74658r6798p65800
2235B61353493r84192q93593o77338j87873J66893O63032O01540l1243m83036j113643
$$ plain form
2245 258414040 257175217 256250858 255659332 255721092 255969276 256072521 255942574 255238056 254383564 253670216
2255 253670216 253155937 252999535 253189316 253986130 254729042 254791260 254329453 253019562 251674175 251152763
2265 251152763 250988731 251141777 251191864 250539055 249680042 248944511 248230705 247532845 246890545 246279240
2275 246279240 245883713 246044159 246268749 246087799 245771637 245325089 245074501 245526543 246142387 246602783
2285 246602783 246755371 246207962 245358696 244361401 243554344 243471622 243678322 243968964 244188538 244070530
2295 244070530 243744125 243155956 242584000 242284050 242266426 242697239 243364105 244254589 244932175 244775543
2305 244775543 244324684 243996849 243539085 242720127 241890678 241268158 241019249 241437912 242358685 243928680
2315 243928680 245501289 246567955 246859550 245649109 243799934 241898308 240045547 238490105 237375031
$$ packed form
2245B58414040j238823r24359n91526O1760K48184J03245j29947p04518q54492p13348
2255B53670216n14279j56402J89781P96814P42912O2218m61807j309891j345387n21412
2265B51152763j64032J53046N0087o52809q59013p35531p13806o97860o42300o11305
2275B46279240l95527J60446K24590j80950l16162m46548k50588M52042O15844M60396
2285B46602783J52588n47409q49266r97295q07057q2722K06700K90642K19574j18008
2295B44070530l26405n88169n71956k99950j7624M30813O66866Q90484O77586j56632
2305B44775543m50859l27835m57764q18958q29449o22520k48909M18663R20773J569995
2315B43928680J572609J066666K91595j210441j849175j901626j852761j555442j115074
$$ plain form
2324 237375031 237176170 237141380 236639252 235780239 234221458 232689133 231816063 231537590 232442379 233200302
2334 233200302 232409706 230871201 228893509 226550827 224558353 221299171 214564095 206843147 198563347
2343 198563347 193701973 197131634 206590424 224191437 241682053 250453224 253686180 250128517
2351 250128517 244471321 241852283 239679337 237103939 234031448 230135689 225260963 218174934 211780548
2360 211780548 209742775 208540688 205302238 201744080 198488007 195945969 195096245 194861183 194335709
2369 194335709 193979034 194076538 194241524 193974724 193897972 194653740 195679665 196558723 197495461 198455582
2379 198455582 199736118 201829681 204114437 206191788 207883835 208714962 209178696 209623108 210007191
2388 210007191 210501442 210816612 210616837 210211754 209782829 209376335 209117889 208950996 208868980 208846321
$$ packed form
2324B37375031j98861l4790n02128q59013j558781j532325q73070k78473R04789P57923
2334B33200302p90596j538505j977692k342682j992474l259182o735076p720948q279800
2343A98563347m861374L429661R458790J7601013J7490616Q771171L232956l557663
2351B50128517n657196k619038k172946k575398l072491l895759m874726p086029o394386
2360B11780548k037773j202087l238450l558158l256073k542038q49724k35062n25474
2369A94335709l56675R7504J64986k66800p6752P55768J025925Q79058R36738R60121
2379A98455582J280536K093563K284756K077351J692047Q31127M63734M44412L84083
2388B10007191M94251L15170j99775m05083m28925m06494k58446j66893q2016k2659
$$ plain form
2398 208846321 208919048 208895912 208533516 208022842 207411995 206884384 206688156 206674805 206909180 206998825 206434250
2409 206434250 205628872 204756966 204025745 203810692 203778038 203717003 203631172 203506699 203185310 202385426
2419 202385426 201462517 200621605 200028896 200050831 200291862 200554619 200610390 200011253 199214935 198547840
2429 198547840 197954407 197470665 197147141 197162399 197167397 196786652 196276436 195828209 195259571 194230556
2439 194230556 193404675 193568459 194009781 194302788 194373856 193920860 193202972 192252884 191446075 191328278
2449 191328278 191419830 191374302 191334953 191415787 191357136 190810680 190154800 189630032 189300537 189421883 189658394
2460 189658394 189786434 189722061 189196358 188539028 187942982 187546730 187659264 187959671 188292732 188470364
2470 188470364 188173523 187637558 186926365 186233997 185812473 185548553 185453892 185402393 185300598 185059776
$$ packed form
2398B08846321P2727k3136l62396n10674o10847n27611j96228j3351K34375Q9645n64575
2409B06434250q05378q71906p31221k15053l2654o1035q5831j24473l21389p99884
2419B02385426r22909q40912n92709K1935K41031K62757N5771n99137p96318o67095
2429A98547840n93433m83742l23524J5258M998l80745n10216m48227n68638j029015
2439A94230556q25881J63784M41322K93007P1068m52996p17888r50088q06809j17797
2449A91328278R1552m5528l9349Q0834n8651n46456o55880n24768l29495J21346K36511
2460A89658394J28040o4373n25703o57330n96046l96252J12534L00407L33061J77632
2470A88470364k96841n35965p11193o92368m21524k63920r4661n1499j01795k40822
$$ plain form
2480 185059776 184442520 183800220 183418503 183254013 183450222 183731804 183904171 183868637 183320770 182681313
2490 182681313 182328224 182082405 181842327 181752930 182116737 182359219 181872139 181057701 179957619 179043045
2500 179043045 178931961 179225197 179896126 180444489 180210838 179644585 178864708 178201199 178155670 178329239
2510 178329239 178501358 178636322 178618431 178464165 178106785 177680244 177272072 176953793 176893959 176886559 176757812
2521 176757812 176579952 176364422 176118126 175826302 175564537 175415516 175339699 175328026 175368786 175522079
2531 175522079 175560722 175167084 174672127 174306145 174051285 173970699 174051514 174401760 174721489 174731979 174475193
2542 174475193 173675060 173005829 173291435 173805714 174055099 174165249 174088478 173851242 173397293 172926674
2552 172926674 172598610 172479153 172828445 173220863 173248768 173117638 172881851 172586441 172254086 172004471
$$ packed form
2480A85059776o17256o42300l81717j64490J96209K81582J72367l5534n47867o39457
2490A82681313l53089k45819k40078q9397L63807K42482m87080q14438j100082r14574
2500A79043045j11084K93236O70929N48363k33651n66253p79877o63509m5529J73569
2510A78329239J72119J34964j7891j54266l57380m26541m08172l18279n9834p400j28747
2521A76757812j77860k15530k46296k91824k61765j49021p5817j1673M0760J53293
2531A75522079L8643l93638m94957l65982k54860q0586Q0815L50246L19729J0490k56786
2542A74475193q00133o69231K85606N14279K49385J10150p6771k37236m53949m70619
2552A72926674l28064j19457L49292L92418K7905j31130k35787k95410l32355k49615
$$ plain form
2562 172004471 172010422 172132263 172332764 172477493 172354698 172158718 172015419 171915283 171896458 171939621 172063828
2573 172063828 172192097 172266960 172245979 172012329 171731720 171543598 171409378 171283722 171323051 171846619
2583 171846619 172320366 172230244 171833267 171078682 170375099 170207748 170295486 170579681 170875778 170926323
2593 170926323 170889626 170829048 170771370 170839787 170807838 170372963 169885635 169682503 169502258 169174671 168762436
2604 168762436 168148041 167701721 167984009 168303013 168021679 167536011 167040100 166500816 165889969 165386925
2614 165386925 165230751 165212631 165228367 165201187 164949188 164680958 164553642 164536705 164710045 164897442 164885998
2625 164885998 164863815 165038834 165137062 164874554 164487610 164085865 163764229 163734665 163752785 163571358 163409004
2636 163409004 163454285 163550148 163582325 163607121 163721085 163688660 163124084 162574043 162624130 162771454 162656555
$$ packed form
2562A72004471N951J21841K00501J44729j22795j95980j43299j00136j8825M3163J24207
2573A72063828J28269P4863k0981k33650k80609j88122j34220j25656L9329N23568
2583A71846619M73747r0122l96977p54585p03583j67351Q7738K84195K96097N0545
2593A70926323l6697o0578n7678O8417l1949m34875m87328k03132j80245l27587m12235
2604A68762436o14395m46320K82288L19004k81334m85668m95911n39284o10847n03044
2614A65386925j56174j8120J5736k7180k51999k68230j27316j6937J73340J87397j1444
2625A64885998k2183J75019R8228k62508l86944m01745l21636k9564J8120j81427j62354
2636A63409004M5281R5863L2177K4796J13964l2425n64576n50041N0087J47324j14899
$$ plain form
2647 162656555 162432194 162071228 161752930 161675682 161752472 162007332 162305603 162606716 162649632 161959648
2657 161959648 161134720 160639286 160396347 160591354 160900593 161101818 161072254 160440674 159730434 159421921
2667 159421921 159271002 159214497 159188271 159087420 158968449 158871889 158739805 158493757 158234835 157988071
2677 157988071 157899857 158286095 158661127 158533335 158234119 157864809 157621384 157846928 158199072 158491135
2687 158491135 158599138 158181190 157701969 157655954 157608986 157179594 156701565 156430483 156216621 156030178
2697 156030178 155766487 155230761 154662132 154237747 153947592 153880119 153914928 153981209 154016733 153936148 153738022
2708 153738022 153318405 152896881 152696133 152602434 152637720 152617455 152254820 151877642 151824236 151773930 151476622
2719 151476622 151055813 150505781 149962187 149572849 149292946 149202585 149071455 148562193 148072958 147967577
$$ packed form
2647A62656555k24361l60966l18298p7248P6790K54860K98271L01113M2916o89984
2657A61959648q24928m95434k42939J95007L09239K01225k9564o31580p10240l08513
2667A59421921j50919n6505k6226j00851j18971r6560j32084k46048k58922k46764
2677A57988071q8214L86238L75032j27792k99216l69310k43425K25544L52144K92063
2687A58491135J08003m17948m79221m6015m6968m29392m78029k71082k13862j86443
2697A56030178k63691n35726n68629m24385k90155o7473L4809O6281L5524q0585j98126
2708A53738022m19617m21524k00748r3699L5286k0265l62635l77178n3406n0306k97308
2719A51476622m20809n50032n43594l89338k79903r0361j31130n09262m89235j05381
$$ plain form
2729 147967577 148008823 148095608 148183107 148221731 148122787 147698641 147194624 146799564 146492243 146357298 146264076
2740 146264076 146083355 145895720 145788670 145610094 145180225 144669294 144130230 143732309 143777609 143919945
2750 143919945 143913746 143758059 143301249 142747879 142180204 141811609 142014027 142393827 142728567 142873764
2760 142873764 142413139 141937017 142034054 142289400 142456293 142617464 142822981 142923594 142746925 142409086
2770 142409086 141942739 141424417 140867949 140493393 140643835 140964270 141263723 141389608 140935421 140470028
2780 140470028 140564680 140805006 140966892 141049385 140920639 140745640 140681982 140619040 140523195 140320539 139771700
2791 139771700 139337778 139576912 139956713 140151024 140096188 139399290 138719559 138769388 138994694 139032125
2801 139032125 139021873 139015913 138914108 138554573 138171911 137984037 137878895 137816906 137795448 137800694 137825489
$$ packed form
2729A47967577M1246Q6785Q7499L8624r8944m24146n04017l95060l07321j34945r3222
2740A46264076j80721j87635j07050j78576m29869n10931n39064l97921M5300J42336
2750A43919945o199j55687m56810n53370n67675l68595K02418L79800L34740J45197
2760A42873764m60625m76122R7037K55346J66893J61171K05517J00613j76669l37839
2770A42409086m66347n18322n56468l74556J50442L20435K99453J25885m54187m65393
2780A40470028R4652K40326J61886Q2493j28746j74999o3658o2942r5845k02656n48839
2791A39771700m33922K39134L79801J94311n4836o96898o79731M9829K25306L7431
2801A39032125j0252n960j01805l59535l82662j87874j05142o1989k1458N246K4795
$$ plain form
2812 137825489 137885094 137896776 137771130 137543201 137144089 136794090 136771202 136832952 136832237 136759758 136558294
2823 136558294 136223555 135640144 135082006 134849787 134746552 134715319 134636164 134334087 133914471 133395910
2833 133395910 132863283 132507086 132028341 131179333 129995346 128444433 126477242 124004126 121114254
2842 121114254 117761612 114259481 110973835 107699633 104303360 100933075 97669840 94579458 91658592
2851 91658592 89193821 87498665 86487055 86184025 86566925 87690115 89344263 91373444 93671560
2860 93671560 96192598 98600388 100420713 102020979 103607178 105185986 106910229 108544827 109846592
2869 109846592 110991716 112062931 113095045 114173651 115229368 116193771 117149591 118155956 119213343
2878 119213343 120411396 121539116 122367144 123038054 123629808 124103785 124433041 124660015 124842644 124904871
$$ packed form
2812A37825489N9605J1682j25646k27929l99112l49999k2888O1750p15p2479k01464
2823A36558294l34739n83411n58138k32219j03235l1233p9155l02077m19616n18561
2833A33395910n32627l56197m78745q49008j183987j550913j967191k473116k889872
2842A21114254l352642l502131l285646l274202l396273l370285l263235l090382k920866
2851I1658592k464771j695156j011610l03030L82900J123190J654148K029181K298116
2860I3671560K521038K407790J820325J600266J586199J578808J724243J634598J301765
2869A09846592J145124J071215J032114J078606J055717R64403R55820J006365J057387
2878A19213343J198053J127720Q28028O70910N91754M73977L29256K26974J82629O2227
$$ plain form
2888 124904871 124770164 124496460 124126911 123629332 122963905 122195482 121396303 120502710 119475603 118310690
2898 118310690 116973877 115513086 113923311 112326384 110888243 109469175 108079195 106431723 104121923
2907 104121923 101513624 98808289 96087933 93525410 91048002 88714361 86301804 83514690 80630302
2916 80630302 77803135 75103998 72687149 70453405 68288565 66390991 64966440 63878298 63098192
2925 63098192 62507153 62061310 61504126 60420752 59240341 58317423 57461023 56598186 55726051 54848909
2935 54848909 53871870 52488327 51334143 50971270 51314831 52461147 54428816 57425737 60979128
2944 60979128 64677000 68544149 72538137 76448202 80037594 83341837 86303711 88964701 91208458
2953 91208458 93448162 96207619 99038363 101661682 104089975 106200457 108116627 109874725 111611605
$$ packed form
2888A24904871j34707k73704l69549m97579o65427p68423p99179q93593j027107j164913
2898A18310690j336813j460791j589775j596927j438141j419068j389980j647472k309800
2907A04121923k608299k705335k720356k562523k477408k333641k412557k787114k884388
2916H0630302k827167k699137k416849k233744k164840j897574j424551j088142p80106
2925F3098192n91039m45843n57184j083374j180411r22918q56400q62837q72135q77142
2935E4848909r77039j383543j154184l62873L43561J146316J967669K996921L553391
2944F0979128L697872L867149L993988L910065L589392L304243K961874K660990K243757
2953I1208458K239704K759457K830744K623319K428293K110482J916170J758098J736880
$$ plain form
2962 111611605 113461971 115467787 117892981 120205402 121741533 123158932 125080347 126946449 128315687
2971 128315687 129456997 130470991 131420851 132405043 133418322 134467602 135612488 136920691 138374329
2980 138374329 140033960 141731501 143268347 144796610 146415234 148082256 149895191 151532888 152593136
2989 152593136 153414726 154189825 154954195 155805349 156749725 157909870 159031868 159879208 160519600 160855064
2999 160855064 161144733 161705246 162264824 162583580 162882080 163392544 163838387 163986931 163937092 163563251
3009 163563251 163304806 163767815 164324036 164465675 164435616 164227257 164080620 164355507 164684525 164735317
3019 164735317 164762020 164959908 165171852 165308475 165360680 165182838 165093193 165488720 165987015 166274548
3029 166274548 166539192 166903973 167248497 167513847 167637348 167386780 167210350 167650948 168190727 168479443
$$ packed form
2962A11611605J850366K005816K425194K312421J536131J417399J921415J866102J369238
2971A28315687J141310J013994R49860R84192J013279J049280J144886J308203J453638
2980A38374329J659631J697541J536846J528263J618624J667022J812935J637697J060248
2989A52593136Q21590P75099P64370Q51154R44376J160145J121998Q47340O40392L35464
2999A60855064K89669N60513N59578L18756K98500N10464M45843J48544m9839l73841
3009A63563251k58445M63009N56221J41639l0059k08359j46637K74887L29018N0792
3019A64735317K6703J97888K11944J36623N2205j77842q9645L95527M98295K87533
3029A66274548K64644L64781L44524K65350J23501k50568j76430M40598N39779K88716
$$ plain form
3039 168479443 168555489 168195724 167834511 167920341 168184757 168542137 168892632 169074535 169187317 169281235
3049 169281235 169340134 169398079 169351349 169041862 168666840 168381691 168150902 168027401 167898178 167601585
3059 167601585 167333603 167298546 167307625 167234192 167093754 166809311 166531563 166384926 166368713 166592369 166849613
3070 166849613 166892052 166953316 167330017 167581329 167240372 166678658 166066895 165540466 165364265 165320625
3080 165320625 165219536 165242920 165594578 166015854 166311989 166492462 166437874 166338196 166352749 166452637 166707993
3091 166707993 166978836 167138824 167216301 167138824 167081604 167290688 167478790 167328835 167173862 167294502
3101 167294502 167530537 167845249 168148994 168271790 168416023 168784142 169202576 169632435 169869423 169485569
3111 169485569 169111729 169399738 169856796 170200825 170448532 170433044 170422554 170721531 171052704 171193848
$$ packed form
3039A68479443P6046l59765l61213Q5830K64416L57380L50495J81903J12782R3918
3049A69281235N8899N7945m6730l09487l75022k85149k30789j23501j29223k96593
3059A67601585k67982l5057R079p3433j40438k84443k77748j46637j6213K23656K57244
3070A66849613M2439O1264L76701K51312l40957n61714o11763n26429j76201m3640
3080A65320625j01089K3384L51658M21276K96135J80473n4588r9678J4553R9888K55356
3091A66707993K70843J59988P7477p7477n7220K09084J88102j49955j54973J20640
3101A67294502K36035L14712L03745J22796J44233L68119M18434M29859K36988l83854
3111A69485569l73840K88009M57058L44029K47707j5488j0490K98977L31173J41144
$$ plain form
3121 171193848 171282539 171364059 171490669 171705971 172077656 172805309 173534164 173914433 174129486 174171448
3131 174171448 174263725 174753914 175261021 175486088 175527344 175217628 175051689 175688267 176466217 176839828
3141 176839828 177121639 177468071 177799950 178081512 178338528 178625832 178818703 178729534 178601742 178677559
3151 178677559 178772202 178735962 178703308 178760052 178898811 179229736 179483185 179318199 179057598 178882370 178873787
3162 178873787 179319859 179778576 179821243 179692745 179476967 179225922 179035912 178854713 178671837 178456306
3172 178456306 178206673 177820683 177084446 176330090 175927639 175547123 174938927 174231758 173458576 172656288
3182 172656288 171864033 171106110 170420418 169802189 169306755 168792000 168128014 167331696 166324139 165259838
3192 165259838 164331207 163342476 162094116 160787582 159463167 158402920 158109188 157958508 157429934
$$ packed form
3121A71193848Q8691Q1520J26610K15302L71685P27653P28855L80269K15053M1962
3131A74171448R2277M90189N07107K25067M1256l09716j65939O36578P77950L73611
3141A76839828K81811L46432L31879K81562K57016K87304J92871q9169j27792P5817
3151A78677559R4643l6240l2654N6744J38759L30925K53449j64986k60601j75228q583
3162A78873787M46072M58717M2667j28498k15778k51045j90010j81199j82876k15531
3172A78456306k49633l85990p36237p54356m02451l80516o08196p07169p73182q02288
3182A72656288p92255p57923o85692o18229m95434n14755o63986p96318j007557j064301
3192A65259838r28631r88731j248360j306534j324415j060247k93732j50680n28574
$$ plain form
3201 157429934 156716585 155825615 154792786 153604507 152412653 151386738 150457859 149625778 148852825
3210 148852825 148072481 147367954 146854401 146368742 145836830 145103931 143821001 142495394 141525984 140887260
3220 140887260 140849352 140923977 140679836 140214205 139421940 138476610 137442589 136539936 136077404 135852575
3230 135852575 135815620 135816574 135744810 135430813 134483337 133456945 132863760 132436752 132177353 131791353 130861998
3241 130861998 129754782 128684282 127685785 126881361 126222849 125837803 125318766 124034166 122783899
3250 122783899 122439146 122153997 121231556 120092630 118908644 117730618 116686583 115715265 114823580
3259 114823580 113933086 112894058 111926794 111317396 110718012 109724522 108788729 108379841 108041048 107432604
3269 107432604 106669426 105669975 104684114 103949308 103418589 103196144 103064537 102836132 102523565 102000952
$$ packed form
3201A57429934p13349q90970j032829j188279j191854j025915r28879q32081p72953
3210A48852825p80344p04527n13553m85659n31912p32899j282930j325607r69410o38724
3220A40887260l7908P4625k44141m65631p92265r45330j034021r02653m62532k24829
3230A35852575l6955R54p1764l13997r47476j026392n93185m27008k59399l86000r29355
3241A30861998j107216j070500r98497q04424o58512l85046n19037j284600j250267
3250A22783899l44753k85149r22441j138926j183986j178026j044035r71318q91685
3259A14823580q90494j039028r67264o09398n99384r93490r35793m08888l38793o08444
3269A07432604p63178r99451r85861p34806n30719k22445j31607k28405l12567n22613
$$ plain form
3279 102000952 101493359 101224422 101072550 100992203 100975752 100975990 101064920 101361275 101677656 101858616 101925850
3290 101925850 101732016 101626396 102039099 102577448 102867603 103283167 104255438 105235577 105642557 106002331
3300 106002331 106719255 107575417 108568907 109453678 109834194 110156298 110783577 111567259 112569571 113518953
3310 113518953 113979340 114506245 115671873 116990328 118141174 119197369 119991064 120922565 122512817
3319 122512817 124231339 125754595 126980066 127550840 127905846 128312826 128925323 130117893 131493568
3328 131493568 132805347 133976936 134786844 135421753 135991335 136502981 136933804 137481928 138397455 139500141
3338 139500141 140702963 141974449 143247604 144541264 145825386 147178411 148728132 150293112 151658773
3347 151658773 153049946 154695749 156368494 157898188 159338713 160596619 161943665 163784504 165624847
$$ packed form
3279A02000952n07593k68937j51872q0347j6451K38Q8930K96355L16381J80960O7234
3290A01925850j93834j05620M12703N38349K90155M15564R72271R80139M06980L59774
3300A06002331P16924Q56162R93490Q84771L80516L22104O27279P83682J002312R49382
3310A13518953M60387N26905J165628J318455J150846J056195P93695R31501J590252
3319A22512817J718522J523256J225471N70774L55006M06980O12497J192570J375675
3328A31493568J311779J171589Q09908O34909N69582N11646M30823N48124R15527J102686
3338A39500141J202822J271486J273155J293660J284122J353025J549721J564980J365661
3347A51658773J391173J645803J672745J529694J440525J257906J347046J840839J840343
$$ plain form
3356 165624847 167090416 168224564 168794403 169252396 170037498 170955429 172019234 173045635 173781395
3365 173781395 174449196 175268173 175995827 176299572 176666985 177647591 178721199 179502487 180133095 180596352
3375 180596352 180980911 181364536 181761265 182234287 182711601 183175564 183523655 183531532 183546066 183922291
3385 183922291 184408417 184867382 185309887 185737133 186038494 185977211 185933113 186331978 186795712 187084198
3395 187084198 187207451 186983833 186748028 186798325 187060833 187728405 188297272 188122025 187818050 187812328
3405 187812328 188022385 188671589 189266682 189185143 189037800 189318180 189752350 190310001 190753708 190775394
3415 190775394 190554848 190163612 189616203 188765755 188167572 188535690 189244041 189819107 190516701 191559792
3425 191559792 192572117 193112850 193598022 194393387 195207596 195853004 196382523 196706295 197065125 197756538
$$ packed form
3356A65624847J465569J134148N69839M57993P85102R17931J063805J026401P35760
3365A73781395O67801Q18977P27654L03745L67413R80606J073608P81288O30608M63257
3375A80596352L84559L83625L96729M73022M77314M63963L48091P877J4534L76225
3385A83922291M86126M58965M42505M27246L01361o1283m4098L98865M63734K88486
3395A87084198J23253k23618k35805N0297K62508O67572N68867j75247l03975n722
3405A87812328K10057O49204N95093q1539j47343K80380M34170N57651M43707K1686
3415A90775394k20546l91236n47409q50448n98183L68118P08351N75066O97594J043091
3425A91559792J012325N40733M85172P95365Q14209O45408N29519L23772L58830O91413
$$ plain form
3435 197756538 198517799 199136505 199759254 200400581 201241970 202782402 204080353 204252243 203620434 201660385
3445 201660385 200028191 200749874 202189217 203228951 204336891 205711842 207040310 208048592 208813896
3454 208813896 209234715 209572315 210070381 210679531 211487770 212325573 213062286 213668098 214041710 214265594
3464 214265594 214274635 214407692 215080032 215993404 217095146 218062172 218387375 218567619 218894730 219474068
3474 219474068 220758667 221995583 222567081 222520103 221305847 220090866 220070610 220609894 221717834
3483 221717834 222654114 222319126 221798897 221920013 222359657 223168373 224050045 224723339 225191841 225158463
3493 225158463 225242844 226108074 227324715 229091873 230183830 228826046 226860771 225419521 224859238
3502 224859238 226549377 228581429 229382992 229312668 227597713 226059189 226734390 228200684 229758987
$$ packed form
3435A97756538P61261O18706O22749O41327Q41389J540432J297951J71890o31809j960049
3445B01660385j632194P21683J439343J039734J107940J374951J328468J008282P65304
3454B08813896M20819L37600M98066O09150Q08239Q37803P36713O05812L73612K23884
3464B14265594R041J33057O72340R13372J101742R67026L25203J80244L27111N79338
3474B19474068J284599J236916N71498m6978j214256j214981k0256N39284J107940
3483B21717834R36280l34988n20229J21116M39644Q08716Q81672O73294M68502l3378
3493B25158463Q4381Q65230J216641J767158J091957j357784j965275j441250n60283
3502B24859238J690139K032052Q01563p0324j714955j538524O75201J466294J558303
$$ plain form
3511 229758987 231275787 232259274 233083248 233934631 234881401 236294270 237449169 237625599 237181435
3520 237181435 236005554 234782219 234402180 234133492 233315697 232624054 232455730 232981453 234884491
3529 234884491 237022877 238494396 239262810 238585472 237677345 237394333 238068581 240840187 244138947
3538 244138947 246963730 248746395 248377800 246479034 242440948 238845348 238622894 240115891 243444443
3547 243444443 246203651 245044708 242918243 241511822 241264114 243917236 247247696 249365330 251008987
3556 251008987 251813889 253198395 257227669 261593094 265658150 266469727 259048691 248835564 238368263
3565 238368263 231375217 234650383 241532803 247742882 252928257 254681358 254884720 254428387 253880501
3574 253880501 254278908 255103588 255750885 257509708 262038002 267622471 274430046 278475037 274484634
$$ packed form
3511B29758987J516800R83487Q23974Q51383R46770J412869J154899J76430m44164
3520B37181435j175881j223335l80039k68688q17795o91643j68324N25723J903038
3529B34884491K138386J471519P68414o77338r08127k83012O74248K771606L298760
3538B44138947K824783J782665l68595j898766m038086l595600k22454J492997L328552
3547B43444443K759208j158943k126465j406421k47708K653122L330460K117634J643657
3556B51008987Q04902J384506M029274M365425M065056Q11577p421036j0213127j0467301
3565B38368263o993046L275166O882420O210079N185375J753101K03362m56333n47886
3574B53880501L98407Q24680O47297J758823M528294N584469O807575M044991l990403
$$ plain form
3583 274484634 266486397 254667511 245274544 246730328 252690544 260833511 267512798 266481171
3591 266481171 263218651 261221886 260190735 261843204 263618240 262643585 261567116 261974106 264178047
3600 264178047 270281563 276500931 279756069 280037403 274677505 268570175 266251564 266123543 268956413
3609 268956413 272177696 272287369 272835503 278446198 282393684 277677307 269745102 259940624 253574142
3618 253574142 258073082 268429527 284174919 299116364 307433853 307538033 292724609 272516022
3626 272516022 251482735 237772942 246946812 261335602 266139755 268308411 269618511 270787468
3634 270787468 273746719 276631126 277116299 278507710 283832321 291598091 302525291 313000679
3642 313000679 321920395 322473984 302366257 276945591 256630173 243913651 248038063 259174824
$$ packed form
3583B74484634p998237j1818886r392967J455784N960216Q142967O679287j031627
3591B66481171l262520j996765j031151J652469J775036r74655j076469M06990K203941
3600B64178047O103516O219368L255138K81334n359898o107330k318611j28021K832870
3609B68956413L221283J09673N48134N610695L947486m716377p932205r804478o366482
3618B53574142M498940J0356445J5745392J4941445Q317489J04180j4813424k0208587
3626B72516022k1033287j3709793R173870J4388790M804153K168656J310100J168957
3634B70787468K959251K884407M85173J391411N324611P765770J0927200J0475388
3642C13000679Q919716N53589k0107727k5420666k0315418j2716522M124412J1136761
$$ plain form
3650 259174824 272487411 282241592 277486076 269033909 264075756 262523880 268784046 276566505
3658 276566505 279511681 282234421 287589798 294496765 304773560 312575111 311401844 305032005
3666 305032005 292098274 281534920 285737762 292951107 297211876 293536911 266626358 241463890
3674 241463890 244569778 256033669 263440857 270822525 277657280 285185585 295718193 305521240
3682 305521240 312693825 314047089 303576241 287827721 268886795 254130592 254874458 261387100
3690 261387100 267268906 273838043 280682793 286593208 290079594 291569233 291286240 288348427 279368401
3699 279368401 272083511 274715900 282421112 295045624 306735516 311518669 309596062 296782970
3707 296782970 280261765 264269352 253455162 256303310 265544415 278049469 289878616 294819107
$$ packed form
3650B59174824J3312587R754181m755516q452167m958153j551876O260166P782459
3658B76566505K945176K722740N355377O906967J0276795P801551j173267o369839
3666C05032005j2933731j0563354M202842P213345M260769l674965k6910553k5162468
3674B41463890L105888J1463891P407188P381668O834755P528305J0532608R803047
3682C05521240P172585J353264j0470848j5748520j8940926j4756203P43866O512642
3690B61387100N881806O569137O844750N910415L486386J489639k82993k937813q980026
3699B79368401p284890K632389P705212J2624512J1689892M783153j922607j2813092
3707B96782970j6521205j5992413j0814190K848148R241105J2505054J1829147M940491
$$ plain form
3715 294819107 296557903 296764145 295276642 292322388 288403511 283508072 279403687 277794361 278857002
3724 278857002 283441315 291231880 305191040 316334496 314631691 306182384 292662849 277311325
3732 277311325 262137413 252502670 255975246 267941704 290218124 311081409 317815056 315213928
3740 315213928 300496330 283675194 273101807 270977745 290863514 307032108 289143791 264596462
3748 264596462 252063980 247375717 255234947 267692089 279437294 287252197 283233643 276125679
3756 276125679 272106647 270967255 275960922 282875290 289153328 293082008 290619850 286194801 283846626
3765 283846626 280697823 273536205 267404327 266823292 270142326 278875122 288048515 292790890 294308662
3774 294308662 291579018 286417007 278907547 273215065 275703430 279859066 280673504 279994965 277023544
$$ packed form
3715B94819107J738796K06242j487503k954254l918877m895439m104385j609326J062641
3724B78857002M584313P790565J3959160J1143456j702805q449307j3519535j5351524
3732B77311325j5173912r634743L472576J1966458K2276420K0863285O733647k601128
3740C15213928j4717598j6821136j0573387k124062J9885769J6168594j7888317k4547329
3748B64596462j2532482m688263P859230J2457142J1745205P814903m018554p107964
3756B76125679m019032j139392M993667O914368O278038L928680k462158m425049k348175
3765B83846626l148803p161618o131878n81035L319034Q732796R173393M742375J517772
3774B94308662k729644n162011p509460n692482K488365M155636Q14438o78539k971421
$$ plain form
3783 277023544 274694920 276695023 279970894 282245159 284874687 289033890 292992821 295008183 296292782
3792 296292782 297628403 298563728 299271812 298659096 296078911 290360451 276627312 265347710 269556522
3801 269556522 276675701 277606239 274943123 264464607 257521152 268333435 284066925 296856155
3809 296856155 306013336 307127228 303501606 295326233 287529716 287382851 288046837 284937382 278560638
3818 278560638 263998032 252937794 259894848 271468887 278102398 282779217 284269333 285655251
3826 285655251 291145802 296128502 295828342 294939766 298315048 300705185 298059235 291635036 279235363
3835 279235363 267173767 262144089 260807266 262762547 265886536 266491165 268866539 276512146 288111458
3844 288111458 305851460 322719803 333973389 334989548 315897713 287697792 253076782 227101555
$$ packed form
3783B77023544k328624K000103L275871K274265K629528M159203L958931K015362J284599
3792B96292782J335621R35325P08084o12716k580185n718460j3733139j1279602M208812
3801B69556522P119179R30538k663116j0478516o943455J0812283J5733490J2789230
3809B96856155R157181J113892l625622q175373p796517j46865O63986l109455o376744
3818B78560638j4562606j1060238O957054J1574039O633511M676819J490116J385918
3826B85655251N490551M982700l00160q88576L375282K390137k645950o424199j2399673
3835B79235363j2061596n029678j336823J955281L123989O04629K375374P645607J1599312
3844B88111458J7740002J6868343J1253586J016159j9091835k8199921l4621010k5975227
$$ plain form
3852 227101555 232045650 248974571 267163754 284254551 293400040 297337761 295562744 290953636
3860 290953636 285412064 281362534 283289909 286912689 290629616 290882835 280332794 268720627
3868 268720627 264484882 264190197 268075714 273555984 277464867 281780472 289329052 294400215 289664040
3877 289664040 282805672 279690514 278445473 280683289 281811943 274649391 268575439 273751030 280649910
3886 280649910 282714119 281198730 271901855 264634132 270831833 281416168 291656017 299941292
3894 299941292 302640686 301083565 294471264 285556068 276757469 268274078 260554790 255266190 254552116
3903 254552116 257427692 264967194 273134232 277267933 280315628 284149170 287333965 289201260 289324036
3912 289324036 286580086 282384148 276853561 272755852 274239769 277275562 279184341 280060997 278326988
$$ packed form
3852B27101555M944095J6928921J8189183J7090797R145489L937721j775017m609108
3860B90953636n541572m049530J927375L622780L716927K53219j0550041j1612167
3868B68720627m235745k94685L885517N480270L908883M315605P548580N071163m736175
3877B89664040o858368l115158j245041K237816J128654p162552o073952N175591O898880
3886B80649910K064209j515389r296875p267723O197701J0584335J0239849Q285275
3894B99941292K699394j557121o612301q915196q798599q483391p719288n288600p14074
3903B54552116K875576P539502Q167038M133701L047695L833542L184795J867295J22776
3912B89324036k743950m195938n530587m097709J483917L035793J908779Q76656j734009
$$ plain form
3921 278326988 276321888 275907745 276935577 281180611 284730186 283316841 279776802 274881134 270557632
3930 270557632 269314041 270179024 273655415 277825832 280872345 282996902 283797264 283265591 280618439
3939 280618439 277776947 276487122 276488533 279140949 281329155 279365063 276326904 274008026 272574196
3948 272574196 273205528 274651051 276093006 277409782 278120518 278484116 278645287 278465996 277694473
3957 277694473 276816597 276250610 275947094 275999298 276396980 277362099 278290024 278489342 278439293 278402557
3967 278402557 278334141 278356781 278229942 277648926 276928177 276180038 275703201 275981674 276570797 277288666
3977 277288666 277830601 277622452 277287712 277307281 277533054 278093567 278639793 278848171 278770447 278235207
3987 278235207 277585506 277152290 276799679 276437988 276255836 276491890 276903629 277474403 277765045 277003288
$$ packed form
3921B78326988k005100m14143J027832M245034L549575j413345l540039m895668m323502
3930B70557632j243591Q64983L476391M170417L046513K124557Q00362n31673k647152
3939B80618439k841492j289825J411K652416K188206j964092l038159k318878j433830
3948B72574196O31332J445523J441955J316776P10736L63598J61171j79291p71523
3957B77694473q77876n65987l03516N2204L97682R65119R27925J99318n0049l6736
3967B78402557o8416K2640j26839n81016p20749p48139m76837K78473N89123P17869
3977B77288666N41935k08149l34740J9569K25773N60513N46226K08378p7724n35240
3987B78235207o49701m33216l52611l61691j82152K36054M11739N70774K90642p61757
$$ plain form
3997 277003288 276169300 276146164 276452065
4000 276452065
$$ packed form
3997B77003288q33988k3136L05901
4000B76452065
##END=$$ End of the data block
