##TITLE=$$ Begin of the data block
##JCAMP-DX=5.00 $$ ACD/SpecManager v 10.08
##SPECTROMETER/DATA SYSTEM=16PC
##DATE=Wed Sep 11 13:50:49 2013
##DATA TYPE=INFRARED SPECTRUM
##DATA CLASS=XYDATA
##ORIGIN=
##OWNER=
##NPOINTS=3401
##FIRSTX=600.00000000
##LASTX=4000.00000000
##MAXX=4000.00000000
##MINX=600.00000000
##MAXY=106.31942749
##MINY=26.55639648
##XFACTOR=1.0000000000
##YFACTOR=0.000001000000000
##FIRSTY=88.74291992
##DELTAX=1.00000000
##XUNITS=1/CM
##YUNITS=TRANSMITTANCE
##XYDATA=(X++(Y..Y))
600 88742920 89185806 89535210 89574524 89589096 89863518 90183113 90332581 90598129 91400215 92120697 92121078
611 92121078 91882683 91653320 91494987 91588783 91824959 92206192 92576172 92734123 92815826 92883255 92956924
622 92956924 93126511 93246338 93153259 92989037 92792801 92709259 93027260 93353271 93318367 93137405 92873856
633 92873856 92612984 92531799 92418221 91997215 91634392 91619995 91904854 92680595 93514992 94062378 94254303
644 94254303 93674301 93020462 92951820 93169022 93756416 94221733 93835091 93393517 93664078 94006683
654 94006683 93889618 93754623 94001862 94224075 94050690 93771431 93589333 93393517 93112305 92830894
664 92830894 92707420 92451218 91550232 90826439 91164871 91864014 92547440 93124603 93315765 93311882 93127678
675 93127678 93011765 93298576 93744972 94279221 94721413 94794487 94717857 94585609 94496468 94607635 94837639
686 94837639 95143578 95566818 96265770 96846130 96852402 96626572 96368004 96048927 95682503 95345261 95085976
697 95085976 95001053 95281052 95692207 96082832 96396927 96450546 96475746 96662285 96952866 97395515 97863770
708 97863770 98205353 98545547 98976562 99445175 100012184 100427673 100377060 100115135 99811028 99406815
718 99406815 98839615 98293068 98011444 97749619 97284744 96793915 96380951 96042755 95789841 95685196
728 95685196 95872620 96119949 96258522 96241638 95903015 95432518 94831039 94498970 94936226 95845100
738 95845100 97282600 98684433 99374344 99745033 99962402 100030563 99985458 99897316 99911186 99838448 99487999
749 99487999 99012230 98425148 97950867 97900627 98026848 98257614 98376846 98011490 97560455 97347237
759 97347237 97224716 97158119 97133591 97221779 97134232 96373627 95636917 95617203 95828415 95979645 96178314
770 96178314 96446419 96749046 97060631 97374985 97666145 97967552 98305962 98675514 99121002 99517128
780 99517128 99741074 99830223 99749397 99593208 99462746 99303391 99097588 98834869 98451141 98089508 97940849
791 97940849 97797684 97565842 97096062 96190834 94900581 93235329 91118744 88373589 85312340
800 85312340 82413574 79001617 74137428 69089630 64934494 61309742 57987259 55640625 55049179
809 55049179 55667473 57303810 59675907 62541176 65588783 68640396 71055794 71879387 71878937 71629288
819 71629288 70753410 68957588 66566467 63748550 60678482 57429028 54474140 52390789 50942375
828 50942375 50051857 49817421 50399925 51534081 53035236 54822350 56741619 58826683 61075928
837 61075928 63441277 65921310 68374466 70634293 72773933 74781227 76745537 78830078 80801079
846 80801079 82412697 83864281 85354492 86639549 87468628 88061142 88551620 88943718 89248367 89578156
856 89578156 90127876 90661766 90982147 91169426 91173676 91187881 91450310 91775299 92048172 92294075 92491577
867 92491577 92665741 92846367 92997765 93084457 93135330 93181160 93180679 93088127 92947647 92744804 92609573
878 92609573 92742393 92917274 92915489 92915436 93076416 93236778 93249893 93229675 93258904 93284203 93268799 93245506
890 93245506 93233749 93236664 93302582 93315102 93108391 92878914 92804626 92775154 92731766 92697571 92680267 92667076
902 92667076 92638252 92622353 92704201 92695114 92358276 91922615 91521957 91204498 91135262 91097687 90864227
913 90864227 90632774 90560387 90541962 90510750 90508507 90592216 90649155 90589760 90401337 90014008 89509460 88970039
925 88970039 88323784 87446617 86577103 85983421 85452415 84840080 84206940 83549759 82915710 82344078
935 82344078 81855179 81476830 81225677 81153152 81182739 81227539 81370163 81727219 82109497 82326057 82498642
946 82498642 82732628 82886055 82832024 82630630 82245590 81839111 81613228 81411865 81151985 80816315
956 80816315 80347610 79782654 79122498 78416893 77712753 77019501 76393196 75740723 74960732 74133804
966 74133804 73290726 72479248 71786522 71124863 70421432 69718719 69088936 68369888 67394302 66249588
976 66249588 64929726 63547443 62196587 60927486 59805153 58879112 58216404 57829166 57763054 57984352
986 57984352 58457638 59233379 60417080 61808159 63233067 64716103 66260170 67755867 69073746
995 69073746 70276711 71391914 72397018 73315262 74036697 74434875 74582169 74524643 74214508 73657417
1005 73657417 72738983 71204826 69480202 67714500 66480896 66591980 67478653 68980263 70683907
1014 70683907 72103546 73297737 74138519 74699257 75064018 75072479 74483231 73623634 72809792 71833801
1024 71833801 70560814 69087646 67459579 65696121 63754440 61866806 60348106 58907341 57299160
1033 57299160 55701302 54193092 52824425 51697063 50734592 49878075 49176693 48644138 48327900
1042 48327900 48350739 48500229 48545692 48664619 48976612 49424625 50021435 50676918 51346397 51906300
1052 51906300 52171921 52281998 52310608 52267002 52192043 52064659 51827026 51630188 51639652 51753853 51902843
1063 51902843 52157043 52536964 53122093 54040718 55166698 56403183 57790470 59358932 61041115
1072 61041115 62801243 64574669 66288376 67931511 69538162 70900131 71743919 72299194 72741409
1081 72741409 72959610 72782204 72566246 72607826 72918129 73730850 74674538 75443672 76073860 76483322
1091 76483322 76718430 76844360 76722862 76163887 75387886 74556519 73655792 72726799 71765923 70774147
1101 70774147 69778732 68755249 67859650 67238167 66895386 66930130 67205978 67661736 68170547 68583153
1111 68583153 68905350 69091583 69146370 69020485 68829468 68665024 68549057 68564034 68619705 68617439 68664886
1122 68664886 68883659 69132927 69290634 69422028 69570068 69679451 69663979 69659302 69772552 70002960 70388840
1133 70388840 70920059 71630547 72426369 73219421 74026131 74810600 75641586 76635864 77613449 78416656
1143 78416656 79095200 79623840 80069473 80489372 80886864 81304642 81681824 81966209 82174110 82311539
1153 82311539 82356979 82312302 82113312 81683708 81061699 80272171 79278442 78059624 76593018 74830338
1163 74830338 72827438 70612190 68219826 65720436 63036942 60074425 56956409 53765797 50529362
1172 50529362 47289894 44082214 40929699 37909340 35074402 32519173 30322147 28583670 27495718
1181 27495718 26861572 26556492 26556396 26836609 27274109 27712704 28227020 28902458 29550362 29947353 30282951
1192 30282951 30683445 31114792 31592537 32094025 32608391 33115696 33547806 34038353 34752155 35527325
1202 35527325 36248970 36940933 37596035 38192131 38678741 39133381 39631821 40128754 40599586 41057991
1212 41057991 41529251 41953922 42266319 42510178 42714836 42857742 42922878 42919849 42853619 42722084 42528057
1223 42528057 42261768 41919590 41485786 40918423 40292145 39649033 39044548 38589432 38159657 37631107
1233 37631107 37114525 36696243 36325218 35991955 35657860 35308098 34861660 34163116 33420731 32823967
1243 32823967 32273720 31685616 31204678 30983185 30914761 30884933 31070232 31656933 32501266 33482624
1253 33482624 34717487 36364792 38176582 39958382 41708519 43381954 44914291 46214890 47317459
1262 47317459 48234344 48938869 49397541 49642849 49670624 49557018 49345112 49129963 49046825 49018024 49007942
1273 49007942 49025513 49084736 49134827 49138878 49069286 48861622 48589371 48315311 48007107 47636295 47253918
1284 47253918 46950958 46579002 45989132 45273781 44468330 43594696 42626072 41743969 41139603 40756893
1294 40756893 40574600 40679169 41167332 41986702 43129063 44558311 46257019 48160912 50206875
1303 50206875 52373718 54704903 56943035 58767223 60411308 62015079 63539742 64981079 66374802
1312 66374802 67750786 69122269 70563911 71921135 73052475 73992920 74707603 75264313 75707603
1321 75707603 76071999 76428200 76712227 76844879 76942276 77102539 77300117 77559853 77828476 78018166
1331 78018166 78257202 78676201 79180214 79727463 80289032 80810043 81326675 81845947 82400391 83078003
1341 83078003 83719376 84158257 84502937 84805557 85068222 85316826 85531929 85718414 85829071 85812065
1351 85812065 85686020 85500908 85110474 84421852 83324814 81538559 79481796 77349022 75531815
1360 75531815 74459366 74213264 75226830 76874115 78776596 80625175 81917023 82854752 83421471
1369 83421471 83772469 84078690 84275963 84337906 84321808 84348389 84200928 83699463 82854172 81485458
1379 81485458 79982635 78616211 77562836 77170517 77195381 77561783 78112770 78696732 79221985 79540184
1389 79540184 79669785 79685425 79270218 77936462 76271202 74889709 73219513 70867180 67910675
1398 67910675 64078049 60025406 56424355 52956390 49337410 46135616 43826221 42403889 42168594
1407 42168594 42679428 43518185 44916771 47085144 49670769 52343369 55246017 58499813 61840248
1416 61840248 65112541 68108368 70464279 72490501 74440765 76121117 77364899 78343819 79172493
1425 79172493 79855347 80444145 80911186 81210449 81448509 81731483 82014725 82406593 82554054 81950714
1435 81950714 81164841 80647850 80243851 80019569 79758331 79190277 78541733 77986267 77412224 76811668
1445 76811668 76046944 74848701 73603889 72762131 71866104 70352699 68988777 68749641 68446564
1454 68446564 66842773 65057442 63823151 63062740 63045547 63464355 64188240 64957283 65362717 65720032
1464 65720032 66217186 66827820 67595078 68498230 69574646 70692947 71667603 72698357 73935989
1473 73935989 75341866 77018379 78693153 80058525 81322739 82703491 83864403 84417053 84735176
1482 84735176 85120010 85400414 85534500 85435532 85033485 84236359 82738945 81110786 79992508 78865387
1492 78865387 77533936 75668884 72669533 69154358 65562347 61830975 57996822 54201530 50528835
1501 50528835 47188831 44876003 42220688 37284874 32467915 29828667 28450298 28157497 28784513
1510 28784513 29991699 32125137 35451962 39869263 45655083 51933670 57825470 63619659 69585732
1519 69585732 74903175 78538445 81399963 84148071 86493347 88278984 89767143 91231659 92480682
1528 92480682 93326233 94030380 94903992 95612526 95745155 95841309 96425674 97131393 97867752 98330833
1538 98330833 97951744 97434448 97418259 97528053 97583076 97639343 97691132 97742676 97827003 97851967 97668457
1549 97668457 97480156 97530937 97550842 97249748 96931793 96884415 96867561 96722984 96492599 96050285 95741653
1560 95741653 96071152 96435883 96244621 95966812 95944283 95968414 96018127 95872643 95155357 94312645 93772675
1571 93772675 93213150 92620087 91496727 88909027 86154724 84412407 83105133 81953384 81243423
1580 81243423 81170036 81728104 83109093 84917900 86924767 88825058 90213898 91162018 91567802
1589 91567802 91543221 91192604 90437103 89160133 87579033 85902260 84039688 81997086 79695129
1598 79695129 77004074 74080826 70966385 67878464 64984871 62476040 60588955 59351494 58939407
1607 58939407 59146046 59863045 60971142 62346413 63894508 65566826 67102219 68020752 68930199
1616 68930199 70345734 72065094 74233627 76323387 77757523 78827904 79625343 80176163 80656120
1625 80656120 80707458 79888702 78626541 77137611 75610184 74251129 73221085 72819664 72836731 72966576
1635 72966576 73795555 76141785 79004265 81641098 84092857 86090874 87820862 89423897 90765144
1644 90765144 91710953 92398643 92838242 93277740 94111992 94910118 95339325 95500275 95245384 94986656
1654 94986656 95216682 95545868 95710686 95825485 95916817 95984436 96060303 96074059 95892502 95736000 95870926
1665 95870926 96026016 96007416 95849228 95434212 95022324 94917847 94870285 94760422 94498611 93790939
1675 93790939 93130875 93135880 93139816 92432808 91763138 92112091 92070702 89916611 87571167 86853600 86347794
1686 86347794 85059402 83542130 82019951 80487656 79127571 77601074 75673340 73215103 69513611
1695 69513611 66084358 65152740 63876175 58947754 53985832 52339958 51509571 49917458 48143005
1704 48143005 46079086 44207909 43159794 42383148 41470409 40619396 39935448 39288330 38532757 37819004
1714 37819004 37434269 36822174 35141991 33533955 33173252 33114052 32662819 32237816 32044147 32027531
1724 32027531 32169460 32567360 33379482 34404682 35260918 36649086 39595245 42741539 44633507
1733 44633507 46586704 49672935 53168655 56795406 60289455 63111732 65809486 68909645 71933937
1742 71933937 74474358 76846909 79317307 81628082 83560730 85263779 86815025 88207916 89425613
1751 89425613 90576530 91852234 92986176 93668434 94220688 94899277 95589973 96299980 96921089 97288277
1761 97288277 97579102 97933510 98298981 98679260 99045471 99353958 99652771 100020454 100321579 100382469
1771 100382469 100396255 100522163 100687836 100885963 101080368 101198555 101342133 101636551 101937744 102127007
1781 102127007 102253410 102321861 102346107 102309921 102307915 102464699 102674103 102885605 103056786 103101395 103100182
1792 103100182 103087189 103116058 103287247 103494049 103660988 103794624 103856682 103906181 104008339 104106209 104148911
1803 104148911 104183342 104227493 104317215 104537628 104758835 104865501 104898811 104827522 104753372 104793594 104870438
1814 104870438 104947662 105017830 105051567 105078270 105115364 105169388 105280045 105365250 105320885 105252525 105234383 105256416
1826 105256416 105361488 105464912 105478546 105455544 105402397 105370544 105467178 105531456 105362320 105187347 105221649
1837 105221649 105301331 105307457 105320190 105424286 105486656 105347733 105171585 105090759 105040047 104985283 104965546
1848 104965546 105044029 105114197 105057236 104972961 104928925 104902840 104907082 104905128 104851059 104785301 104740097 104694031
1860 104694031 104632118 104567337 104509354 104453018 104402016 104339287 104243782 104130913 104000450 103878021 103789162
1871 103789162 103733658 103719566 103747581 103860687 103939865 103825424 103682236 103658440 103644493 103561638 103465508
1882 103465508 103381203 103321434 103316116 103338478 103392365 103415512 103294418 103186630 103249405 103370049 103484962
1893 103484962 103603813 103729294 103818443 103794838 103761337 103814125 103896591 103978775 104076889 104208252 104339432
1904 104339432 104440140 104518105 104573486 104598381 104559540 104533127 104625298 104712677 104675148 104608772 104582832 104557541
1916 104557541 104498718 104458572 104513046 104556511 104472061 104369118 104325439 104318710 104362892 104426910 104488159 104535004
1928 104535004 104552605 104527786 104430176 104296425 104139709 103999802 103938271 103902939 103857330 103815697 103783104
1939 103783104 103750443 103701569 103662537 103653526 103675888 103758217 103838989 103852798 103839684 103826813 103787422 103666069
1951 103666069 103575806 103640388 103772163 103946495 104097725 104132011 104109047 104032852 103976349 104039238 104145096
1962 104145096 104262634 104356026 104358383 104331299 104296898 104306458 104456070 104633186 104741714 104828171 104917458
1973 104917458 104978157 104975891 104944160 104893730 104858398 104892113 104945114 104989532 105013611 104971336 104937576 104994705
1985 104994705 105073807 105131790 105173615 105184509 105180214 105172325 105158257 105139252 105115295 105084229 105053474 105029251
1997 105029251 105012848 105019615 105013466 104945442 104869392 104835678 104805565 104739639 104690002 104724625 104756310 104695465
2009 104695465 104616997 104579330 104542252 104469681 104407356 104401543 104414322 104422211 104428146 104435921 104419235 104333733 104237175
2022 104237175 104174088 104139664 104144524 104186607 104281281 104386543 104475853 104518173 104444595 104342102 104284668 104242348
2034 104242348 104208138 104186890 104188370 104190567 104167007 104140732 104131866 104122635 104100845 104069809 104008842 103977539 104072212
2047 104072212 104161926 104112602 104029778 103988098 103946182 103879478 103811981 103776764 103721764 103573845 103429077
2058 103429077 103373268 103363777 103411362 103441528 103345993 103236603 103219055 103203514 103110168 103014351 102976318 102961349
2070 102961349 102950218 102956345 102996323 103041336 103068901 103076462 103021667 103001114 103146317 103309990 103367851 103382347
2082 103382347 103354576 103344276 103446289 103556229 103577301 103581215 103611328 103655533 103726486 103793045 103807976 103832153
2094 103832153 103917313 104043320 104235931 104409050 104450562 104464050 104533936 104605606 104654739 104674675 104620506
2105 104620506 104582405 104676201 104779816 104781464 104765915 104789803 104825523 104872299 104906250 104883102 104863235 104920219
2117 104920219 104969955 104913116 104868843 104965782 105075813 105094910 105079269 105031898 105008026 105102943 105199341 105178024
2129 105178024 105139877 105162521 105196526 105221222 105227539 105176117 105136917 105176804 105265472 105420372 105564972 105599930
2141 105599930 105610802 105671860 105717491 105692200 105639648 105562523 105528236 105650711 105792931 105832268 105839394 105846260
2153 105846260 105846237 105846855 105837440 105790070 105763962 105848549 105925133 105862808 105787346 105782440 105843262 106048248 106231216
2166 106231216 106197334 106110573 106093048 106075195 106001305 105951859 106015083 106111816 106202126 106256271 106212494 106126694
2178 106126694 106014130 105934814 105991913 106070923 106071762 106054115 106040215 106042053 106100700 106150986 106114769 106071854
2190 106071854 106096313 106127121 106127480 106098648 106004974 105920341 105921265 105964134 106044220 106121323 106145645 106141235 106103493
2203 106103493 106068443 106071762 106109573 106219223 106312469 106276154 106222366 106246140 106285454 106308601 106319427 106314400
2215 106314400 106283783 106202339 106112862 106051208 106012917 106012177 106028625 106040550 106065987 106137917 106189682 106146332
2227 106146332 106065559 105962822 105889725 105930115 106002518 106049416 106082489 106078766 106084534 106165886 106240250 106234482
2239 106234482 106186226 106088707 106002022 106001160 106034592 106079460 106124519 106149841 106158516 106133911 106115028 106157089
2251 106157089 106194565 106158279 106114243 106111549 106131790 106194519 106234764 106163719 106072113 106046822 106010582 105874275
2263 105874275 105760384 105803726 105877945 105877113 105874634 105924515 105979034 106003448 106012726 106015686 105996010 105910728 105848694
2276 105848694 105926086 106017776 106016968 105984856 105956863 105903290 105766487 105665565 105754829 105870911 105889198 105847481
2288 105847481 105709389 105572632 105560661 105559776 105469917 105373337 105320381 105306503 105364159 105432533 105450752 105451416
2300 105451416 105462410 105436874 105296585 105163551 105158928 105206894 105287125 105354309 105337570 105293343 105247925 105220650
2312 105220650 105261139 105304527 105310150 105255127 105080986 104853561 104576920 104377724 104416916 104595543 104977585
2323 104977585 105235077 104862091 104456497 104594894 104834938 104862236 104869125 104946991 105083992 105394363 105591080
2334 105591080 105297539 104896637 104681633 104544685 104502724 104474548 104309532 104232574 104553818 104866722
2344 104866722 104741646 104557968 104612854 104723236 104817818 104858330 104739883 104590988 104536369 104482529 104370262
2355 104370262 104221436 104033043 103820419 103613403 103365349 102956963 102635979 102638268 102879883 103471779
2365 103471779 104064774 104281548 104317406 104205635 104054710 103969788 103994156 104291031 104605438 104679253 104684921
2376 104684921 104710648 104750870 104855637 104946259 104926590 104898788 104957726 105029129 105067680 105081268 105055618 105011917
2388 105011917 104953453 104919456 104984406 105045723 105003860 104923943 104827591 104745628 104736237 104738808 104690460 104655930
2400 104655930 104703400 104759666 104762146 104746986 104722641 104709244 104748940 104784103 104759644 104710152 104645988 104584671
2412 104584671 104554153 104533173 104511879 104483917 104436852 104378822 104297348 104241493 104283264 104341080 104350517 104331993
2424 104331993 104278374 104207848 104130981 104063347 104036476 104012802 103956604 103893852 103828957 103790688 103815529 103884651
2436 103884651 104009537 104135445 104195808 104237602 104298088 104339455 104313896 104288437 104336426 104390717 104399300 104389954
2448 104389954 104363396 104348587 104394867 104441811 104426315 104405594 104432419 104456734 104438873 104400131 104339722 104283997
2460 104283997 104272102 104264923 104233696 104186317 104116348 104038094 103964546 103892967 103814957 103760338 103768394 103802132
2472 103802132 103847359 103874680 103820328 103773117 103821159 103902771 104005005 104069473 104001572 103896645 103818512
2483 103818512 103766823 103786324 103805420 103725624 103672119 103810860 103920792 103748230 103556992 103576370 103656128
2494 103656128 103713539 103775284 103850601 103909042 103911186 103892899 103874947 103862907 103866241 103893997 103986717 104059052
2506 104059052 104014732 103926941 103816940 103743980 103810760 103908302 103953217 103971313 103957962 103921005 103869720 103794983
2518 103794983 103676987 103556755 103469231 103412773 103419968 103423019 103338028 103245667 103212830 103196693 103181648 103152611
2530 103152611 103074837 102991676 102931763 102904198 102941490 103001930 103060410 103099586 103079918 103042793 103012558 103000687
2542 103000687 103032806 103090523 103184219 103253197 103219795 103145096 103041885 102977440 103060295 103179459 103249527
2553 103249527 103302002 103341766 103362968 103343246 103336929 103416634 103504990 103539513 103547928 103528214 103506783 103516747
2565 103516747 103535774 103551361 103566742 103580856 103593872 103600021 103615860 103663063 103720215 103785873 103821732 103769806
2577 103769806 103687691 103608063 103547668 103547737 103567245 103581070 103582527 103538177 103503014 103532860 103591560 103684738 103742645
2590 103742645 103664658 103549026 103448578 103398750 103499054 103609970 103586555 103544426 103570435 103605911 103619598
2601 103619598 103616096 103569366 103539993 103598450 103689003 103792931 103869629 103839706 103800629 103850510 103907990 103913902
2613 103913902 103899742 103876587 103846359 103816055 103781319 103730247 103692368 103700706 103732590 103782913 103831650 103854462
2625 103854462 103858879 103843239 103810410 103754761 103699944 103670097 103657913 103670547 103688522 103688599 103689217 103699898 103724098
2638 103724098 103781555 103832886 103849815 103818512 103678680 103541092 103518845 103544304 103603455 103648544 103608368
2649 103608368 103539017 103469612 103409431 103379585 103373383 103403595 103432724 103411797 103388069 103402588 103424904 103449799
2661 103449799 103442551 103335312 103222084 103184486 103191826 103263474 103330612 103309753 103263947 103232124 103203110 103183868
2673 103183868 103158951 103112625 103052353 102981880 102896431 102785637 102669884 102558159 102473976 102456238 102467751
2684 102467751 102486633 102505661 102510689 102500443 102470490 102415802 102308586 102212524 102194092 102216866 102276299 102343079
2696 102343079 102388695 102406021 102365135 102305794 102269485 102220985 102118828 102023193 102004669 101990341 101901749 101825836
2708 101825836 101851395 101894234 101881363 101867722 101903893 101929947 101876900 101822540 101848152 101874092 101838829 101769325
2720 101769325 101653221 101546768 101506165 101518990 101617767 101723770 101758453 101753738 101699211 101643112 101629730
2731 101629730 101660202 101787094 101900192 101887848 101806786 101646210 101496719 101466080 101492020 101572968 101634529
2742 101634529 101577255 101474426 101346825 101252274 101292870 101356247 101343658 101316238 101317284 101301430 101214600 101126099
2754 101126099 101098160 101097961 101119019 101144478 101147911 101151657 101175095 101200607 101225426 101224258 101151535 101065155 101003387
2767 101003387 100979469 101044678 101123116 101155495 101143196 101029137 100929260 100976372 101062683 101128265 101162315 101116798
2779 101116798 101043106 100977371 100917221 100869514 100842575 100864098 100882553 100850128 100783302 100658249 100547859
2790 100547859 100534653 100565598 100637604 100683281 100609444 100490379 100363419 100246048 100176529 100129845 100107407
2801 100107407 100068115 99944138 99817017 99769524 99730087 99629333 99543091 99550720 99572281 99541138 99496552
2812 99496552 99458359 99417999 99376175 99324890 99245499 99170540 99145218 99112823 99008438 98901840 98863815 98826263
2824 98826263 98728470 98618767 98536346 98447945 98333618 98192360 98003052 97805931 97636841 97487549 97369621
2835 97369621 97259117 97136330 97000076 96843430 96663857 96454712 96221230 95978043 95689964 95284966
2845 95284966 94888115 94637321 94421745 94195869 93901611 93438843 92887878 92297432 91661926 91003326
2855 91003326 90287521 89488152 88603806 87623215 86549500 85344269 84120468 82985237 81917572
2864 81917572 80924416 80028870 79244705 78606651 78164841 77886581 77757027 77772568 77959152 78213211
2874 78213211 78439186 78638794 78757477 78868439 79045082 79231903 79398010 79542992 79657150 79737427
2884 79737427 79742622 79777214 79958221 80206535 80498650 80784653 80996086 81165169 81293037 81404427 81543159
2895 81543159 81653000 81690407 81661011 81536102 81375076 81232117 81093811 80972527 80844971 80696678
2905 80696678 80513451 80252647 79984856 79781174 79597115 79431847 79225471 78906677 78508781 78036240
2915 78036240 77504036 76920486 76309845 75690460 75088074 74544075 74029564 73538681 73043655 72472977
2925 72472977 71951767 71595123 71361542 71279167 71254089 71185829 71122070 71084000 71050385 70989731 70954041
2936 70954041 70997978 71081879 71194695 71305038 71383926 71412804 71353127 71235466 71077965 70879364 70647598
2947 70647598 70372894 70056030 69673035 69202873 68637207 67941406 67172981 66364647 65556099 64799736
2957 64799736 64089897 63423157 62845016 62389610 62087273 61996674 62066628 62244461 62592934 63182449
2967 63182449 63937233 64794037 65785744 66967842 68208954 69376205 70529411 71669746 72839996
2976 72839996 74112129 75399803 76630997 77834412 79023552 80171707 81259224 82278206 83193207
2985 83193207 84066940 84962059 85843018 86703300 87518356 88262054 88932297 89492630 90019630 90608810
2995 90608810 91166618 91617630 92002777 92318939 92622734 92976379 93359543 93799187 94215347 94511673
3005 94511673 94764137 95021011 95268845 95516731 95745255 95942047 96094963 96188065 96220062 96174263 96080826
3016 96080826 95954559 95824692 95763710 95656395 95404938 95029663 94489357 93870781 93263268 92617653
3026 92617653 91888428 91154007 90483734 89859177 89260170 88761116 88433548 88265800 88287262 88446114
3036 88446114 88709328 89049675 89441345 89847015 90223099 90562294 90844513 91064575 91191551 91282608
3046 91282608 91408371 91497421 91481850 91421631 91345551 91278862 91262772 91277908 91326836 91384888 91409897 91456917
3058 91456917 91576027 91739632 91955353 92167572 92307541 92422195 92526718 92647552 92849586 93032578
3068 93032578 93068268 93105362 93267868 93501350 93831589 94141769 94282387 94377327 94514801 94652267 94758514
3079 94758514 94887711 95117638 95346115 95497322 95569923 95498367 95399353 95396736 95403412 95366096 95307068 95240829
3091 95240829 95137383 94946625 94743011 94588234 94470215 94402222 94369957 94366882 94383026 94388580 94436310
3102 94436310 94600677 94786499 94912979 95011208 95082428 95135208 95187714 95212318 95161865 95113136 95147179
3113 95147179 95203781 95244286 95284775 95333862 95375038 95380310 95392700 95461777 95540024 95601868 95631073 95572495
3125 95572495 95516991 95560310 95632431 95707275 95748589 95682022 95595596 95567085 95552589 95533012 95511536 95488480
3137 95488480 95452927 95393562 95311882 95191666 95074677 95002106 94959282 94953247 94960114 94952988 94947906 94974327
3149 94974327 94965126 94826172 94667885 94598267 94530296 94382240 94246201 94217827 94204758 94143150 94042877
3160 94042877 93857574 93692017 93671944 93688034 93669746 93626213 93534637 93420097 93289635 93174484 93129349
3171 93129349 93090508 92999481 92895103 92797806 92704155 92625046 92537643 92407059 92280342 92213127 92144539
3182 92144539 92016510 91876175 91731689 91641785 91719887 91809914 91775940 91670898 91481163 91270210 91100624
3193 91100624 90961334 90874817 90803001 90722275 90611649 90422653 90214066 90016769 89865829 89833450 89839027
3204 89839027 89839844 89794090 89604332 89394691 89281532 89190506 89078880 88967964 88862778 88769440 88701538
3215 88701538 88641571 88586517 88506485 88357117 88178421 87983635 87808731 87720039 87639740 87496880 87337021
3226 87337021 87174347 87031914 86964203 86890915 86712334 86541008 86487724 86457916 86387108 86295609 86176849
3237 86176849 86046646 85919479 85792686 85666565 85546516 85446808 85341217 85199165 85047653 84902550
3247 84902550 84766624 84662506 84546303 84355141 84168266 84064819 83982231 83874298 83771065 83685753
3257 83685753 83622528 83615685 83587814 83443214 83270836 83139328 83013824 82887909 82744812 82545258 82350281
3268 82350281 82218025 82117653 82045174 81977867 81898712 81786469 81589294 81381866 81226372 81108093 81055405
3279 81055405 81001137 80868767 80714462 80561707 80431892 80375076 80328461 80241608 80127480 79969475 79805733
3290 79805733 79675652 79558441 79462120 79339622 79105568 78882576 78813171 78752014 78556274 78360603 78296783
3301 78296783 78230499 78028465 77819252 77714943 77631691 77507759 77388718 77312279 77239922 77142311 77029564
3312 77029564 76895210 76759384 76653481 76536942 76368690 76181671 75985909 75809074 75708961 75605270
3322 75605270 75394630 75203873 75162079 75158928 75134399 75066711 74878021 74676491 74568344 74481155 74372078
3333 74372078 74258331 74142479 74025368 73907471 73792198 73692276 73579956 73418785 73247459 73091957
3343 73091957 72953773 72860100 72759537 72585342 72410439 72294930 72210289 72162582 72108078 71995804 71853546
3354 71853546 71680664 71511368 71385429 71285393 71214607 71150276 71076012 70975899 70802567 70633766 70547554
3365 70547554 70495415 70461250 70425751 70375206 70276573 70056656 69822075 69675491 69555374 69429520 69312523
3376 69312523 69195847 69116760 69153336 69174667 69036819 68856667 68702843 68576141 68509651 68475082 68475433
3387 68475433 68449615 68305901 68139076 68024849 67928764 67846107 67763161 67659996 67550323 67435333 67332649
3398 67332649 67282249 67217972 67063431 66889046 66729546 66615364 66621353 66648796 66614220 66546608 66420105
3409 66420105 66315552 66347839 66388771 66315628 66226768 66202713 66174026 66075180 65974686 65943169 65908745 65806267
3421 65806267 65685890 65566925 65476418 65468834 65481232 65459129 65431335 65411499 65390488 65358017 65330956 65324333
3433 65324333 65333344 65367798 65398857 65391327 65373802 65354370 65359116 65451263 65527298 65475914 65383339 65275574
3445 65275574 65221619 65354134 65507889 65524628 65515991 65554619 65599205 65623405 65654633 65725235 65793991 65823318
3457 65823318 65834663 65836670 65830063 65805603 65801857 65873314 65962959 66022179 66080093 66172028 66230682 66165901 66081383
3470 66081383 66065430 66074013 66084602 66120697 66206573 66317413 66444611 66563728 66640945 66695763 66720604 66762589
3482 66762589 66893890 67031456 67105362 67148209 67142845 67168427 67327568 67532471 67747025 67918587 67942619
3493 67942619 67938469 67989944 68098808 68333435 68577621 68729660 68814156 68780396 68752312 68869926 69034126
3504 69034126 69175789 69344666 69598534 69844101 69972519 70087936 70273781 70483109 70711990 70914772
3514 70914772 71008591 71100830 71299812 71519897 71708153 71874710 71983459 72120193 72413513 72698662
3524 72698662 72789146 72878410 73135422 73446800 73737190 74061081 74493744 74897240 75123665 75278236
3534 75278236 75400208 75539207 75763062 76056244 76483559 76871635 77017929 77074722 77102997 77174019 77408600
3545 77408600 77719070 78082344 78425362 78639153 78808281 78961372 79157280 79502296 79882622 80218460
3555 80218460 80513885 80706810 80915573 81262848 81673500 82193085 82582047 82510353 82294937 82093117
3565 82093117 82053734 82501152 83066032 83441475 83764244 84091232 84355209 84428024 84549286 85021591
3575 85021591 85527489 85782646 85990074 86252090 86586311 87118507 87626198 87889122 88026070 88024948
3585 88024948 88057831 88353798 88729546 89079575 89399246 89616684 89828133 90141655 90449860 90651321
3595 90651321 90836189 91070320 91324875 91577271 91874695 92275192 92723679 93253235 93657372 93618156
3605 93618156 93503021 93632080 93829391 94025398 94220779 94366119 94542053 94864510 95178154 95337387
3615 95337387 95428513 95442490 95519638 95854118 96275208 96695663 97059036 97281479 97357819 97190308 96972679
3626 96972679 96852615 96870255 97216270 97586678 97660278 97679047 97795990 97956657 98163536 98398804 98646690
3637 98646690 98903610 99172401 99417923 99598122 99736450 99855995 99915840 99865654 99756554 99583054
3647 99583054 99464417 99543762 99744011 100079346 100418732 100604988 100730728 100822662 100921158 101091835 101285294
3658 101285294 101458000 101657509 101946930 102236053 102441002 102605728 102785873 102862381 102644775 102402878
3668 102402878 102359940 102464867 102845451 103188156 103091690 102947021 103072548 103284645 103493904 103736092
3678 103736092 104065727 104336861 104354813 104320190 104407623 104500244 104522659 104524925 104531479 104543541 104570053 104612228
3690 104612228 104690216 104756042 104751945 104727173 104697327 104705360 104840157 104979256 104998779 104991577 105010368 105051331
3702 105051331 105146263 105240967 105296684 105298637 105187584 105058029 104980827 104967522 105080917 105237839 105387283
3713 105387283 105495407 105496689 105434921 105290672 105187630 105292603 105456421 105579880 105679726 105748940 105759552
3724 105759552 105631805 105514000 105593704 105673386 105554176 105427460 105483864 105526665 105331276 105171631 105339905
3735 105339905 105556442 105578255 105587196 105764389 105868820 105629875 105317116 105088615 105008003 105321381 105639412
3746 105639412 105544731 105367348 105329201 105337051 105367043 105432556 105558586 105686142 105760002 105793739 105773758
3757 105773758 105726173 105653191 105612564 105708313 105803612 105769012 105686142 105593231 105490852 105367752 105297661
3768 105297661 105388000 105526184 105635574 105715469 105717087 105707787 105770401 105809738 105720924 105615761 105580925 105586533
3780 105586533 105645798 105716034 105772087 105774399 105609749 105473732 105566216 105760933 106043839 106278137 106276535
3791 106276535 106176285 106057831 105903984 105693886 105518768 105516174 105526184 105377220 105241753 105274490 105357002
3802 105357002 105422302 105470802 105454994 105451561 105550095 105664299 105722473 105770302 105851074 105899933 105811073 105750397
3814 105750397 105940941 106105354 105984024 105746506 105399750 105171677 105424736 105762268 105855370 105863121
3824 105863121 105821419 105770615 105783203 105798340 105765488 105726028 105723190 105700562 105602501 105469849 105304695 105167458
3836 105167458 105127457 105159973 105289986 105437592 105502365 105570580 105710960 105875328 106100128 106199959 105881096
3847 105881096 105504822 105415298 105370140 105184319 105029678 105043457 105144310 105328323 105500153 105534889 105517242
3858 105517242 105480408 105453941 105518051 105553963 105425812 105264977 105169701 105103424 105058693 105046059 105077744
3869 105077744 105141022 105250427 105336121 105288651 105241226 105341049 105436707 105384972 105308319 105283020 105304428 105452538
3881 105452538 105549667 105352234 105137970 105170799 105248352 105231903 105194283 105146027 105135033 105254814 105379105
3892 105379105 105371330 105355835 105449059 105537842 105556465 105478836 105197906 104890610 104699852 104620651 104733826
3903 104733826 104924774 105119514 105276657 105306313 105279778 105219559 105181816 105282089 105364799 105259682 105126068
3914 105126068 105060913 105081032 105300430 105524300 105578186 105515144 105267838 105022812 104968384 105031967 105251053
3925 105251053 105483696 105588509 105601288 105465385 105316780 105305008 105332474 105367111 105361725 105224442 105056931
3936 105056931 104941132 104844193 104744743 104689934 104736069 104833916 104982445 105093239 105037285 104934929 104862953
3947 104862953 104823112 104851677 104921577 105030533 105140396 105210541 105246117 105232979 105188202 105109955 105040810
3958 105040810 105054764 105055740 104932114 104804420 104772064 104786537 104862686 104909729 104778625 104658676 104732254
3969 104732254 104870842 105039047 105139778 104994896 104811981 104765747 104776619 104860641 104905296 104758667 104554726
3980 104554726 104339577 104224564 104399803 104674820 104964470 105142685 104962372 104701164 104592537 104521652
3990 104521652 104438164 104381706 104363945 104418274 104648949 104855110 104818726 104695557 104544975 104437950
4000 104437950
##END=$$ End of the data block
