##TITLE=1600 - Material Oriundo de Luminaria $$ Begin of the data block
##JCAMP-DX=5.00 $$ ACD/SpecManager v 10.08
##SPECTROMETER/DATA SYSTEM=Alpha
##DATE=17 Jun 2014 07:33:28
##DATA TYPE=INFRARED SPECTRUM
##DATA CLASS=XYDATA
##ORIGIN=
##OWNER=
##NPOINTS=1765
##FIRSTX=399.75695801
##LASTX=3997.56933594
##MAXX=3997.56933594
##MINX=399.75695801
##MAXY=0.83477271
##MINY=0.57421970
##XFACTOR=1.0000000000
##YFACTOR=1.000000000000000e-9
##FIRSTY=0.70962960
##DELTAX=2.03957629
##XUNITS=1/CM
##YUNITS=ARBITRARY UNITS
##XYDATA=(X++(Y..Y))
399.8G09629595J482487N297422J563967j27316N719423O485582J803756L385782P539332
418.1G42780030M125654K322615O720245M804551p41124J895368N208135P81715l89994
436.5G67507195M790485L518105j431525J566231M536808j94669j096964M017234K636969
454.8G85849869k346098O30259L613949r59039j992166K739966J603306k753258M16219
473.2G86803007L362417j322627k586126K062499J205326k917707q6546K836585j222790
491.5G88134038k627193J948297J625061k608657m04299L214360k62499k091110K139092
509.9G89067090K205610k025545o38008K901316M3213k195656J382232K059638j636505
528.3G91163385n49078K759933K09451k465725R20236K222419j613140j471102K155304
$$ y = [709629595, 711112082, 716409504, 717973471, 717846155, 723565578, 730051160, 731854916, 735240698, 742780030, 746905684, 749228299, 755948544, 760753095, 760011971, 761907339, 767115474, 767897189, 767507195, 772297680, 775815785, 774384260, 775950491, 780487299, 780292630, 779195666, 783212900, 785849869, 783503771, 784134030, 787747979, 786788940, 784796774, 787536740, 789140046, 786386788, 786803007, 790165424, 788842797, 786256671, 788319170, 789524496, 786606789, 786520243, 789356828, 788134038, 785506845, 787455142, 789080203, 786471546, 786067247, 789281607, 789019108, 786927998, 789067090, 791272700, 789247155, 788609147, 791510463, 791553676, 789358020, 790740252, 792799890, 791163385, 790614307, 793374240, 793583691, 791117966, 792038202, 794260621, 792647481, 791176379, 793331683]
546.6G93331683M72247k526760K77221K092243j407385j928509J604975O59644k538502
565G90036857l23593K152502q36551k083779J241684J230061j818656k86699K355635
583.3G91667461j29163j788974J310349J886308j291990o14226K283156N63383j708925
601.7G92177379P62522K046228r49502j309633J583933P12634j945735J49072K620101
620G95846999L13282p14124K109707J966119r71377M1604K440154M66705j321197J146257
640.4H01324129J932562j148642j580953O93559o62565l745198l761470m238546o463111
658.8G82349765m059136J756788J966536l004968j387060M303694J457691j669765
675.1G81713545k18391J67072k235651j764357R21130M34279j020968N62609J290261
$$ y = [793331683, 793803930, 791277170, 791554391, 793646634, 792239249, 790310740, 791915715, 792575359, 790036857, 789713264, 791865766, 791029215, 788945436, 790187120, 791417181, 789598525, 789311826, 791667461, 791538298, 789749324, 791059673, 792945981, 791653991, 791039765, 793322921, 793886304, 792177379, 792939901, 794986129, 794036627, 792726994, 794310927, 795023561, 793077826, 793226898, 795846999, 796160281, 795446157, 797555864, 799521983, 798550606, 798592210, 801032364, 801499069, 800177872, 801324129, 803256691, 802108049, 800527096, 801220655, 800558090, 796812892, 793051422, 788812876, 782349765, 778290629, 780047417, 782013953, 779008985, 777621925, 781925619, 783383310, 781713545, 781495154, 781662226, 779426575, 777662218, 778583348, 779017627, 777996659, 778559268, 779849529]
693.5G79849529j313388k092540O3777j50085k085328j315474j148582n499721n372762
711.8G60935426N999565J4629483J0670602N193770M048825J726150p92742K16484
728.1H02627563J062513j004279j592815M10259K24888j707553q97885N97537j066149
746.5G98654079k609551j201331q86619k954960k979994j331687k318203m187286l264249
764.8G76920199k569317m698813n822719m841625n973518q877754r510696r494305
781.2G25131452j2149513j4745891j4771521j5179932j6643882j5768230j2882590
795.4F22989893j1007428q928657m243791Q64089L966272O604075R442508R864092
811.7F29551053P959425P057250P419586P369817Q621692J2469709J5314639J4749884
$$ y = [779849529, 778536141, 776443601, 776507378, 776357293, 774271965, 772956491, 771807909, 766308188, 760935426, 766934991, 781564474, 792235076, 797428846, 801477671, 803203821, 802411079, 802627563, 803690076, 802685797, 801092982, 801503241, 801728129, 800020576, 799122691, 799720228, 798654079, 796044528, 794843197, 793956578, 791001618, 788021624, 786689937, 784371734, 780184448, 776920199, 774350882, 769652069, 763829350, 758987725, 753014207, 744136453, 734625757, 725131452, 712981939, 698236048, 683464527, 668284595, 651640713, 635872483, 622989893, 611982465, 603053808, 598810017, 599674106, 603640378, 610244453, 619686961, 629551053, 637510478, 644567728, 651987314, 659357131, 667978823, 680448532, 695763171, 710513055]
828.1G10513055J3578117J3134182J0974884P832765O883502O690562M540563K497196
844.4G76644826K578199K768874J495719K81155l43621k248764m166782l468215k520800
862.7G71020591m160225p426441j3135314k0407736j9625604o139636R987175J8119931
879.1G28232741J8778265J7224371J4171541R552836O716371O262660N023956L223241
895.4H09185982L396153L975630K731442J876832K820253K806961J310945J217604
911.7H29321802K088964J245260L7968P38561J248896n5313n75602M56453K65717r44316
932.1H33828390n15938M25637m48049j326978n42760m29689j801253j988292j080930
950.4H26120138j741946k976000k478063j945555l056288l625631k728164k827645
$$ y = [710513055, 724091172, 737225354, 748200238, 756033003, 762916505, 769607067, 774147630, 776644826, 779223025, 781991899, 783487618, 783768773, 783425152, 781176388, 777009606, 773541391, 771020591, 766860366, 759433925, 746298611, 725890875, 706265271, 700125635, 710112810, 728232741, 747011006, 764235377, 778406918, 787959754, 794676125, 800938785, 805962741, 809185982, 812582135, 816557765, 819289207, 821166039, 823986292, 826793253, 828104198, 829321802, 831410766, 832656026, 832693994, 833432555, 834681451, 834626138, 834050536, 834506989, 834772706, 833828390, 833312452, 833738089, 833290040, 831963062, 831420302, 830990613, 829189360, 827201068, 826120138, 824378192, 821402192, 818924129, 816978574, 813922286, 810296655, 807568491, 804740846]
966.8H04740846m037797l917873l188670m022837n047500m622817m588842n906463
983.1G69408047o406307n803585o260634p357478p257342p044554q170962r161651
999.4G11945534r127200r768069j1301875j1828065j1343181j1138320j0392964p896840
1015.7F29149020m919589k872884j006305J034081J959145J777708K075732K780855
1032F29977763K657830K311290K745151K956510K236068J882315K262354K009749J186788
1050.4F50225818J076222J191914M53889k35021m9114j45078j031995j470208j352668
1068.7F48663759j916647k855956l005863k955019l566742l952682l595412l559470
1085F23255968l977060l639519k682865k195239j689911k71678J257539K154708L316223
$$ y = [804740846, 800703049, 796785176, 793596506, 789573669, 784526169, 779903352, 775314510, 769408047, 763001740, 757198155, 750937521, 743580043, 736322701, 729278147, 721107185, 711945534, 702818334, 693050265, 681748390, 669920325, 658577144, 647438824, 637045860, 629149020, 624229431, 621356547, 620350242, 621384323, 623343468, 625121176, 627196908, 629977763, 632635593, 634946883, 637692034, 640648544, 642884612, 644766927, 647029281, 649039030, 650225818, 651302040, 652493954, 652947843, 652712822, 652663708, 652518630, 651486635, 650016427, 648663759, 646747112, 643891156, 640885293, 637930274, 634363532, 630410850, 626815438, 623255968, 619278908, 615639389, 612956524, 610761285, 609071374, 608799696, 610057235, 612211943, 615528166]
1103.4F15528166N076587O273330O704151P484436Q450449Q515358Q221686Q515298
1119.7F74769461Q505106P519663O790757O812572O422699N555808N342961N383610
1136G27102637M608035L891290M115700M070878L266275L094554L562510L229976K509952
1154.4G59451807K698004K979278K355636J986742K493500K499998J794398J846134
1170.7G78105497K457142K253115J877547K410769K733231K068281J777589K221406
1187G95904577J977503J235724J419127J878976J388431R90689J552939J692057R90510
1205.4H09030533R57191J487613J115739M01258O32823Q44478O6340m04119j7166k56479
1225.8H13858211j189828j333773j137972j947045k893925l035963l758132n749404
$$ y = [615528166, 620604753, 626878083, 633582234, 641066670, 649517119, 658032477, 666254163, 674769461, 683274567, 690794230, 697584987, 704397559, 710820258, 716376066, 721719027, 727102637, 731710672, 735601962, 739717662, 743788540, 747054815, 750149369, 753711879, 756941855, 759451807, 762149811, 765129089, 767484725, 769471467, 771964967, 774464965, 776259363, 778105497, 780562639, 782815754, 784693301, 787104070, 789837301, 791905582, 793683171, 795904577, 797882080, 799117804, 800536931, 802415907, 803804338, 804795027, 806347966, 808040023, 809030533, 809987724, 811475337, 812591076, 812992334, 813625157, 814469635, 814535975, 814131856, 814114690, 813858211, 812668383, 811334610, 810196638, 808249593, 805355668, 802319705, 798561573, 792812169]
1242.1G92812169p634163r318888j2310267j6717434k1689951k6852846l0330897k8465152
1258.4F39492571j9175827l743470J3704062K7422905L2356798K8412581K1054089
1272.7G39523709J5359998J1606335Q458853O455362N744874M797757L507197L157318
1289G98611403L231942K453745J682937J908362J953840J211166R94385J448512J170933
1307.4H14667225M90069O61850R94087M62353J71900Q57770J052320M12762L32713
1325.7H20103049N58496k42830j237690j211464j183331j895547j848936q35419q21948
1344.1H11384380j561165j529098j198470j679957k143264j831710j874268k861083
1360.4G96705365l339231k689361k755166l477931l246009l102243l778994l602505
$$ y = [792812169, 785178006, 775859118, 763548851, 746831417, 725141466, 698288620, 667957723, 639492571, 620316744, 616573274, 630277336, 657700241, 690057039, 718469620, 739523709, 754883707, 766490042, 774948895, 781404257, 787149131, 791946888, 795454085, 798611403, 801843345, 804297090, 805980027, 807888389, 809842229, 811053395, 812047780, 813496292, 814667225, 815157294, 815819144, 816813231, 817275584, 817447484, 818305254, 819357574, 819770336, 820103049, 820661545, 820418715, 819181025, 817969561, 816786230, 814890683, 813041747, 812206328, 811384380, 809823215, 808294117, 807095647, 805415690, 803272426, 801440716, 799566448, 796705365, 793366134, 790676773, 787921607, 784443676, 781197667, 778095424, 774316430, 770713925]
1376.7G70713925l101468l733098m605830m387677l954529m122496m309535m948020
1393G37551272n750239n475163m455388l294766l566742n218923n518556n004644m992962
1411.4F94273889m372060l139735k984702l460884k379477j721025k244353k831757
1427.7F71139896l158748k693355k397418l380478l518104k490640k794206l194034
1444F47512913l161669l437340l072024k094865j865148l259659l072202j01388L06666
1462.4F27755284p91073k58088J177013J302660J614988L781914N489052N601823N414307
1480.7F51087880N550683N141794M211724L961086M696429M544676L431618K961457
1497F85587347L265857L132522K412737J404524J767814L968954M519522L885090K782822
$$ y = [770713925, 767612457, 763879359, 759273529, 754885852, 750931323, 746808827, 742499292, 737551272, 731801033, 726325870, 721870482, 718575716, 715008974, 709790051, 704271495, 699266851, 694273889, 689901829, 686762094, 683777392, 680316508, 677937031, 676216006, 673971653, 671139896, 667981148, 665287793, 662890375, 659509897, 655991793, 653501153, 650706947, 647512913, 644351244, 640913904, 637841880, 635747015, 633881867, 630622208, 627550006, 627448618, 627755284, 626964211, 626706123, 627883136, 629185796, 630800784, 634582698, 640071750, 645673573, 651087880, 656638563, 661780357, 665992081, 669953167, 674649596, 679194272, 682625890, 685587347, 688853204, 691985726, 694398463, 695802987, 697570801, 701539755, 706059277, 709944367, 712727189]
1515.4G12727189K199471K231002K137661K443313K728522K879322K671063J703679
1531.7G31721222J482010K310098J432597m28736Q31604K597153K425969J966536J687586
1550.1G46026039J302004P52687K24352r40382N7518K412141K129078J051843r5308
1568.4G52919972j16348R07123M8339j304626J6749Q48949M2080m38928l94583p30336
1588.8G51798391j278698j336694j266301j619577j978278j989663k057314k418637
1605.1G37853229k616107k509416k479612k712369l476620l510654j662791j107633
1621.4G17778027j496792j160502j136780p82728L35395M48704K81393K011002L123045
1639.8G19400764K755045K175510K167523L270090L421187K413571L348470M508257
$$ y = [712727189, 714926660, 717157662, 719295323, 721738636, 724467158, 727346480, 730017543, 731721222, 733203232, 735513330, 736945927, 736517191, 737348795, 739945948, 742371917, 744338453, 746026039, 747328043, 748080730, 748305082, 747364700, 747422218, 749834359, 751963437, 753015280, 752919972, 752803624, 753710747, 753759086, 752454460, 752471209, 753320158, 753362238, 752923310, 752528727, 751798391, 750519693, 749182999, 747916698, 746297121, 744318843, 742329180, 740271866, 737853229, 735237122, 732727706, 730248094, 727535725, 724059105, 720548451, 718885660, 717778027, 716281235, 715120733, 713983953, 713201225, 713536620, 713985324, 714266717, 716277719, 719400764, 722155809, 724331319, 726498842, 729768932, 733190119, 735603690, 738952160, 743460417]
1656.1G43460417L725707L045440K775967K680481K306461J676083J653611J840830
1672.4G63164997J608729J833559J831471J069665J76967L54051J649380J775145J551152
1690.8G75015116J056671j26720l00705K16365M47273J188219J213252J007498R00864
1709.2G80617833O50108L70800l06069o08445R00388J734674R76861M60565N52773
1727.5G85349488M22240j75775m76419Q89718J399040O64532Q31247J291275R62198
1745.9G91157544N64575P95662J363516J317918R04084Q83340O16074K69592Q45790
1764.2G98718095R55283J96934l08394j0431Q27372R40502N39481L93808K09034k08736
1784.6H02252948m07099j023472k640128k953947q31723L23713M53472J502931K647937
$$ y = [743460417, 747186124, 750231564, 753007531, 755688012, 757994473, 759670556, 761324167, 763164997, 764773726, 766607285, 768438756, 769508421, 769685388, 770039439, 771688819, 773463964, 775015116, 776071787, 775945067, 775644362, 775860727, 776308000, 777496219, 778709471, 779716969, 780617833, 781267941, 781638741, 781332672, 780724227, 781624615, 783359289, 784336150, 784796715, 785349488, 785771728, 785595953, 785119534, 786009252, 787408292, 788072824, 788904071, 790195346, 791157544, 791722119, 792517781, 793881297, 795199215, 796103299, 796986639, 797602713, 797872305, 798718095, 799673378, 799870312, 799561918, 799551487, 800378859, 801319361, 801858842, 802252650, 802461684, 802252948, 801845849, 800822377, 798182249, 795228302, 794396579, 794720292, 795173764, 796676695, 799324632]
1803G99324632K312481J375914R61482Q50082O81162O09159O62565N15759J84536O2466
1823.4H07540238K23637J58786p9691M82023Q89539L47495J54913N02825J71482n42104
1843.8H09849143J8656P99239M64737J46389L40462L36170m17K2471K93791R5308m20093
1866.2H11945856m05908K95162N62787L03209K42949J31905j63734l9459K90752R5427
1886.6H13258946l12984l7074L09884k1755o7652L46482K59638j60575j04606R7454
1907H13567758j45436k53737J30475J40309m05073l39091J60456O4909j02281J21534
1927.4H12939823K08199j41740l53515r8169n3942m46737n38170n9665J30415q2969
1947.8H11503530N5313K29537o4254k09272J04368J72734p9989j6272K16007J32620
$$ y = [799324632, 801637113, 803013027, 803974509, 804824591, 805505753, 806114912, 806777477, 807293236, 807477772, 807540238, 807763875, 807922661, 807842970, 808324993, 809214532, 809562027, 809716940, 810219765, 810391247, 809849143, 809867799, 810667038, 811131775, 811278164, 811618626, 811954796, 811954379, 811976850, 812270641, 812365949, 811945856, 811539948, 811835110, 812397897, 812701106, 812944055, 813075960, 812912226, 812872767, 813163519, 813258946, 812945962, 812908888, 813218772, 813197017, 813129365, 813475847, 813735485, 813574910, 813470304, 813567758, 813422322, 813168585, 813299060, 813439369, 813034296, 812695205, 812855661, 812920570, 812818289, 812939823, 813148022, 813006282, 812652767, 812554598, 812500656, 812053919, 811515749, 811456084, 811586499, 811503530, 811558843, 811788380, 811724126, 811514854, 811619222, 811791956, 811711967, 811695695, 811911702, 812044322]
1968.2H12044322L1829K73347L97325Q2850o2465J91986J64807j45078m6551K14577
1988.6H13146949l7253k54035J18434K56002r4235j09613K35975J85788j18792P212
2009H13336432K29359L636j91212P4267K22981n0485q0645J91689P3671k06888k801
2031.4H13600004K15172p1167k49863o318N066k71439j74940J28388k324k16425K6048
2053.8H12982202J92701q2373j29819J99437J57654j47044J3888K83300N8473j37926
2074.2H13390493J47581K76030k4558n0902K47896J78993q7917Q0347L18944J06573
2094.6H14583480n3525J83702K19107o4135l874K83241J38462j08779R6142K40028
2115H15513849m2915j14143J94788J87993j16467l6300K21610O2526j29223J12951
$$ y = [812044322, 812076151, 812349498, 812746823, 812829673, 812767208, 812959194, 813124001, 812978923, 812932372, 813146949, 813109696, 812855661, 812974095, 813230097, 813135862, 813026249, 813262224, 813448012, 813329220, 813336432, 813565791, 813569427, 813378215, 813452482, 813675463, 813624978, 813544333, 813736022, 813809693, 813602805, 813600004, 813815176, 813744009, 813494146, 813487828, 813492894, 813221455, 813046515, 813174903, 813172579, 812956154, 812982202, 813174903, 813092530, 812962711, 813162148, 813319802, 813172758, 813186646, 813469946, 813528419, 813390493, 813538074, 813814104, 813789546, 813738644, 813986540, 814165533, 814077616, 814157963, 814476907, 814583480, 814529955, 814713657, 814932764, 814868629, 814864755, 815147996, 815286458, 815177679, 815273821, 815513849, 815470934, 815356791, 815551579, 815739572, 815623105, 815586805, 815808415, 815870941, 815741718, 815854669]
2135.4H15854669K52246q583m2080K37703J91867n6565P8500L02195J29402k6822J77383
2157.9H17089915K29657k5153N245K58386J49191n9128J24514K68042O974j04845J59860
2180.3H18102658J90317n4895M768K08199N8234j23322P3373K12789J788n8592J47283
2202.7H18762600J02342j14203j7345J77086M1723j00434R2864J58906r0241q3745
2223.1H18929553J65343Q8156j14263L7313J89245l1650j64569N0366J04547r8408
2243.5H19155633p0393J17600J4127j85073p1347O3539q2254j43409K7597J3828j68920
2265.9H18670928r3638R3877K8551o6340O8604J59085L1591j9312L4928j31428l88503
2288.4H18388343l74317k75731m08471n26428m35293m53830o91890q83639r91047j188755
$$ y = [815854669, 816106915, 816098332, 816056252, 816293955, 816485822, 816429257, 816507757, 816809952, 816939354, 816912532, 817089915, 817319572, 817294419, 817299664, 817558050, 817707241, 817648113, 817772627, 818040669, 818047643, 817942798, 818102658, 818292975, 818238080, 818242848, 818451047, 818509281, 818385959, 818459332, 818672121, 818673909, 818615317, 818762600, 818864942, 818750739, 818733394, 818910480, 818952203, 818851769, 818944633, 819103539, 819013298, 818929553, 819094896, 819183052, 819068789, 819106102, 819295347, 819263697, 819099128, 819149494, 819254041, 819155633, 819085240, 819202840, 819216967, 819031894, 818960547, 819024086, 818941832, 818798423, 818826020, 818839848, 818670928, 818577290, 818671167, 818699718, 818633378, 818701982, 818861067, 818892658, 818873346, 818908274, 818776846, 818388343, 818014026, 817738295, 817329824, 816803396, 816368103, 815914273, 815222383, 814338744, 813347697, 812158942]
2308.8H12158942j301408j053154q61645j278817j858116j878440j500428j230061
2325.1H01196873j212358j240194r92417n92053m80235o38008p47681m24683O82175
2343.5G95551419K554298L170132R06885k540290m640699m352450k843738j175761
2359.8G86629796J91927J286566K239228K912759L256321L481627L535270L362597
2376.1H06896091L204166L039956K531827J713395J003444N58973K21252M828K265
2394.4H19176197K8968n6982q1420K1636N4181n424l099K4020m5478j03653k7716K4677
2418.9H19005907l8743o1870j3113j9491m9889j0013K2530k0862n2869k7001j4961
2441.3H18719625n5551o9082j4901j848m5478m4048l8266j03593j33932o3717k8372
$$ y = [812158942, 810857534, 809804380, 808942735, 807663918, 805805802, 803927362, 802426934, 801196873, 799984515, 798744321, 797751904, 797159851, 796679616, 796041608, 795293927, 794869244, 795551419, 798105717, 801275849, 802182734, 799642444, 795001745, 790649295, 787805557, 786629796, 786821723, 788108289, 790347517, 793260276, 796516597, 799998224, 803533494, 806896091, 810100257, 813140213, 815672040, 817385435, 818388879, 818947852, 819169104, 819173932, 819176197, 819205165, 819148183, 819066763, 819088399, 819142580, 819137156, 819134057, 819158077, 819112599, 819008946, 818981230, 819005907, 818967164, 818905294, 818892181, 818872690, 818822801, 818812788, 818835318, 818814456, 818761587, 818734586, 818719625, 818664074, 818594992, 818580091, 818578243, 818532765, 818488717, 818450451, 818346858, 818212926, 818149209, 818120837]
2463.8H18120837p2717r4176j06036j71483k21074j90258j61469j97470k44617k89440
2484.2H16372097l51072m18246m94957n94198p33376q73923r43124r27687q61704p45833
2504.6H09427977n89788m69506l59655j86383j3769O5327R8884J89721L22640M09305
2525H08894753M52698N13315N52952N07176M51863M43459L73125K14815R4592N7519
2545.4H12556267M4226L3915O0022R5129N9486l159k146Q345k8551l3796K3723L6537
2569.8H12849998j2338l3557l5048n1617n8115k2590J5616l457m4047m5002l3677m6849
2594.3H12479317k3484L4153K2352j5080K9445R4354R9957J03116J36256J29879N9426
2616.8H13149691J4722L7849O5505Q1957R5129P2717J4842L874M2796J5975n5373m2021
$$ y = [818120837, 818048120, 817953944, 817847908, 817676425, 817455351, 817265093, 817103624, 816906154, 816661537, 816372097, 816021025, 815602779, 815107822, 814513624, 813780248, 812906325, 811963201, 811035514, 810173810, 809427977, 808838189, 808368683, 808009028, 807822645, 807808876, 807874203, 807973087, 808162808, 808485448, 808894753, 809347451, 809860766, 810413718, 810920894, 811372757, 811816216, 812189341, 812404156, 812498748, 812556267, 812600493, 812634408, 812694430, 812789559, 812849045, 812845886, 812843740, 812852085, 812823534, 812789738, 812813461, 812849998, 812837660, 812804103, 812769055, 812717438, 812659323, 812636733, 812652349, 812648892, 812604845, 812559843, 812526166, 812479317, 812455833, 812489986, 812512338, 812497258, 812526703, 812621057, 812721014, 812824130, 812960386, 813090265, 813149691, 813164413, 813202262, 813267767, 813349724, 813444853, 813517570, 813532412, 813536286, 813579082, 813595057, 813539684, 813497663]
2641.2H13497663J3053m3511j35839j11878q2374j28508j12772k1636o199p6413p6294
2663.7H12715292k7955n0485j3828J14679J21475J6331k1219j2338o2406r9361l0875
2686.1H12649310K3663n1380j14977n3704q762l9875k9683l040n2273r7931n2452k0861
2710.6H12148035o9321n2690L1173J6213m9055l0696J132q8692j84536j10864m4644
2733H11566055r5546r6202n9426q4400q4579L7729J02997n4836k05934j69754r8765
2755.4H10757339r7096o3539k1934j02222j84596j28984q2493j10209q8453j07527
2775.8H09770286k61009l54409k99036k68996k87116k05338j19805k11120l27587k44975
2796.2H07190895j40607k25127k55466j04904l2484j12951j87874j90556j59442j38164
$$ y = [813497663, 813510716, 813467205, 813331366, 813219488, 813137114, 813008606, 812895834, 812874198, 812867999, 812791586, 812715292, 812687337, 812636852, 812623024, 812737703, 812859178, 812875509, 812854290, 812841952, 812779546, 812680185, 812649310, 812672973, 812621593, 812506616, 812452912, 812444150, 812404275, 812374592, 812371552, 812319279, 812221348, 812168896, 812148035, 812078714, 812026024, 812057197, 812073410, 812024355, 811993659, 811994791, 811906099, 811721563, 811610699, 811566055, 811470509, 811374307, 811314881, 811230481, 811145902, 811183631, 811286628, 811231792, 811025858, 810856104, 810757339, 810660243, 810596704, 810574770, 810472548, 810287952, 810158968, 810076475, 809966266, 809877813, 809770286, 809509277, 809154868, 808855832, 808586836, 808299720, 808094382, 807974577, 807763457, 807435870, 807190895, 807050288, 806825161, 806569695, 806464791, 806432307, 806319356, 806131482, 805940926, 805781484, 805643320]
2816.6H05643320q4102m7863j47223k52366k37346k56240l64244m02510m07398n63800
2837H02880228q99315j318515j791894k364993k716184k246141r85503K28106P90000
2855.4G91575789Q16465N97060L58283K16007Q0526j30713k54214j97231k03252k54631
2875.8G92604089o4910J66059J00493r5367k32458m24385o78778q59439j004696j288593
2896.2G88222015j645565j810908j739443j514077j111269p02441o33895q67188r83298
2914.5G77213931p28905k12610L36051P56323R19819Q54135P55250O49691M68075K97904
2934.9G81309664J74105m3273m20212r18508j599431k574682l766179n059481o592810
2953.3G60509193q281112r448707r259701p203042l476560R96053M958451P391870
$$ y = [805643320, 805559218, 805511355, 805364132, 805111766, 804874420, 804618180, 804253936, 803851426, 803444028, 802880228, 801980913, 800662398, 798870504, 796505511, 793789327, 791543186, 790557683, 790785789, 791575789, 792392254, 792989314, 793347597, 793563604, 793644130, 793513417, 793259203, 793061972, 792858720, 792604089, 792539179, 792705238, 792805731, 792710364, 792477906, 792053521, 791374743, 790515304, 789510608, 788222015, 786576450, 784765542, 783026099, 781512022, 780400753, 779698312, 779064417, 778197229, 777213931, 776485026, 776272416, 776608467, 777364790, 778284609, 779138744, 779893994, 780543685, 781011760, 781309664, 781483769, 781440496, 781020284, 780101776, 778502345, 775927663, 772161484, 767102003, 760509193, 752228081, 742779374, 733519673, 726316631, 722840071, 723836124, 728794575, 736186445]
2969.6G36186445Q163213P809103O817222N625069M579603L678859K895891K341032
2985.9G78096437K023638J845658J611232J282692J088321R30131O50406M70757M19855
3004.3G88419127L73781L88384M60565M28081K15113K0265K325K8908l934l4570k8372
3026.7G90269673N662K6465M4346k6405j88589j25885N2809m4405l10481m17769l01122
3049.1G88984299k07663k53916k63810k35855k42591j86861r1076m3392j12951k69294
3069.5G87076890l11970j95265m530R0182p8917k73049k68519k43485k38895k35617
3089.9G85316825l38912m26412l40998j67191j42395k91288l23713j46568o8486k70784
3110.3G82800078l29136n3645N2214j60634m44532o40988o15299m09663k03430k08199
$$ y = [736186445, 744349658, 752158761, 758975983, 764601052, 769180655, 772859514, 775755405, 778096437, 780120075, 781965733, 783576965, 784859657, 785947978, 786878109, 787528515, 787999272, 788419127, 788792908, 789181292, 789641857, 790069938, 790285051, 790305316, 790307641, 790336549, 790332615, 790298045, 790269673, 790275335, 790301800, 790346146, 790319741, 790131152, 790005267, 790058076, 790013671, 789703190, 789285421, 788984299, 788776636, 788522720, 788258910, 788023055, 787780464, 787593603, 787502527, 787459135, 787346184, 787076890, 786764920, 786569655, 786565125, 786655307, 786576390, 786303341, 786034822, 785791337, 785552442, 785316825, 784977913, 784551501, 784210503, 784043312, 783900917, 783609629, 783285916, 783139348, 783070862, 782800078, 782470942, 782417297, 782469511, 782308877, 781864345, 781223357, 780608058, 780198395, 779994965, 779786766]
3130.7G79786766l90351Tj81437j78456m70281o25193n16593m20869l30150k37584
3151.1G76045501m35710p77721p99239o30915o01530o43194o32286o40213p18832p56502
3171.5G69409359o96779o59108p17878p78199q13901q75950q87275q17895q18789r02116
3191.9G61441469r33945r52184j017630j038373r64701q86977r05454r85265r85562
3210.3G52771378r31740r54211j000404j014471j039684j057267j042784j056850j076638
3228.6G43597329r60887q46147j035095j282036j228869j099288j058042r51350q70228
3247G34265387r98378j089334r41217p98106q62480r42230q66115q01742p62582n94616
3267.4G25608587m55379o48260r74596j042545r80615r55165r24349r16361r66788
$$ y = [779786766, 779396415, 779006064, 778824627, 778646171, 778175890, 777550697, 777034104, 776613235, 776283085, 776045501, 775609791, 774832070, 774032831, 773401916, 772800386, 772157192, 771524906, 770884693, 770165861, 769409359, 768712580, 768053472, 767335594, 766557395, 765743494, 764867544, 763980269, 763162374, 762343585, 761441469, 760507524, 759555340, 758537710, 757499337, 756534636, 755647659, 754742205, 753756940, 752771378, 751839638, 750885427, 749885023, 748870552, 747830868, 746773601, 745730817, 744673967, 743597329, 742636442, 741790295, 740755200, 739473164, 738244295, 737145007, 736086965, 735135615, 734265387, 733267009, 732177675, 731236458, 730438352, 729575872, 728633642, 727767527, 726965785, 726203203, 725608587, 725153208, 724504948, 723530352, 722487807, 721507192, 720552027, 719627678, 718711317, 717744529]
3285.7G17744529r87589q79467q28802j003802j250744j416802j422644j239657j040996
3304.1G07674026j169145j636982j992821k026260j937509j918792j927495j897812
3320.4F93167210j880229j942575k162397k377212k412975k396464k346396k266765
3336.7F75382197k403915k678752k809644k883315k844512k638281k741396l159285
3353F53223097l306329l145873l041506l147066l202021k963066k812743l083825l455341
3371.4F25065327l452897l117681k830505k677679k618254k547383k299786j941084
3387.7F03580058j647056j728653k113224k127289j630843j319885j668275k105534
3404E89239299j927793j500785j348734j380146j465678j459419j247228j076340r77576
$$ y = [717744529, 716756940, 715877473, 715048671, 714044869, 712794125, 711377323, 709954679, 708715022, 707674026, 706504881, 704867899, 702875078, 700848818, 698911309, 696992517, 695065022, 693167210, 691286981, 689344406, 687182009, 684804797, 682391822, 679995358, 677648962, 675382197, 672978282, 670299530, 667489886, 664606571, 661762059, 659123778, 656382382, 653223097, 649916768, 646770895, 643729389, 640582323, 637380302, 634417236, 631604493, 628520668, 625065327, 621612430, 618494749, 615664244, 612986565, 610368311, 607820928, 605521142, 603580058, 601933002, 600204349, 598091125, 595963836, 594332993, 593013108, 591344833, 589239299, 587311506, 585810721, 584461987, 583081841, 581616163, 580156744, 578909516, 577833176, 576855600]
3422.4E76855600p68304n48542m03344l37362k03372K8492J3589k18927j98126J29044
3442.8E74348748M19140N34594N84662O93261Q62837J014590J139999J242518J184643
3461.1E82024992J175522J477242J661181J331806Q88110R10937J255811J532733J502872
3479.5E93761206J225710J219093J478494J504123J410186J459479J490236J555323
3495.8F05103850J667619J652300J552105J447142J411676J472771J657307J927317
3512.1F17892087J930654J687407J642227J804114J909852J784324J593232J675547
3528.4F31919444J965880K165198K218068K108037J954914K078950K214432K009809
3544.7F48634732J783132J905620K051771K058983K166092K300740K343952K282501
$$ y = [576855600, 576087296, 575538754, 575135410, 574798048, 574594676, 574623168, 574636757, 574417830, 574219704, 574348748, 574767888, 575302482, 575887144, 576580405, 577443242, 578457832, 579597831, 580840349, 582024992, 583200514, 584677756, 586338937, 587670743, 588558853, 589469790, 590725601, 592258334, 593761206, 594986916, 596206009, 597684503, 599188626, 600598812, 602058291, 603548527, 605103850, 606771469, 608423769, 609975874, 611423016, 612834692, 614307463, 615964770, 617892087, 619822741, 621510148, 623152375, 624956489, 626866341, 628650665, 630243897, 631919444, 633885324, 636050522, 638268590, 640376627, 642331541, 644410491, 646624923, 648634732, 650417864, 652323484, 654375255, 656434238, 658600330, 660901070, 663245022, 665527523]
3561.1F65527523K042889J666069J839817K753675L114700K755582K527714K631784
3577.4F84859753K842784K991080K832949K295852K106964K877832L278553K911687
3593.7G06997454K762199K963543L049612L129661L112256K660811K371967K631724
3610G29679227K784431K741456K525270K096593K301157K863407K637744J536131N80489
3628.4G49745905J686395K880871K540707K030015J763165J567543J472950J173675
3644.7G64861226K60234l49402J028060K292216J630128R65953J376509J309693P77006
3663G74151623O30617J67489p30574l44097J71303n91218K50995J678765J651525J305581
3683.4G78342009P94231k21550q03828K53618J264929J100004M59373k14457m65930
$$ y = [665527523, 667570412, 669236481, 671076298, 673829973, 676944673, 679700255, 682227969, 684859753, 687702537, 690693617, 693526566, 695822418, 697929382, 700807214, 704085767, 706997454, 709759653, 712723196, 715772808, 718902469, 722014725, 724675536, 727047503, 729679227, 732463658, 735205114, 737730384, 739826977, 742128134, 744991541, 747629285, 749165416, 749745905, 751432300, 754313171, 756853878, 758883893, 760647058, 762214601, 763687551, 764861226, 765121460, 764772058, 765800118, 768092334, 769722462, 770688415, 772064924, 773374617, 774151623, 774782240, 774949729, 774219155, 773875058, 774046361, 773455143, 773706138, 775384903, 777036428, 778342009, 779136240, 778914690, 778110862, 778364480, 779629409, 780729413, 781188786, 780974329, 780508399]
3701.8G80508399K60711P81417J71959p07269l87191J024961J292050M56989k13385
3720.1G83188641l67641j75894K89381Q16941N60701m53889r39191j6391J256406J153112
3740.5G85312176o84381k034485m31597m351j189709o7711J343071P34628k33472j0073
3760.9G82734096M06921L7312k87532l47853j7226N80788N23805p3194m42088j32203
3781.3G82982826J47999J20878K53558K84016J52230p9274l98278l59476o43730r14752
3801.7G81545997J85012L81768K0266P78317Q67605k77519j096189n57303n88715m97341
3822.1G80761898P18474P72595L15726Q5890j50144j88350o96838j100064k10285O23465
3842.5G80932367Q98361R84192N69403p71463k751112j551151J605809J786768N06520
$$ y = [780508399, 780769110, 781550527, 781722486, 781015217, 780628026, 781652987, 782945037, 783402026, 783188641, 782821000, 782645106, 782934487, 783751428, 784312129, 783858240, 782919049, 782902658, 784159064, 785312176, 784627795, 782593310, 782161713, 782157362, 780967653, 780899942, 782243013, 782977641, 782744169, 782734096, 783141017, 783178329, 782890797, 782542944, 782525718, 783106506, 783630311, 783557117, 783115029, 782982826, 783130825, 783251703, 783505261, 783789277, 783941507, 783862233, 783463955, 783104479, 782460749, 781545997, 781731009, 782112777, 782133043, 782911360, 783778965, 783501446, 782405257, 781847954, 781259239, 780761898, 781480372, 782252967, 782568693, 782654583, 782504439, 782316089, 781619251, 780519187, 780308902, 780932367, 781830728, 782814920, 783384323, 782612860, 779861748, 778310597, 779916406, 781703174, 782209694]
3860.9G82209694n77032n69463l8385m13299n19216K89381P19726N56230k52366m61876
3881.3G80943394N4300j24634R0301K30849l68595L159O23643L5525q28922r43780
3901.7G79715240m30942M52042R62317O37829J76728o5625l87370m77553q2254Q7798
3922.1G80588210j32800n5015J40369j17778k63572J37865L69132J32263k20001l66330
3942.5G80212343r7454Q0168o7949m5240P5102P7128O3181J0252p6949l6240P9453
3964.9G80273795K8372j01864r6739n9008m3989M1783O1512m947j9729m3273j13904
3987.3G79922009j44482q3268j1206l6835p0989
3997.5G79575229
$$ y = [782209694, 781632662, 781063199, 781024814, 780611515, 780092299, 780381680, 781101406, 781657636, 781405270, 780943394, 780997694, 780873060, 780963361, 781194210, 780825615, 780828774, 781452417, 781487942, 780659020, 779715240, 779284298, 779736340, 780698657, 781336486, 781513214, 781447589, 781060219, 780582666, 780500412, 780588210, 780455410, 780400395, 780540764, 780422986, 780159414, 780297279, 780666411, 780798674, 780578673, 780212343, 780114889, 780195057, 780127108, 780081868, 780156970, 780234098, 780297279, 780307531, 780230582, 780194342, 780273795, 780302167, 780200303, 780103564, 780044556, 780000567, 780042350, 780103862, 780098915, 780079186, 780035913, 779922009, 779777527, 779694259, 779683053, 779646218, 779575229]
##END=$$ End of the data block
