##TITLE=$$ Begin of the data block
##JCAMP-DX=5.00 $$ ACD/SpecManager v 10.08
##SPECTROMETER/DATA SYSTEM=16PC
##DATE=Mon Sep 02 17:30:53 2013
##DATA TYPE=INFRARED SPECTRUM
##DATA CLASS=XYDATA
##ORIGIN=
##OWNER=
##NPOINTS=3601
##FIRSTX=400.00000000
##LASTX=4000.00000000
##MAXX=4000.00000000
##MINX=400.00000000
##MAXY=38.21692657
##MINY=12.62109470
##XFACTOR=1.0000000000
##YFACTOR=0.000000100000000
##FIRSTY=18.54111862
##DELTAX=1.00000000
##XUNITS=1/CM
##YUNITS=TRANSMITTANCE
##XYDATA=(X++(Y..Y))
400A85411186M9204598L9289818K5408058J1970806K573166j385079r02748J563416
408C13133221L554344L757839K319069L23372j087608j395646q51764j40915J13868
417C19725780l22628j280136k383022l270760l707256l575840k851276j622639j45187
426C00567036J162700J844426J618766N59693q90179k112045k613087k269802j370583
435B96496925m35466P5283M57m64115r01527r15775l46470O47888J666260K252922
445B98076382K107792J226310q7318j341515k064151k007256j255836j81504P41406
454B95214310J173114J071282O91013M16832N18685R75074J467877J561985R68857
463C04059029k54631j689263k736053k905064k059173m87900J225891K476444K905006
$$ plain form
400 185411186 234615784 273905602 299313660 311284466 313857632 312472553 311569805 313133221
408 313133221 316687565 320445404 322764473 323087845 322000237 320604591 319752827 319611912 319725780
417 319725780 319403152 318123016 315739994 312469234 308761978 305186138 302334862 300712223 300567036
426 300567036 301729736 303574162 305192928 305752621 304862442 302750397 300137310 297867508 296496925
435 296496925 296061459 296136742 296137199 295673084 294771557 293855782 293509312 294157200 295823460 298076382
445 298076382 300184174 301410484 301323166 299981651 297917500 295910244 294654408 294472904 295214310
454 295214310 296387424 297458706 298149719 298566551 299085236 300060310 301528187 303090172 304059029
463 304059029 303804398 302115135 299379082 296474018 294414845 293926945 295152836 297629280 300534286
472C00534286K540303J746578J014786P09629Q99391J352463J692753J625061J103096
481C13218346L49311k83641n25227l48663J7624K34317O7177m61769j078625j421966
491C09766884j265659o66256N9356N12543M42314j10264q38222j346626j375542r39675
501C04238853l08246J55258J96152j98345q07152j306191j446933j180478o68830j85948
511B98488140L0842j00651m78916q85544j106872j042748p48081l89996j50013j29070
521B93487091l04947n64384p81327q95328r38358r98879j147213j373348j578426j626759
531B83278122j429005j002960m78249l8089J66130Q1405k31113o35471r88160j197757
541B77524853j250458j199818j130886j121387j210900j385727j580886j696492j628131
$$ plain form
472 300534286 303074589 304821167 305835953 306545582 307444973 308797436 310490189 312115250 313218346
481 313218346 313567657 313284016 312758789 312410126 312427750 312662067 312729244 312267475 311188850 309766884
491 309766884 308501225 307834969 307894325 308406868 308849182 308738918 307900696 306554070 305178528 304238853
501 304238853 303930607 304085865 304282017 304083672 303276520 301970329 300523396 299342918 298674088 298488140
511 298488140 298518982 298418331 297939415 297053871 295946999 294904251 294156170 293766174 293616161 293487091
521 293487091 293182144 292617760 291836433 290941105 290002747 289003868 287856655 286483307 284904881 283278122
531 283278122 281849117 280846157 280367908 280329819 280495949 280577354 280346241 279710770 278722610 277524853
541 277524853 276274395 275074577 273943691 272822304 271611404 270225677 268644791 266948299 265320168
550B65320168j303654p14703P1507R27753J703987K269059K539138K483940K115136
559B75412331J475620O38809k80723j124821j712723j893959j612911r52435j25389
568B69823799N94082R75475R24931N22537j7738m47712n97134m45633j20373J76411
578B71388645K73953J20639j90467m71039n35946l03078J56117O44550R30347Q60615
588B72874336M36726j85185p71045j122170j166725r80663p30706n74760n75123o74991
598B66529694p46746o79627m53033j52188Q3142J42364J2341k10324l69339l30085
608B63826199n0030L98121Q62179J180591J257515J104069Q30898N95989N28355O63700
618B71197586R19628J127644J112537P83558J94645m66156r56821j096325q55027l68137
$$ plain form
550 265320168 264016514 263301811 263373318 264301071 266005058 268274117 270813255 273297195 275412331
559 275412331 276887951 277526760 277246037 276121216 274408493 272514534 270901623 269949188 269823799
568 269823799 270417881 271393356 272318287 272840824 272823086 272375374 271778240 271332607 271212234 271388645
578 271388645 271662598 271783237 271592770 271121731 270585785 270282707 270438824 271083374 272013721 272874336
588 272874336 273311062 273125877 272354832 271232662 270065937 269085274 268354568 267779808 267204685 266529694
598 266529694 265782948 265103321 264650288 264498100 264581242 264723606 264735947 264525623 264156284 263826199
608 263826199 263776169 264174290 265036469 266217060 267474575 268578644 269409542 270005531 270533886 271197586
618 271197586 272117214 273244858 274357395 275140953 275335598 274869442 273912621 272816296 271961269 271593132
628B71593132J38588M71230N68618N24407N16491O87503J048565J463948J727276J682109
638B80421867J318684P89776L40156J87779M18033R41239J530704J917897J906185
647B89772320J455097P04708p4081n89543o58569l00865K56653O82392P11860L03708
657B92263680l13817p50637o76937l8337Q66127J510906J423931M69952j030503k429065
667B91295300l068371k620106j255016M49485J811238K382259K141419J446476P92942
676B93375626N32589P09877J095028J366462J319809R76944N44815K68154K75059N09205
686C00973568P77073Q69732O82945K68574k02656n34992o06899m23775j09482J54304
696C01848392K08359j7853m77352j024933j474266j674137j571426j233177q14038
$$ plain form
628 271593132 271731720 272202950 272771568 273295975 273812466 274499969 275548534 277012482 278739758 280421867
638 280421867 281740551 282530327 282870483 283058262 283476295 284417534 285948238 287866135 289772320
647 289772320 291227417 291932125 291858044 291268501 290609932 290309067 290565720 291248112 291959972 292263680
657 292263680 291949863 291199226 290522289 290483952 291350079 292860985 294284916 294754868 293724365 291295300
667 291295300 288226929 285606823 284351807 284801292 286612530 288994789 291136208 292582684 293375626
676 293375626 293908215 294618092 295713120 297079582 298399391 299376335 299921150 300189304 300464363 300973568
686 300973568 301750641 302620373 303303318 303571892 303369236 302834244 302227345 301803570 301694088 301848392
696 301848392 302056751 302038898 301561546 300536613 299062347 297388210 295816784 294583607 293769569
705B93769569m81414l30773l37925l74984k87610P039M56733Q85277J081142R16768
715B95303822M33158j63059n94654o54945l18203K42615P44857R43318P57255L07732
725B97001896j54266l87288k88238N8937M38786O27765N15614J57699k65007n50861
735B97155037n84602l90282j05915J00021J18485m8523l00293m98543n40943m10671
745B94493771j77460M2000J43985Q5373j00860l26309m94137n45426m85420l76472
755B92259045l02067l20130m30641n75256o69937o52714n21793l38765j96952j68095
765B88082695k60258m10385n18646n04246l54290j34411M4461Q7432k8133k30999l82767
776B85390453l38440j2436N80273J330223K077217K675114L045959L200799L220882
$$ plain form
705 293769569 293288155 292957382 292619457 292244473 291956863 291963902 292420635 293305912 294387054 295303822
715 295303822 295736980 295573921 294979267 294324322 294006119 294248734 294993591 295936909 296694164 297001896
725 297001896 296847630 296460342 296172104 296231041 296669827 297297592 297813206 297970905 297705898 297155037
735 297155037 296570435 296180153 296074238 296174259 296292744 296244221 295943928 295445385 294904442 294493771
745 294493771 294316311 294358311 294502296 294587669 294486809 294160500 293666363 293120937 292635517 292259045
755 292259045 291956978 291636848 291206207 290630951 289961014 289308300 288786507 288447742 288250790 288082695
765 288082695 287822437 287412052 286893406 286389160 286034870 285900459 285944920 286032352 286004219 285773220 285390453
776 285390453 285052013 285039577 285619850 286950073 289027290 291702404 294748363 297949162 301170044
785C01170044L209724L239251L313808L372459L323384L099937K705803K226524J798478
794C27459412J546020J518440J661492J840019J905518J773490J468087J109352Q47092
803C41128922P78808Q97560J100159J250801J261024J137543R69086Q61931Q64868
812C50250702R33151R55200Q28133N33295J65138j07498j29624J54877O65550J218224
822C55467148J607513J696854J469116J023026N18150J07040j20887j60103p6714K7809
832C61558952N9777k8839k20376m37774n77164n59044l73268r5596J40877K11830O9351
843C59748726k22664n15747o54068n62630k95334j1787J07689l6926m07257q44231
853C56305771j153259j209374j022644p28950n12848n08080p28836j071091j376228
$$ plain form
785 301170044 304379768 307619019 310932827 314305286 317628670 320728607 323434410 325660934 327459412
794 327459412 329005432 330523872 332185364 334025383 335930901 337704391 339172478 340281830 341128922
803 341128922 341907730 342805290 343905449 345156250 346417274 347554817 348523903 349385834 350250702
812 350250702 351183853 352139053 352967186 353500481 353665619 353558121 353428497 353583374 354248924 355467148
822 355467148 357074661 358771515 360240631 361263657 361781807 361888847 361767960 361607857 361531143 361558952
832 361558952 361618729 361589890 361369514 360931740 360354576 359795532 359422264 359326668 359467545 359679375 359748726
843 359748726 359526062 359010315 358356247 357793617 357498283 357486496 357594185 357557259 357150002 356305771
853 356305771 355152512 353943138 352920494 352191544 351678696 351170616 350441780 349370689 347994461
862C47994461j522560j493034j386071j365318j575356k063484k745056l422928l854980
871C28565674l838539l281441k232723q66547N75066J854686K800980L337975L476448
880C30391579L278274K817650K160339J367951N17654k85034r20830j298866j407433
889C36621284j339569j266594j362037j704636k213363k653962k727928k208710j062469
898C20082016N09071K128983L386993L997536L901825L268051K394791J570282R56344
907C42195892N53398K52343o2180m18968p31506q45032o33660q8806O50826J347084
917C42219391J766014J783333J438560R10340M26445J54075J27373K44026L31803K45132
927C49646492n7869m97131r17130j171036j196098j041984q40149p31163p92885j003800
$$ plain form
862 347994461 346471901 344978867 343592796 342227478 340652122 338588638 335843582 332420654 328565674
871 328565674 324727135 321445694 319212971 318346424 318921490 320776176 323577156 326915131 330391579
880 330391579 333669853 336487503 338647842 340015793 340533447 340248413 339327583 338028717 336621284
889 336621284 335281715 334015121 332653084 330948448 328735085 326081123 323353195 321144485 320082016
898 320082016 320591087 322720070 326107063 330104599 334006424 337274475 339669266 341239548 342195892
907 342195892 342749290 343001633 342939453 342520485 341788979 340943947 340310287 340221481 340872307 342219391
917 342219391 343985405 345768738 347207298 348117638 348544083 348698158 348825531 349069557 349401360 349646492
927 349646492 349588623 349091492 348174362 347003326 345807228 344765244 343925095 343193932 342401047 341397247
937C41397247j260147j434974j445427j294938j067848q82988q31184r28269j108322
946C31143150j259727j284294j150971r14383o91337o03256p14493r96743j340141
955C22187805j604652j688767j580600j363469j173610j130829j277580j558876j852704
964C08956718k033863k037754j889782j687660j547565j545792j686249j906089k115441
973B92506523k244854k275886k243748k214470k250996k385597k607250k862740l070068
982B70350914l136806k983246k565422j894188j042500j32866O91128J302719J622982
991B62212715J632729J364250Q79898K52399m43744j130772j724586k141819k319641
1000B58581429k241059j949425j541862j137714q39272p00798p22923q73432j118908
$$ plain form
937 341397247 340137100 338702126 337256699 335961761 334893913 334010925 333179741 332251472 331143150
946 331143150 329883423 328599129 327448158 326533775 325842438 325239182 324524689 323527946 322187805
955 322187805 320583153 318894386 317313786 315950317 314776707 313645878 312368298 310809422 308956718
964 308956718 306922855 304885101 302995319 301307659 299760094 298214302 296528053 294621964 292506523
973 292506523 290261669 287985783 285742035 283527565 281276569 278890972 276283722 273420982 270350914
982 270350914 267214108 264230862 261665440 259771252 258728752 258595886 259287014 260589733 262212715
991 262212715 263845444 265209694 266089592 266341991 265898247 264767475 263042889 260901070 258581429
1000 258581429 256340370 254390945 252849083 251711369 250872097 250171299 249448376 248574944 247456036
1009B47456036j447564j866760k376365k933522l433456l725147l662739l172627k306728
1018B22531128j250324k75498L48473M51298K5882p69157j669502k403908k788525
1027B14199867k778721k460041j987667j508026j098099p48939l92857M4480N98697
1036B03868694J246796J918526K528286L004284L303604L408832L316918L030243K559719
1045B28185902J934223J207981M56028k44560q36296j295929j629143j849537j952705
1054B23975964j904927j656837j180229n08728K40917Q86917J238232J167259O67610
1063B22926178j32694j010628j725311k097664k060471j659469j013260k58522M91638
1072B13459797J157684J680832K004624K074699J861992J395683P82051J86386k21252
$$ plain form
1009 247456036 246008472 244141712 241765347 238831825 235398369 231673222 228010483 224837856 222531128
1018 222531128 221280804 221005306 221353779 221805077 221830959 221061802 219392300 216988392 214199867
1027 214199867 211421146 208961105 206973438 205465412 204367313 203618374 203225517 203269997 203868694
1036 203868694 205115490 207034016 209562302 212566586 215870190 219279022 222595940 225626183 228185902
1045 228185902 230120125 231328106 231784134 231539574 230703278 229407349 227778206 225928669 223975964
1054 223975964 222071037 220414200 219233971 218725243 218966160 219853077 221091309 222258568 222926178
1063 222926178 222793484 221782856 220057545 217959881 215899410 214239941 213226681 212968159 213459797
1072 213459797 214617481 216298313 218302937 220377636 222239628 223635311 224417362 224603748 224382496
1081B24382496l35236j64966J62677M53511N28221K99168j92662p95440j308060j555348
1091B21474361j445255r87415k74506N59006J379204K081680K602387K914543L019695
1100B31323700K937183K693825K314892J818123J214027N15652k46182j009502j681004
1109B39880714k154369k342606k211647j796531j191406n15576J29624O89830J161747
1118B31649780J569023J929055K227382K416230K437896K258072J892185J408348R06544
1127B48694515M83818K01664O9866N0297P7000Q2741K0523j22357l24211n35183o91452
1138B48007221p30228o04725k94018J91612Q11520J499405K171402K736969L112450
1147B56901608L239936L103104K738476K231006J692582J226825Q94337O91376N55210
$$ plain form
1081 224382496 224047260 223882294 224044971 224498482 225026703 225325871 225133209 224337769 223029709 221474361
1091 221474361 220029106 219041691 218767185 219326191 220705395 222787075 225389462 228304005 231323700
1100 231323700 234260883 236954708 239269600 241087723 242301750 242817402 242571220 241561718 239880714
1109 239880714 237726345 235383739 233172092 231375561 230184155 229668579 229798203 230488033 231649780
1118 231649780 233218803 235147858 237375240 239791470 242229366 244487438 246379623 247787971 248694515
1127 248694515 249178333 249379997 249449863 249500160 249577160 249659901 249680424 249558067 249233856 248698673 248007221
1138 248007221 247276993 246672268 246378250 246569862 247381382 248880787 251052189 253789158 256901608
1147 256901608 260141544 263244648 265983124 268214130 269906712 271133537 272027874 272719250 273274460
1156B73274460L94001J29204k66915p57217j251145j638088j825809j767559j470261
1165B64820671r84249l80764K69031R07860J494885K002296K408104K695198K854138
1174B76087170K891369K833995K727585K623844K560273K543392K543182K505283K377816
1183B99693909K139587J815891J469708J172638R68017Q46253P46898N87712L06644
1192C09747257j03187n84946j039066j362610j488629j406173j153736p92962l78398
1201C01437550O0749N17482R88045J448307J843147K096615K141304J952801J571961
1210C14057961J099815O65111L76130K78549L40404M72584N75028N87654N18722M37222
1220C19409180M32548N61791Q14171J110382J338768J409378J297378J054726P81441
$$ plain form
1156 273274460 273668461 273797665 273530750 272773533 271522388 269884300 268058491 266290932 264820671
1165 264820671 263836422 263455658 263724689 264632549 266127434 268129730 270537834 273233032 276087170
1174 276087170 278978539 281812534 284540119 287163963 289724236 292267628 294810810 297316093 299693909
1183 299693909 301833496 303649387 305119095 306291733 307259750 308106003 308852901 309440613 309747257
1192 309747257 309644070 309059124 308020058 306657448 305168819 303762646 302608910 301815948 301437550
1201 301437550 301498299 302015781 303003826 304452133 306295280 308391895 310533199 312486000 314057961
1210 314057961 315157776 315822887 316199017 316477566 316817970 317290554 317865582 318453236 318971958 319409180
1220 319409180 319841728 320403519 321217690 322328072 323666840 325076218 326373596 327428322 328209763
1229C28209763N75828M85535M89006N11551M69894L18527P3738j95350m03977m96254
1239C30038261m72450l86963l17917l26347m25682n76401p08923p59888p05643n75904
1249C24782143m42200l86276m64478o81114r83467j279717j472110j491719j322632
1258C16258430j002616o03505j98745J64833M78821P60517J027717J272927J456775
1267C19615154J524945J441307J217079R17625O38886M64477M26483M90570N76745
1276C27313271O03332N32341L89366K48871J91231K55470M12483N71480O21452M81987
1286C31621284J43433l24707p99637j153755j305122j244469j031342p60650n17884
1295C24627151l45191k33345j42060l5019R0523J97945K31971J54305k6207k49367
$$ plain form
1229 328209763 328785591 329271126 329760132 330271683 330741577 331060104 331133842 330938492 330534515 330038261
1239 330038261 329565811 329178848 328860931 328534584 328108902 327532501 326823578 326063690 325358047 324782143
1249 324782143 324339943 323953667 323489189 322808075 321824608 320544891 319072781 317581062 316258430
1258 316258430 315255814 314652309 314453564 314618397 315097218 315857735 316885452 318158379 319615154
1267 319615154 321140099 322581406 323798485 324716110 325354996 325819473 326245956 326736526 327313271
1276 327313271 327916603 328448944 328838310 329087181 329278412 329533882 329946365 330517845 331139297 331621284
1286 331621284 331764717 331440010 330640373 329486618 328181496 326937027 325905685 325145035 324627151
1295 324627151 324281960 324048615 323906555 323871536 323962059 324160004 324391975 324546280 324520073 324270706
1305C24270706m28200m91294m20647k63367j10855n5389j45493l65295o45485r01299
1315C20443382j075000j159955j194114j226406j278267j322460j295758j138820q42743
1324C09909859m71802j46408R384o9885l55492p34749j067695j256161j290569j245003
1334C03281479j224938j295833j436463j540985j473083j138916n41210K14138R61399
1343B95805588J542625J864186J918373J763439J481094J135731P55615L40519j11923
1352C06495247n82333j017971j343975j489162j417599j149731p62062l64570o0673
1361B98307171R2392J05514M9935K1362R0923K68078M92630O61373O77090M94976J45397
1372C01406841k77347o52809q79860r10626p61432n01557k25258k0485O0234J7548
$$ plain form
1305 324270706 323842506 323351212 322930565 322667198 322556343 322500954 322355461 321990166 321344681 320443382
1315 320443382 319368382 318208427 317014313 315787907 314509640 313187180 311891422 310752602 309909859
1324 309909859 309438057 309291649 309301033 309231148 308875656 308140907 307073212 305817051 304526482 303281479
1334 303281479 302056541 300760708 299324245 297783260 296310177 295171261 294630051 294844189 295805588
1343 295805588 297348213 299212399 301130772 302894211 304375305 305511036 306266651 306607170 306495247
1352 306495247 305912914 304894943 303550968 302061806 300644207 299494476 298732414 298367844 298307171
1361 298307171 298399563 298505077 298555012 298576374 298667297 298935375 299428005 300089378 300766468 301261444 301406841
1372 301406841 301129494 300476685 299596825 298686199 297924767 297423210 297197952 297177467 297237701 297255249
1382B97255249r2182j73931j31169Q9722M63963Q85486J203652J290474J108455P40032
1392C02639751L60222J57833K43283N92212J055355J432896J572819J440391J122094
1401C10616856P63855M84066L12004J89056K5616k21901n09281p23324p55806n85785
1411C09595356l19786j56612k91291q03890j594334k402973k914715k901554k334556
1420B95875645j408997m64020J70460L26595P5131l16734n29004l63884J42098P31563
1430B94238853J062832Q98877K45990o35280j354122j579934j196136l41587O74038
1439B92013531J520195J977939J995793J666984J166134O91738M26674N02434R46541
1448C02907963J627636K247925K428169J885109O19964j000423k354183k845192k216664
$$ plain form
1382 297255249 297163067 296989136 296857967 296947689 297411652 298297138 299500790 300791264 301899719 302639751
1392 302639751 302999973 303157806 303401089 303993301 305048656 306481552 308054371 309494762 310616856
1401 310616856 311380711 311864777 312176781 312365837 312391453 312169552 311660271 310936947 310181141 309595356
1411 309595356 309275570 309118958 308827667 308023777 306429443 304026470 301111755 298210201 295875645
1420 295875645 294466648 294002628 294173088 294499683 294574814 294258080 293729076 293365192 293507290 294238853
1430 294238853 295301685 296200562 296446552 295811272 294457150 292877216 291681080 291339493 292013531
1439 292013531 293533726 295511665 297507458 299174442 300340576 301032314 301458988 301961422 302907963
1448 302907963 304535599 306783524 309211693 311096802 311716766 310716343 308362160 305516968 303300304
1457C03300304p15293J005954K216015K482758J886959R43317K78645K61307Q02478
1466C12462444J442147J656131J187935K04144q10566j341782j134052l12309P20901
1475C14074993J530132J880475J827316J631985J570205J755600K077370K273865K097282
1484C30719223J473999N76172k35443n78079k49520O35262J654701K259178K051964
1493C38307457J032982l35236j312942j252747K6207K071648L958740M723091L850556
1502C51069756J563339j261444l503342m324455l533478j613159N77698K241210K976723
1511C44192848K863388K289696J671181J227798R30481O05660J05819n67398j248207
1520C52071266j689567j688500j187858l14866O57807J410522J705590J498375R77745
$$ plain form
1457 303300304 302585011 303590965 305806980 308289738 310176697 311120014 311398659 311659966 312462444
1466 312462444 313904591 315560722 316748657 316952801 316142235 314800453 313666401 313354092 314074993
1475 314074993 315605125 317485600 319312916 320944901 322515106 324270706 326348076 328621941 330719223
1484 330719223 332193222 332769394 332533951 331955872 331706352 332341614 333996315 336255493 338307457
1493 338307457 339340439 339005203 337692261 336439514 336465721 338537369 342496109 347219200 351069756
1502 351069756 352633095 351371651 347868309 343543854 340010376 338397217 338974915 341216125 344192848
1511 344192848 347056236 349345932 351017113 352244911 353175392 353781052 353886871 353319473 352071266
1520 352071266 350381699 348693199 347505341 347190475 347848282 349258804 350964394 352462769 353440514
1529C53440514M99611M21409R02710J777077K581825K761307J955719K28653j902008
1538C62666817l666001m385833l791428k145424j11923J558571K368393K272606J649971
1547C56415749J078758J030006J626053K569389L270226L116760J778984n86242l327103
1556C66972580n510902o294632n298500k810555K93770K907066M165917L823967K330017
1565C60578728N72586n80826p05566J2168R40514J387901R90372j12839j390533k233849
1575C59458656k280883j577225n04532M52003R52416R33075N74493J53351j17531j78413
1585C57865410j07689l8834o6681j97830l61671m65088m53873l49617k38609k22664
1595C55362854l53889n92652q17604q90312p44171m45175j75133j35040m12865q99964
$$ plain form
1529 353440514 353940125 354361534 355264244 357041321 359623146 362384453 364340172 364568825 362666817
1538 362666817 359000816 354614983 350823555 348678131 348566208 350124779 352493172 354765778 356415749
1547 356415749 357494507 358524513 360150566 362719955 365990181 369106941 370885925 370299683 366972580
1556 366972580 361461678 355167046 349868546 347057991 347351761 350258827 354424744 358248711 360578728
1565 360578728 361151314 360570488 359864922 359877090 360817604 362205505 363195877 363083038 361692505 359458656
1575 359458656 357177773 355600548 355096016 355548019 356500435 357433510 358008003 358161354 358043823 357865410
1585 357865410 357757721 357718887 357652206 357454376 357092705 356627617 356173744 355824127 355585518 355362854
1595 355362854 355008965 354416313 353598709 352708397 351964226 351519051 351343918 351208878 350796013 349896049
1605C49896049j319847j373901r28268j32370O20308Q85238M16908o67572j916198
1614C45480347k757645k794647k013397p93114K89116P49168M28658m48838j408920
1623C36730728j963348j824150j004219K19078J427612K207069K263146J499901O2141
1632C39617958j664276l123322l749618l195229j528587P10564K681160L601303L136596
1641C36486549J608162j31950j128616q48084M93126K007027K608871J642151o95457
1650C42041779l391533n122948m960213k877044K25944L000260M358215M009971K534600
1659C39819031R71603J96572M55970J320000K040024K057266J334114L16315m12026
1668C48098869n29442j60102K71034L91426J83983J8196L78342J471138K981262M161796
$$ plain form
1605 349896049 348576202 347202301 346274033 346141663 346761971 347647209 348064117 347396545 345480347
1614 345480347 342722702 339928055 337914658 337121544 337410660 338159828 338588486 338139648 336730728
1623 336730728 334767380 332943230 331939011 332158089 333585701 335792770 338055916 339555817 339617958
1632 339617958 337953682 334830360 331080742 327885513 326356926 327067490 329748650 333349953 336486549
1641 336486549 338094711 337962761 336834145 335986061 336479187 338486214 341095085 342737236 342041779
1650 342041779 338650246 333527298 328567085 325690041 325915985 328916245 333274460 337284431 339819031
1659 339819031 340790634 340987206 341443176 342763176 344803200 346860466 348194580 348510895 348098869
1668 348098869 347569427 347409325 347680359 348071785 348255768 348273964 348652306 350123444 353104706 357266502
1678C57266502M227982K829361L13187k388344m193573m391670k965165n53970J895218
1687C52039528L583450M174843L830948K996139K093544J315766O10809j69258j079102
1696C69396667j981773k598953k670975k119598j114693l357Q58307J276054J302414
1705C62344093J190033J238251J613960K234650K780914K838021K110023O02226j319236
1714C75632935l040619l945618l690338k371445m97131J238937K276726K439957J985702
1723C70029106J424484J208229J461602J912155K063370J510543K17705j416588k745475
1732C75665131l213349k651901j364517M7455J011924J273918R85070N57213L81813
1741C72692757N93567J012077J284370J124497M96826l63007j089248j391487j195488
$$ plain form
1678 357266502 361494484 364323845 364637032 362248688 358055115 353663445 350698280 350144310 352039528
1687 352039528 355622978 359797821 363628769 366624908 368718452 370034218 370645027 370475769 369396667
1696 369396667 367414894 364815941 362144966 360025368 358910675 358907318 359765625 361041679 362344093
1705 362344093 363534126 364772377 366386337 368620987 371401901 374239922 376349945 376952171 375632935
1714 375632935 372592316 368646698 364956360 362584915 362087784 363326721 365603447 368043404 370029106
1723 370029106 371453590 372661819 374123421 376035576 378098946 379609489 379827194 378410606 375665131
1732 375665131 372451782 369799881 368435364 368482819 369494743 370768661 371753731 372310944 372692757
1741 372692757 373286324 374298401 375582771 376707268 377204094 376841087 375751839 374360352 373164864
1750C73164864o49262q964N04875P93152Q67195P79342N63851K37961j47057m61693
1760C75644264n20706j82075N33790J387863J990509J976967J203766j43509j604195
1769C80286674k635765k854995k203408r58633M03862J421967J825180J606330R75991
1778C77867203K43454l08686n09224l26538J43547P13959J158257J275635R63363K73323
1788C81494293n82199j295662j587601j337509o51054J76506P94296R61533O58607
1797C78631210Q4343m57077p16476o16532k66304J23711L71590M13742L11241J80435
1807C78059883J02768P7171M4175m5700j72730k46773j67732R4299M58451P66258Q70590
1818C79840660P24678M11110Q8997j06506j46294j17073j53656l37296o31828q97751
$$ plain form
1750 373164864 372515602 372506638 373011513 373804665 374671860 375451202 376015053 376253014 376105957 375644264
1760 375644264 375123558 374941483 375475273 376863136 378853645 380830612 382034378 381890869 380286674
1769 380286674 377650909 374795914 372592506 371633873 372037735 373459702 375284882 376891212 377867203
1778 377867203 378110657 377801971 377292747 376966209 377109756 377823715 378981972 380257607 381220970 381494293
1788 381494293 380912094 379616432 378028831 376691322 376040268 376216774 377011070 377972603 378631210
1797 378631210 378715553 378258476 377542000 376925468 376659164 376782875 377154465 377568207 377879448 378059883
1807 378059883 378162651 378239822 378283997 378238297 378065567 377818794 377651062 377745361 378203812 378970070 379840660
1818 379840660 380565338 380976448 381065445 380958939 380812645 380695572 380541916 380204620 379572792 378675041
1828C78675041r76448p87620l76702J16692N41763Q15773R44481R78165R43298Q04176
1838C81678619M90647k8153o78329j277008j606598j525955j053009l63579K93388
1847C75930023P17774Q42247P38639N46113L77235K62146J60217K5292j31531k28157
1857C79239998j62125J07613N04608Q47549R33648O49147M3106o80199j251297j461639
1867C78770409j257859p57064j78986K66952M74015M66194L54500K54440K18849K22931
1877C78834381K03514J19896q125j10207j16653j3390J37825K30904J78451l0975l18680
1888C79106941n54886o27441n01099k34260N2910K39524K60430J32370o0082k05764
1898C77608643k19307p7629J66549M03595N11856M14505J23978k48642n34897n85556
$$ plain form
1828 378675041 377698593 376910973 376534271 376650963 377192726 378008499 378952980 379931145 380874443 381678619
1838 381678619 382169266 382141113 381462784 380185776 378579178 377053223 376000214 375636635 375930023
1847 375930023 376647797 377490044 378228683 378774796 379152031 379414177 379574394 379599686 379468155 379239998
1857 379239998 379077873 379185486 379690094 380537643 381471291 382120438 382163544 381483345 380232048 378770409
1867 378770409 377512550 376755486 376576500 376843452 377317467 377783661 378138161 378392601 378611450 378834381
1877 378834381 379037895 379157791 379149666 379039459 378922806 378909416 379047241 379278145 379456596 379425621 379106941
1888 379106941 378552055 377924614 377423515 377189255 377242165 377481689 377742119 377874489 377814407 377608643
1898 377608643 377389336 377311707 377478256 377881851 378393707 378808212 378932190 378683548 378148651 377563095
1908C77563095l52096P5492N00412P12662N97763K01950k88849o43844p10030m89006
1918C77167549j29280J63384K41546R3117j62888l53698l55683j62239J17836L27149
1928C76946793L50036J75820r6817l12577l41568j47476J90315N10865O45752N00030
1938C78421173J01624m04206q16497r68323q05054m09431L7880L45306M01153K22283
1948C76125908o4850k95906l56407k35214j9379J62887K15683J24817m2686j83182
1958C75431671k17171j32484J2817J24474J24702o485k20642m24232n24178m73213
1968C73695259k91901n9509J24359J87607J18027l1738j74714k34832j85013n8212
1978C73089333P5187J48583J35383N9510k4491o7672n7869k6246k6092r7771k40135
$$ plain form
1908 377563095 377210999 377286491 377786903 378499565 379097328 379299278 379010429 378366585 377656555 377167549
1918 377167549 377038269 377201653 377443199 377536316 377373428 377019730 376664047 376501808 376619644 376946793
1928 376946793 377296829 377472649 377375832 377063255 376721687 376574211 376764526 377275391 377921143 378421173
1938 378421173 378522797 378118591 377302094 376333771 375528717 375119286 375157166 375502472 375903625 376125908
1948 376125908 376061058 375765152 375408745 375173531 375154152 375317039 375532722 375657539 375614853 375431671
1958 375431671 375214500 375082016 375094833 375219307 375344009 375337524 375116882 374692650 374168472 373695259
1968 373695259 373403358 373343849 373468208 373655815 373773842 373742104 373567390 373332558 373147545 373089333
1978 373089333 373164520 373313103 373448486 373507996 373483505 373415833 373357964 373331718 373305626 373207855 372967720
1989C72967720m06380n24749n34859m17099k04964K8839K03972K64588K01683N3711
1999C71632462j11771k27547k54631j96495r4147m272K8038r842r4452j80435k25792
2010C70261116k14157j62430j10321r7923j42479k27890l11737l45803l01704j85471
2020C68161201l7384Q5412J33628Q9417k6436j60942k54402k65618j92146p0839L7956
2031C67499847P9270K9793r0104k25257l12005l09181k18658q5259K4605N6915l204
2042C66446762j21727k33078k73132k13471p9422O1264J30921Q4076o6605k52724l81546
2053C65101318l84140k51007m0359J49421K28158J58081k6513k37732l78608l89519
2063C63929100k76184j01929M6997J06812O5460l5210j25694j48659q8997J8273J08528
$$ plain form
1989 372967720 372561340 372036591 371501732 371084633 370879669 370908508 371112480 371377068 371578751 371632462
1999 371632462 371520691 371293144 371038513 370842018 370747871 370743599 370771637 370761795 370667343 370486908 370261116
2010 370261116 370046959 369884529 369774208 369676285 369533806 369305916 368994179 368648376 368346672 368161201
2020 368161201 368123817 368209229 368342857 368432274 368405838 368244896 367990494 367724876 367532730 367461891 367499847
2031 367499847 367579117 367608910 367518806 367293549 366981544 366672363 366453705 366368446 366393051 366449966 366446762
2042 366446762 366325035 366091957 365818825 365605354 365525932 365587196 365718117 365802193 365735588 365482864 365101318
2053 365101318 364717178 364466171 364425812 364575233 364803391 364961472 364934959 364697227 364318619 363929100
2063 363929100 363652916 363550987 363597984 363704796 363770256 363735046 363609352 363460693 363371696 363389969 363498497
2074C63498497J23482M3678r8610k33917k90871k32467p8049J05324K33688K48375
2084C63319130J44615k6016j82305k53829k16179j00441K5787R5024P5722j4153j19705
2095C62747650j80282j63575p9918K4453R3879R2965K3269q0032j66702j97487j61057
2106C61953163p6752J6480P9307Q9150M7874k0599q1673j05896q1176j8349N4245J02730
2118C61958504J05285O1646m730n9471p5684m9439k670K8000J3695m8180j30195j88485
2130C61608276j87339j21041j8768O9618J00670O0081k8800j19324j65253j45035p0419
2141C60982666K1286Q6746R7542N1346k9259j08490j52893j43547q3389N150Q8691
2152C60815849J35765J30158P7896N035n3711p3509n0850o714K4796J5869l9177j18484
$$ plain form
2074 363498497 363621979 363665657 363567047 363333130 363042259 362809792 362731743 362837067 363070755 363319130
2084 363319130 363463745 363437729 363255424 363001595 362785416 362684975 362710762 362805786 362881508 362867355 362747650
2095 362747650 362567368 362403793 362323875 362348328 362442207 362535172 362558441 362478409 362311707 362114220 361953163
2106 361953163 361876411 361892891 361972198 362061348 362109222 362088623 362006950 361901054 361819878 361801529 361855774 361958504
2118 361958504 362063789 362125435 362120705 362061234 361985550 361936111 361933441 361961441 361975136 361926956 361796761 361608276
2130 361608276 361420937 361299896 361281128 361350746 361451416 361511497 361482697 361363373 361198120 361053085 360982666
2141 360982666 361003952 361090698 361188240 361239586 361210327 361101837 360948944 360805397 360722008 360727158 360815849
2152 360815849 360951614 361081772 361159668 361164703 361110992 361037483 360986633 360979919 361004715 361020584 360981407 360862923
2164C60862923j83335j97410j46332m4785O9848J54762J81770J48926P9536J0834k4834
2175C60911903j4381L0289P8735R8267P1220N493o8397j12839j05438n1728J5030N2300
2187C60910454L3111l6239j18218j64871j46255p0191K1095P4730N8022k0332j14632
2198C60426674j67503j42060m3640Q3008J77536J95923J32751K2316q0719j28212j01738
2209C60374336j8844P7743J40915J40877P6942k3346j17035j64337j45492o9618K9411
2220C60301552J06849J26954P9269j5602j15738j76811j74408j15433l4599K4833L4638
2231C60041504k098n2490p2556l2806O2179J74942K52419K55851J81580O4545l9711
2242C60833359q4191n3558K8420J13258J52550J22223L2386p8964j66054j94778j58692
$$ plain form
2164 360862923 360679588 360482178 360335846 360291061 360360909 360515671 360697441 360846367 360925903 360936737 360911903
2175 360911903 360897522 360927811 361006546 361104813 361176033 361181526 361113129 361000290 360894852 360843124 360858154 360910454
2187 360910454 360943565 360907326 360789108 360624237 360477982 360407791 360428886 360503616 360561638 360541306 360426674
2198 360426674 360259171 360117111 360073471 360156479 360334015 360529938 360662689 360685005 360604286 360476074 360374336
2209 360374336 360355492 360433235 360574150 360715027 360791969 360768623 360651588 360487251 360341759 360272141 360301552
2220 360301552 360408401 360535355 360614624 360599022 360483284 360306473 360132065 360016632 359982033 360006866 360041504
2231 360041504 360039406 359986916 359914360 359881554 359943733 360118675 360371094 360626945 360808525 360873070 360833359
2242 360833359 360749168 360695610 360724030 360837288 360989838 361112061 361144447 361065483 360899429 360704651 360545959
2253C60545959p9689R16M0474J3008p7171j93596k81677k90871k01111l6507J41640
2264C59581375K60658K71721J74561J7395j28250k05841k02217j49956j04218j04904
2274C59410324j51596k02484k00539j09825N9281K51274L91998M26598L46527J93901
2284C60415459L9711n1117n0011K4300J18904J74446J55945O8817m5090j28937j37519
2295C60584908n6916R4261K77024M51507N90020O79779P15522O91529O00090M38766
2305C65066490K20947j7242k20032l23562k74964n2490L16429P46079J099777J223793
2315C67785225J005783M36897l53050j121254j604958j646347j285247p57866l88222
2324C62070961m17366q67615j521187k035713k131347j742325j040993l28560J31302
$$ plain form
2253 360545959 360466270 360467186 360507660 360520668 360443497 360249901 359968224 359677353 359476242 359439735 359581375
2264 359581375 359842033 360113754 360288315 360305710 360177460 359971619 359769402 359619446 359515228 359410324
2274 359410324 359258728 359056244 358855705 358745880 358805161 359056435 359448433 359875031 360221558 360415459
2284 360415459 360455170 360404053 360354042 360378342 360497246 360671692 360827637 360896454 360851364 360722427 360584908
2295 360584908 360527992 360622253 360899277 361350784 361940804 362620583 363336105 364027634 364627724 365066490
2305 365066490 365287437 365270195 365050163 364726601 364451637 364399147 364715576 365461655 366561432 367785225
2315 367785225 368791008 369227905 368874855 367753601 366148643 364502296 363217049 362459183 362070961
2324 362070961 361653595 360785980 359264793 357229080 355097733 353355408 352314415 351985855 352117157
2333C52117157K25983j3237n12581j253815k268867l517266m733276n384636m834137
2342C29825325k662544J011925N421485R353486J1608963J1497421R121399N305099
2350C80482559J215058k126275m193458n030861n063477m791641m548797m424210m340515
2359C47178383m190254l931275l595657l237915k882767k513733k104912j659050j215667
2368C21847153q24585n07088k37427L9025L66783P47413J138802J483498J745147J927033
2378C27725754K060890K178078K282180K342720K313424K159843J881676J517334J129951
2387C45591850P84531N24902L61519K71301K11335J39694L6125q6403j88293k24572
2397C47421989j72882n0926Q7738J78642J80397R7199k2888j13487j25428n2566O6986
$$ plain form
2333 352117157 352343140 352329903 351817322 350563507 348294640 344777374 340044098 334659462 329825325
2342 329825325 327162781 328174706 333596191 342949677 354558640 366056061 375177460 380482559
2350 380482559 381697617 379571342 375377884 370347023 365283546 360491905 355943108 351518898 347178383
2359 347178383 342988129 339056854 335461197 332223282 329340515 326826782 324721870 323062820 321847153
2368 321847153 321022568 320515480 320278053 320317078 320683861 321431274 322570076 324053574 325798721 327725754
2378 327725754 329786644 331964722 334246902 336589622 338903046 341062889 342944565 344461899 345591850
2387 345591850 346376381 346901283 347262802 347534103 347745438 347885132 347921257 347834854 347646561 347421989
2397 347421989 347249107 347198181 347285919 347464561 347644958 347742157 347719269 347605782 347480354 347427788 347494774
2408C47494774J70555K03476J43585R995j48049k73819l26538k96173k05154r7657
2418C46674995k0027j144m0474j09634j68267j85852j58844j13334q9875j18751k00615
2429C45468178l03574l78914l87878l23105k12479j05209m5586n3062j13907j92108
2439C43352356k48756k60468k29149j77345j36070j28022j57470k07978k51541k62375
2449C41293182k32315j76544j27716j19972j69602k63366l62587m21410m10576l33404
2459C38675690k25411j35345r9297j22642j78223k22893k22511j71051r4528l5477
2469C37168312l1395r3651k00157l07007l67508l54805k74620j61934o5002k3270m9057
2480C35239906j22871k02942k46315k29912j62315p8659k2812k5063q6059j77498k55623
$$ plain form
2408 347494774 347665329 347868805 348012390 348022385 347874336 347600517 347273979 346977806 346772652 346674995
2418 346674995 346654968 346653824 346613350 346503716 346335449 346149597 345990753 345877419 345787544 345668793 345468178
2429 345468178 345164604 344785690 344397812 344074707 343862228 343757019 343711433 343658371 343544464 343352356
2439 343352356 343103600 342843132 342613983 342436638 342300568 342172546 342015076 341807098 341555557 341293182
2449 341293182 341060867 340884323 340756607 340636635 340467033 340203667 339841080 339419670 339009094 338675690
2459 338675690 338450279 338314934 338215637 338092995 337914772 337691879 337469368 337298317 337203789 337168312
2469 337168312 337136917 337043266 336843109 336536102 336168594 335813789 335539169 335377235 335312233 335288963 335239906
2480 335239906 335117035 334914093 334667778 334437866 334275551 334196892 334174080 334149017 334062958 333885460 333629837
2491C33629837k84691k53677j81389j06392o6185p9269j36376k06184k52037k50244
2501C31813393k01989j31645p3738n5199q0795j31416j73836j78375j35536o1264J0070
2512C30599670M3259K0218m9515j34811j97716k13089j81770j28365q8692q9950j35880
2523C29443359k04544k58827k66457k16140j24626k9374K9869L0175k3346j00784j63422
2534C28115883j84288j61133j17264q6555r3117j35841j87836k10800j77994r2125
2544C26668930J1940Q3084P9765o637j44653k75383l39775l06817j89132l6850Q5525
2555C25629997J28784Q0643k9755j47552k18582k12631j36071k5367P0800J14327R2125
2566C25346718J8616p4273j53465j98440k07596j94321j77689j71661j78680j89514
$$ plain form
2491 333629837 333345146 333091469 332910080 332803688 332737503 332658234 332521858 332315674 332063637 331813393
2501 331813393 331611404 331479759 331406021 331350822 331270027 331138611 330964775 330786400 330650864 330589600 330599670
2512 330599670 330642929 330663147 330613632 330478821 330281105 330068016 329886246 329757881 329669189 329579239 329443359
2523 329443359 329238815 328979988 328713531 328497391 328372765 328343391 328373260 328403435 328380089 328279305 328115883
2534 328115883 327931595 327770462 327653198 327566643 327473526 327337685 327149849 326939049 326761055 326668930
2544 326668930 326680870 326763954 326843719 326837082 326692429 326417046 326077271 325770454 325581322 325544472 325629997
2555 325629997 325758781 325839424 325809669 325662117 325443535 325230904 325094833 325069466 325140266 325254593 325346718
2566 325346718 325365334 325291061 325137596 324939156 324731560 324537239 324359550 324187889 324009209 323819695
2576C23819695j89400j66588j19171n8060k708K6321J7777k4109q0872j27945j46789
2587C22948151j35727j11351r9984j23176j82839k57682l11776l12614k49825j43547
2597C21019630l6277K6054J7242n7182j62086k50626k87628k64626k03075j40495j10302
2608C19550629j25847j74942k29569k61974k61097k37141k14882k17895k54173l10250
2618C17262859l58200l70826l37964k72598k06089j71757j87950k48298l25718l85666
2628C14397793m03595l76206l20854k65388k33555k34566k61650k98042l27511l42026
2638C11334400l42941l37238l30544l22781l07827k78034k30274j70555j14174q1596
2648C08818436r0447j47304k41795l46947m26063m45080l86982k60830j01795M0035
$$ plain form
2576 323819695 323630295 323463707 323344536 323286476 323283768 323310089 323327866 323303757 323222885 323094940 322948151
2587 322948151 322812424 322701073 322601089 322477913 322295074 322037392 321725616 321413002 321163177 321019630
2597 321019630 320983353 321009407 321026649 320969467 320807381 320556755 320269127 320004501 319801426 319660931 319550629
2608 319550629 319424782 319249840 319020271 318758297 318497200 318260059 318045177 317827282 317573109 317262859
2618 317262859 316904659 316533833 316195869 315923271 315717182 315545425 315357475 315109177 314783459 314397793
2628 314397793 313994198 313617992 313297138 313031750 312798195 312563629 312301979 312003937 311676426 311334400
2638 311334400 310991459 310654221 310323677 310000896 309693069 309415035 309184761 309014206 308900032 308818436
2648 308818436 308727989 308580685 308338890 307991943 307565880 307120800 306733818 306472988 306371193 306411228
2658C06411228J18771J11885L0212q5792j84288k23751j92356j10283j8959M0264M5871
2669C05942802M120n7430j06850j25236j14632r3746q4019r5653j21365j41067j34755
2680C04872169r4718l1300L2272P1183P0972L4142k3633q1920j26209j52874j69258
2691C04400826j86062k10038k38761k60773k61879k32735j75342j04638m2896j1387
2701C02676315k0370o4240j23615j73683j95885j86386j57490j31511j29052j58577
2711C01335506k11486k66724l00179k96955k57625j98422j43280j13620j19763j58100
2721B99269352k13871k68192l05462l18203l07636k80953k47459k14501j86081j62716
2731B96764278j43299j27163j14154j05668j02481j04409j08928j12343j10359j01090
$$ plain form
2658 306411228 306529999 306641884 306672096 306586304 306402016 306178265 305985909 305875626 305856667 305896931 305942802
2669 305942802 305946922 305889492 305782642 305657406 305542774 305449028 305365009 305269356 305147991 305006924 304872169
2680 304872169 304777451 304746151 304778423 304849606 304920578 304954720 304931087 304849167 304722958 304570084 304400826
2691 304400826 304214764 304004726 303765965 303505192 303243313 303010578 302835236 302730598 302687702 302676315
2701 302676315 302655945 302591705 302468090 302294407 302098522 301912136 301754646 301623135 301494083 301335506
2711 301335506 301124020 300857296 300557117 300260162 300002537 299804115 299660835 299547215 299427452 299269352
2721 299269352 299055481 298787289 298481827 298163624 297855988 297575035 297327576 297113075 296926994 296764278
2731 296764278 296620979 296493816 296379662 296273994 296171513 296067104 295958176 295845833 295735474 295634384
2741B95634384q5926p0171o1169o4526q1043j04408j23329j26267j08013p4291m1123
2752B94694118k7999m7703r8286j60408k05383k08550j62506q3179l872L9806K7123
2763B93763161l7327j26457k03553k40573k30542j88675j41925j13335j11084j26743
2773B92242947j43853j50642j48544j51196j74751k25506k92911l52307l76968l53718
2783B89872551k90642k16236j65920j65081k16427k97756l72219m05522l81660l10669
2793B87050419k23103j56383j37310j70155k35329k98557l27091l04699k39048j58100
2803B84800644r6283p9041j10187j70689k29225k58045k47879k13204j84650j92814
2813B83018627k50873l46051m44889n08480n12180m58069l73955l00369k71244k98061
$$ plain form
2741 295634384 295548458 295478287 295417118 295352592 295271549 295167141 295043812 294917545 294809532 294735241 294694118
2752 294694118 294666119 294618416 294520130 294359722 294154339 293945789 293783283 293700104 293696232 293736038 293763161
2763 293763161 293725834 293599377 293395824 293155251 292924709 292736034 292594109 292480774 292369690 292242947
2773 292242947 292099094 291948452 291799908 291648712 291473961 291248455 290955544 290603237 290226269 289872551
2783 289872551 289581909 289365673 289199753 289034672 288818245 288520489 288148270 287742748 287361088 287050419
2793 287050419 286827316 286670933 286533623 286363468 286128139 285829582 285502491 285197792 284958744 284800644
2803 284800644 284704361 284625320 284515133 284344444 284115219 283857174 283609295 283396091 283211441 283018627
2813 283018627 282767754 282421703 281976814 281468334 280956154 280498085 280124130 279823761 279552517 279254456
2823B79254456l66078m42142m91009m92268m47349l77732l12767k76050k75383l01533
2833B75472145l35140l57399l60165l48739l38765l45916l76931m24747m71478m97188
2843B71615677m91657m59977m21638m01001m14333m60625n20802n65872n71308n29346
2853B66779118m53587l73516l21789l19977l69815m53492n43003o12469o48937o56166
2863B62026367o50196o49757o65379o93340p16686p13463o68621n82466m73729l72943
2873B55839787l09544k98710l33900l88680m28715m27513l78303k97013k14252j59836
2883B52603321j49593j80111k35386l00789l78342m91333o74381r52778j316833j707592
2893B46216183k022038k139873j964779j463852o88591K34661J139641J871376K330608
$$ plain form
2823 279254456 278888378 278446236 277955227 277462959 277015610 276637878 276325111 276049061 275773678 275472145
2833 275472145 275137005 274779606 274419441 274070702 273731937 273386021 273009090 272584343 272112865 271615677
2843 271615677 271124020 270664043 270242405 269841404 269427071 268966446 268445644 267879772 267308464 266779118
2853 266779118 266325531 265952015 265630226 265310249 264940434 264486942 263943939 263331470 262682533 262026367
2863 262026367 261376171 260726414 260061035 259367695 258651009 257937546 257268925 256686459 256212730 255839787
2873 255839787 255530243 255231533 254897633 254508953 254080238 253652725 253274422 252977409 252763157 252603321
2883 252603321 252453728 252273617 252038231 251737442 251359100 250867767 250193386 249240608 247923775 246216183
2893 246216183 244194145 242054272 240089493 238625641 237937050 238171711 239311352 241182728 243513336
2902B43513336K495136K411728K164326J836128J482659J126918P73221M28581J15852
2911B56347885j28822k72503l04604k46639j44863n0564R92K480k9545p1202j07097
2922B54995518j40152j85490k57091l52669m48246n04151m81205l56617j34429J55849
2932B52291317M68826P57942R88083J141091J216335J224766J183719J112481J031150
2941B61415710R61152R23690R36718J007672J127586J267986J386547J438981J395149
2950B71861191J251373J033135P86075N58224L82709K66343J91841J29928N5886l8147
2960B76478558j39656k24057k67429k60143k13013j54953j21231j38779k13108l23124
2970B74423065m26483m74586m31385k89765p6675J54667L44314M48780M57840L96691
$$ plain form
2902 243513336 246008472 248420200 250584526 252420654 253903313 255030231 255803452 256232033 256347885
2911 256347885 256219063 255946560 255641956 255395317 255250454 255199890 255200882 255203362 255173817 255102615 254995518
2922 254995518 254855366 254669876 254412785 254060116 253611870 253107719 252626514 252269897 252135468 252291317
2932 252291317 252760143 253518085 254506168 255647259 256863594 258088360 259272079 260384560 261415710
2941 261415710 262376862 263300552 264237270 265244942 266372528 267640514 269027061 270466042 271861191
2950 271861191 273112564 274145699 274931774 275489998 275872707 276139050 276330891 276460819 276516705 276478558
2960 276478558 276338902 276114845 275847416 275587273 275374260 275219307 275098076 274959297 274746189 274423065
2970 274423065 273996582 273521996 273090611 272800846 272724171 272878838 273223152 273671932 274129772 274526463
2980B74526463L14254K60468K64816L25318M11186M79145M92897M38328L26347J85299
2990B78024521M5528p2994j65996k40326l03936l56503l88355l86372l45039k75688
3000B75534840k04907j64966j77861k43911l39947m31500m89311n04608m90704m73480
3010B72013645m74262m96464n24196n33066n06592m48170l80935l35618l33671l75118
3020B67605553m38328m91219n07316m78230m16794l49769l04585k98462l31421l88526
3030B63600903m47159m86832m97227m81548m54197m33311m31710m50306m77962m96960
3040B58943691m93889m67186m28657l97568l88622m04358m34227m61578m76056m79660
3050B54511890m85286n06649n46418n91087o16722o02474n44491m60701l83778l45344
$$ plain form
2980 274526463 274840717 275101185 275366001 275691319 276102505 276581650 277074547 277512875 277839222 278024521
2990 278024521 278070049 277997055 277831059 277590733 277286797 276930294 276541939 276155567 275810528 275534840
3000 275534840 275329933 275164967 274987106 274743195 274403248 273971748 273482437 272977829 272487125 272013645
3010 272013645 271539383 271042919 270518723 269985657 269479065 269030895 268649960 268314342 267980671 267605553
3020 267605553 267167225 266676006 266168690 265690460 265273666 264923897 264619312 264320850 263989429 263600903
3030 263600903 263153744 262666912 262169685 261688137 261233940 260800629 260368919 259918613 259440651 258943691
3040 258943691 258449802 257982616 257553959 257156391 256767769 256363411 255929184 255467606 254991550 254511890
3050 254511890 254026604 253519955 252973537 252382450 251765728 251163254 250618763 250158062 249774284 249428940
3060B49428940l60489m20971m98848n60722n80654n50156m78401l87249l02849k48375
3070B45040226k39162k77882l53890m44088n19523n55878n44052m95739m38900m05102
3080B40766010m13284m59499n18971n59234n58625n18169m61464m20742m19178m57726
3090B35979118n14888n58987n66139n32074m73786m18529l88909l91807m17137m46148
3100B31270714m63200m64001m56447m53720m65450m91543n22309n44433n48401n33428
3110B26327782n07737m84237m74339m83169n08023n40638n71117n92003o00033n95417
3120B20971069n80063n55191n21030m79069m34284l96709l79353l92532m37889n04857
3130B16290092n72891o19755o30760o05469n57613n07030m70066m53091m51965m58184
$$ plain form
3060 249428940 249068451 248647480 248148632 247587910 247007256 246457100 245978699 245591450 245288601 245040226
3070 245040226 244801064 244523182 244169292 243725204 243205681 242649803 242105751 241610012 241171112 240766010
3080 240766010 240352726 239893227 239374256 238815022 238256397 237738228 237276764 236856022 236436844 235979118
3090 235979118 235464230 234905243 234339104 233807030 233333244 232914715 232525806 232133999 231716862 231270714
3100 231270714 230807514 230343513 229887066 229433346 228967896 228476353 227954044 227409611 226861210 226327782
3110 226327782 225820045 225335808 224861469 224378300 223870277 223329639 222758522 222166519 221566486 220971069
3120 220971069 220391006 219835815 219314785 218835716 218401432 218004723 217625370 217232838 216794949 216290092
3130 216290092 215717201 215097446 214466686 213861217 213303604 212796574 212326508 211873417 211421452 210963268
3140B10963268m65736m74186m85687m98963n06592m97303m64973m15878l70064l51810
3150B06432076l76339m38099n11513n63336n70259n32417m73003m25186m13990m43345
3160B01684589m95948n45597n71537n68963n47313n20745m99420m83951m70066m54903
3170A96526146m41856m38252m48589m68655m85515m83990m57173m12387l69721l52974
3180A92167034l76911m39301n19466n87292o15062n89371n16396m19941l32298k81734
3190A87489262k81144l23944l85799m36382m51870m25968l72143l16143k83604k87342
3200A83924923l22151l68729m04415m13799l95642l60241l22589k95277k83566k86674
3210A80471840l00388l20702l43952l66268l82767l88794l82252l66916l50743l43780
$$ plain form
3140 210963268 210497532 210023346 209537659 209038696 208532104 208034801 207569828 207153950 206783886 206432076
3150 206432076 206055737 205617638 205106125 204542789 203972530 203440113 202967110 202541924 202127934 201684589
3160 201684589 201188641 200643044 200071507 199502544 198955231 198434486 197935066 197451115 196981049 196526146
3170 196526146 196084290 195646038 195197449 194728794 194243279 193759289 193302116 192889729 192520008 192167034
3180 192167034 191790123 191350822 190831356 190244064 189629002 189039631 188523235 188103294 187770996 187489262
3190 187489262 187208118 186884174 186498375 186061993 185610123 185184155 184812012 184495869 184212265 183924923
3200 183924923 183602772 183234043 182829628 182415829 182020187 181659946 181337357 181042080 180758514 180471840
3210 180471840 180171452 179850750 179506798 179140530 178757763 178368969 177986717 177619801 177269058 176925278
3220A76925278l52650l76835m08230m34704m45652m36878m12101l80917l53870l36857
3230A72986584l29380l24707l14751k95315k70042k49501k46772k69738l15456l70045
3240A70000877m13570m29459m12845l72582l27263k95410k87227l00064l22114l39851
3250A66500492l45192l39069l29361l25337l32069l48682l68519l83148l84598l67642
3260A62976875l30391k74982k08416j42288r0580o6414p7038j20773j87073k59190
3270A61219730l18927l51391l47862l07580k38189j54371p5684k1582n378k8344p8411
3281A59292011j33924j72110j79214j55974j15690p6628n2108m4566m7178n1165n4779
3292A58208675o5813r7627j59731k47402l40290m09632m31681m01592l37296k73027
$$ plain form
3220 176925278 176572628 176195793 175787563 175352859 174907207 174470329 174058228 173677311 173323441 172986584
3230 172986584 172657204 172332497 172017746 171722431 171452389 171202888 170956116 170686378 170370922 170000877
3240 170000877 169587307 169157848 168745003 168372421 168045158 167749748 167462521 167162457 166840343 166500492
3250 166500492 166155300 165816231 165486870 165161533 164829464 164480782 164112263 163729115 163344517 162976875
3260 162976875 162646484 162371502 162163086 162020798 161930218 161863804 161786766 161665993 161478920 161219730
3270 161219730 160900803 160549412 160201550 159893970 159655781 159501410 159425726 159404144 159398766 159370422 159292011
3281 159292011 159158087 158985977 158806763 158650789 158535099 158458471 158406363 158361797 158314619 158263454 158208675
3292 158208675 158142862 158045235 157885504 157638102 157297812 156888180 156456499 156054907 155717611 155444584
3302A55444584k43492k67554l39574m33340n14899n59959n63698n40686n14497n04380
3312A50962505n15146n36995n53331n51529n30615n00965m76980m69475m78754m96626
3322A45852089n11093n13277n01194m78640m52299m28228m10061l99266l95498l96585
3332A41365948l97749l92313l74480l43923l08066k81114k77205l02133l48053l95260
3342A37945652m21047m11215l67756l08208k56100k29359k31972k54116k79169k93350
3352A34893360k91700k78435k60887k44789k31066k17600k03714j92290j89581k02045
3362A32581253k31705k75039l23849l68643m01687m19961m24203m18711m08583l98397
3372A28910475l90291l82967l72401l53727l23467k81382k30818j75619j19152o2590
$$ plain form
3302 155444584 155201092 154933538 154593964 154160624 153645725 153085766 152522068 151981382 151466885 150962505
3312 150962505 150447359 149910364 149357033 148805504 148274889 147773924 147296944 146827469 146348715 145852089
3322 145852089 145340996 144827719 144326525 143847885 143395586 142967358 142557297 142158031 141762533 141365948
3332 141365948 140968199 140575886 140201406 139857483 139549417 139268303 138991098 138688965 138340912 137945652
3342 137945652 137524605 137113390 136745634 136437426 136181326 135951967 135719995 135465879 135186710 134893360
3352 134893360 134601660 134323225 134062338 133817549 133586483 133368883 133165169 132972879 132783298 132581253
3362 132581253 132349548 132074509 131750660 131382017 130980330 130560369 130136166 129717455 129308872 128910475
3372 128910475 128520184 128137217 127764816 127411089 127087622 126806240 126575422 126399803 126280651 126218061
3382A26218061p114M3402Q2187J01510R8638Q0185O2418O3925R5787J53475K16817
3393A27209291K58437K57244K09055J28679M2734k1877m8027l2025J9103R2735J74436
3404A28289785K49234L02515L22923L06855K63576K13118J79653J79138K10629K55565
3414A30772991K87543K86350K49185J91937J39446J12133J14517J35680J56049J60513
3424A32606344J47438J28651J22843J44291J95102K62843L26194L64247L66020L35026
3434A34998999K87618K44713K21424K19889K28748K30370K12774J79005J47552J43614
3444A37114706J83458K63424L59097M36306M69560M55304M14123L77550L70961L99227
3454A40843716M44812M79346M79488M39758L73631L04861K55470K36473K46621K77051
$$ plain form
3382 126218061 126210947 126254349 126336536 126438046 126536684 126616869 126679287 126743212 126838999 126992474 127209291
3393 127209291 127467728 127724972 127934027 128062706 128105440 128083563 128035536 128003511 128022614 128115349 128289785
3404 128289785 128539019 128841534 129164457 129471312 129734888 129948006 130127659 130306797 130517426 130772991
3414 130772991 131060534 131346884 131596069 131788006 131927452 132039585 132154102 132289782 132445831 132606344
3424 132606344 132753782 132882433 133005276 133149567 133344669 133607512 133933706 134297953 134663973 134998999
3434 134998999 135286617 135531330 135752754 135972643 136201391 136431761 136644535 136823540 136971092 137114706
3444 137114706 137298164 137561588 137920685 138356991 138826551 139281855 139695978 140073528 140444489 140843716
3454 140843716 141288528 141767874 142247362 142687120 143060751 143365612 143621082 143857555 144104176 144381227
3464A44381227L17317L59010L95832M22058M31872M21848L92895L51896L10002K78034
3474A48061991K63490K68450K90175L23381L62129M00467M33312M57201M71372M78058
3484A51810026M81548M85449M89750M90923M83980M66490M41666M16765L99208L90883
3494A56356688L86028L73697L44124K95248K33841J72605J22376Q7748O5631N0736
3504A58488722M1237M2295O1531J02339J56136K03018K19536J90696J20697L2235m3259
3515A59615183q1425p7801m9352k5225k9612o7844j22375j60380j49383p2070O5709
3526A58845425K37932M08497N45492O32610O74381O93665P20501P76977Q63247R52149
3536A65350876R98421R60807Q27256O28738M32644L12881L14351M28829N99651P53098
$$ plain form
3464 144381227 144698544 145057554 145453386 145875444 146307316 146729164 147122059 147473955 147783957 148061991
3474 148061991 148325481 148593931 148884106 149207487 149569616 149970083 150403395 150860596 151331968 151810026
3484 151810026 152291574 152777023 153266773 153757696 154241676 154708166 155149832 155566597 155965805 156356688
3494 156356688 156742716 157116413 157460537 157755785 157989626 158162231 158284607 158372355 158437986 158488722
3504 158488722 158529959 158572254 158633785 158736124 158892260 159095278 159314814 159505510 159626207 159658442 159615183
3515 159615183 159533758 159455957 159406605 159381380 159351768 159283924 159161549 159001169 158851786 158779716 158845425
3526 158845425 159083357 159491854 160037346 160669956 161344337 162038002 162758503 163535480 164398727 165350876
3536 165350876 166349297 167310104 168137360 168766098 169198742 169511623 169825974 170254803 170854454 171607552
3546A71607552Q37364Q47568Q19168P99179Q13847Q57658R08471R55791J014919J111565
3556A80573082J245594J360950J353760J124478O47907J8558n66520q86727q00476
3565A84070606l15971M08478J134987J647491J833038J709462J396293J055699Q34312
3574A93774395Q22029J030312J387005J747837J935157J802063J305790N51777k26841
3583B04129524p56435q45184m74473J90144Q77876J340371J456966J267567R23309
3592B08109665N96962M07581L93486N33753P82032J086025J384277J597748J640816
3601B16532345J456489J057568N43041P3395j89552j47839J90735P09286J215744J501922
3611B22943134J414490R23557J67714n58510q92830n61486M59233J864490L093663
$$ plain form
3546 171607552 172444916 173292484 174111652 174910831 175724678 176582336 177490807 178446598 179461517 180573082
3556 180573082 181818676 183179626 184533386 185657864 186305771 186324329 185757809 184871082 184070606
3565 184070606 183754635 184163113 185298100 186945591 188778629 190488091 191884384 192940083 193774395
3574 193774395 194596424 195626736 197013741 198761578 200696735 202498798 203804588 204356365 204129524
3583 204129524 203373089 202527905 202053432 202243576 203121452 204461823 205918789 207186356 208109665
3592 208109665 208706627 209114208 209507694 210041447 210823479 211909504 213293781 214891529 216532345
3601 216532345 217988834 219046402 219589443 219662838 219473286 219325447 219516182 220225468 221441212 222943134
3611 222943134 224357624 225281181 225448895 224890385 223997555 223436069 223895302 225759792 228853455
3620B28853455L554649K905064J247940q74558k702026l588562l278275j988544k71511
3629B23857632J257801K177314K384091K059536J533394J132488J076660J429043K084465
3638B38992424K783623L169136K900448J810913L8089j960334l550759m186573l662452
3647B36334515k221833m48532J003628J703396J604347J007633L69568P3223K81544
3656B39707489R19285J757164K524319K995777L038387K629967J863613R28955N5504
3665B56420460n77183r22642j089935j273670j622906k123337k572136k671108k187252
3674B41380291j087799M26845K004471L279305L987026M008770L353176K123127N05791
3683B59981003j219883k697525l566494l583965k736855j274529L71876J748295K535801
$$ plain form
3620 228853455 232408104 235313168 236561108 235686550 232984524 229395962 226117687 224129143 223857632
3629 223857632 225115433 227292747 229676838 231736374 233269768 234402256 235478916 236907959 238992424
3638 238992424 241776047 244945183 247845631 249656544 249694633 247734299 244183540 239996967 236334515
3647 236334515 234112682 233664150 234667778 236371174 237975521 238983154 239352722 239425945 239707489
3656 239707489 240626774 242383938 244908257 247904034 250942421 253572388 255436001 256364956 256420460
3665 256420460 255843277 254920635 253830700 252557030 250934124 248810787 246238651 243567543 241380291
3674 241380291 240292492 240719337 242723808 246003113 249990139 253998909 257352085 259475212 259981003
3683 259981003 258761120 256063595 252497101 248913136 246176281 244901752 245273628 247021923 249557724
3692B49557724K634754K150173J313439L97072l42427o96964n45826Q9378J001683
3701B55559006J820316K129345J652241M15287j212998k647266l332615k989044j731777
3710B49662495q774J605968K650032K929745K535267J738625Q46405Q8157m21657o55804
3720B60970459o23207l37525J73283Q28953J460724J818504J642418P86743o53553
3729B66066799k291012l527908l777409k743892o25153J893006L888874M606914L815422
3738B67305641J922531k28958j788997k320424j979160j355362j077995j421051k148018
3747B56908207k680416k477474j388550K38018J746559K543182K412949J606159O59485
3756B59568119P8449P6161N05104R94472J183358R07802K51808n31769j158332j423741
$$ plain form
3692 249557724 252192478 254342651 255656090 256053162 255710735 255013771 254467945 254557323 255559006
3701 255559006 257379322 259508667 261160908 261576195 260363197 257715931 254383316 251394272 249662495
3710 249662495 249653721 251259689 253909721 256839466 259374733 261113358 261959763 262047920 261626263 260970459
3720 260970459 260347252 260009727 260183010 261011963 262472687 264291191 265933609 266720352 266066799
3729 266066799 263775787 260247879 256470470 253726578 253101425 254994431 258883305 263490219 267305641
3738 267305641 269228172 268999214 267210217 264889793 262910633 261555271 260477276 259056225 256908207
3747 256908207 254227791 251750317 250361767 250599785 252346344 254889526 257302475 258908634 259568119
3756 259568119 259646568 259722729 260227833 261222305 262405663 263313465 263565273 263033504 261875172 260451431
3766B60451431j254234p04289P0572Q47607J387501J506595J156712M67167k91233
3775B63637829q20980r40151o68774k05784J94759L71628L37277K43644K63043M68349
3785B62880840P93839J094971J256332J263523J188164J103019R99566P78999L29895
3794B71689148l62968j164685j839828k180329k125301j786442j358967r77516o22673
3803B59270439j47953N85270J558304K540035L176804L177910K482452J299972r53
3812B73942280j082039j785564k153531k319641k363815k235317j801777r84287J24473
3821B59340782J254082K078133K390079K216492J788311J384563J149903J006565P22026
3830B73330936Q9512q98838k000828k836551l093510k695751j827087p95384J69220
$$ plain form
3766 260451431 259197197 258492908 258563480 259411087 260798588 262305183 263461895 263929062 263637829
3775 263637829 262816849 261876698 261207924 261002140 261196899 261568527 261905804 262149448 262412491 262880840
3785 262880840 263674679 264769650 266025982 267289505 268477669 269580688 270580254 271359253 271689148
3794 271689148 271326180 270161495 268321667 266141338 264016037 262229595 260870628 259893112 259270439
3803 259270439 259122486 259707756 261266060 263806095 266982899 270160809 272643261 273943233 273942280
3812 273942280 272860241 271074677 268921146 266601505 264237690 262002373 260200596 259216309 259340782
3821 259340782 260594864 262672997 265063076 267279568 269067879 270452442 271602345 272608910 273330936
3830 273330936 273420448 272521610 270520782 267684231 264590721 261894970 260067883 259272499 259441719
3839B59441719J043778J976585L099499M313945N205441N176411L757629R36108k691994
3848B82259121o062260q038444p895108n646514k064515J638031M304791N287075M642391
3857B68424568L009815J246930K0790m46854l81546k34032l80897r11637j603717k075634
3867B66667786k015171j350251k78320Q42667J667785K002869J846962J341610O76613
3876B71402550J6079n27821q83770j007481q89759n80101j95674J09996K16790J10645
3886B67771454r1019j86996J373N21526J237908J873131K123909J796627Q97121l65982
3896B75579052j661167k654705l119507k989349k350617j387062l11241O90613J484508
3905B63280525J991253K176762K044792J636124J032466L52555k66857p04575q92296
$$ plain form
3839 259441719 260485497 262462082 265561581 269875526 275080967 280257378 284015007 284951115 282259121
3848 282259121 276196861 268158417 260263309 254616795 252552280 254190311 258495102 263782177 268424568
3857 268424568 271434383 272681313 272702103 272255249 271873703 271639671 271258774 270347137 268743420 266667786
3867 266667786 264652615 263302364 263024044 263866711 265534496 267537365 269384327 270725937 271402550
3876 271402550 271418629 270890808 270007038 268999557 268109798 267529697 267334023 267444019 267660809 267771454
3886 267771454 267680435 267493439 267494812 268016338 269254246 271127377 273251286 275047913 275945034 275579052
3896 275579052 273917885 271263180 268143673 265154324 262803707 261416645 261105404 261796017 263280525
3905 263280525 265271778 267448540 269493332 271129456 272161922 272514477 272247620 271543045 270650749
3914B70650749q38203o21567l58143j50032m3926j9741j4515L0708J28918K32983K61440
3925B69258671J49326j02672m10195o34842o46686l94249N9299N53913R01146R69239
3935B69702950P45162L37945p6752l42961l94001k72483r2144L0078L3036p0286k16255
3946B69384289l33920l78246l38688k27795o8569J08071K59914L37830L06491J71261
3956B69220638j1425j56364j97277j29795j6537N4474L0308p0324j73703k08129j59321
3967B68182545p7820l4409n8613j13525j30196p4863J2054M1256m6539k17209l54423
3978B67128258l49312k00901l7384k3518k17037m94194o25286m68769j31760N5790
3988B64635887k18296r46388j693611j847840j146145j46751k57549l153458r797096
$$ plain form
3914 270650749 269812546 269190979 268832836 268682804 268638878 268619137 268604622 268635330 268764248 268997231 269258671
3925 269258671 269407997 269305325 268895130 268260288 267613602 267219353 267278652 267832565 268733711 269702950
3935 269702950 270448112 270786057 270709305 270366344 269972343 269699860 269607716 269637794 269670830 269600544 269384289
3946 269384289 269050369 268672123 268333435 268105640 268037071 268145142 268405056 268742886 269049377 269220638
3956 269220638 269209213 269052849 268855572 268725777 268709240 268763714 268794022 268723698 268549995 268341866 268182545
3967 268182545 268104725 268070316 268011703 267898178 267767982 267693119 267705173 267746429 267699890 267482681 267128258
3978 267128258 266778946 266578045 266540661 266517143 266300106 265805912 265180626 264711857 264580097 264635887
3988 264635887 264417591 263471203 261777592 259929752 258783607 258636856 258379307 255225849 245428753
3997B45428753j9600983l0278702l8600673
4000A56948395
$$ plain form
3997 245428753 225827770 195549068 156948395
4000 156948395
##END=$$ End of the data block
