##TITLE=$$ Begin of the data block
##JCAMP-DX=5.00 $$ ACD/SpecManager v 10.08
##SPECTROMETER/DATA SYSTEM=16PC
##DATE=Mon Sep 02 17:41:43 2013
##DATA TYPE=INFRARED SPECTRUM
##DATA CLASS=XYDATA
##ORIGIN=
##OWNER=
##NPOINTS=3601
##FIRSTX=400.00000000
##LASTX=4000.00000000
##MAXX=4000.00000000
##MINX=400.00000000
##MAXY=37.84746933
##MINY=7.16314745
##XFACTOR=1.0000000000
##YFACTOR=0.000000100000000
##FIRSTY=16.81870270
##DELTAX=1.00000000
##XUNITS=1/CM
##YUNITS=TRANSMITTANCE
##XYDATA=(X++(Y..Y))
400 168187027 212680378 248674908 272735558 285144463 289209042 289453564 289639473 291528416
408 291528416 294807415 297965927 299490643 298719482 296019478 292382870 288820305 285941391 283901978
417 283901978 282629108 282084312 282358437 283551884 285563736 287972336 290117111 291343060 291256866
426 291256866 289835587 287334194 284073257 280270004 276032658 271517544 267114830 263494186 261423435
435 261423435 261427402 263476715 266902332 270613747 273527050 274989872 274996700 274106369 273133221 272782097
445 272782097 273398609 274916000 276973972 279116077 280967140 282330208 283191032 283648777 283812790
454 283812790 283708935 283241959 282238216 280557137 278212490 275430737 272596931 270109749 268226204
463 268226204 266990852 266292171 266004791 266115570 266745033 268050041 270079269 272687054 275571060
472 275571060 278410149 281011295 283371239 285622654 287910824 290288677 292691212 294988613 297065163
481 297065163 298864803 300382042 301622295 302570534 303192482 303458691 303363400 302924004 302166271 301114368
491 301114368 299795609 298248596 296518574 294635754 292598438 290389404 288030453 285645275 283473396
500 283473396 281803627 280845470 280611801 280893383 281351795 281683121 281750851 281604691 281375446 281121922
510 281121922 280740051 280001659 278703690 276828194 274603443 272417603 270631695 269403458 268626366
519 268626366 268017406 267295628 266341419 265244408 264220104 263452072 262962112 262583294 262048149 261133385
529 261133385 259772396 258072624 256234722 254429340 252711086 251016006 249236336 247312527 245276928
538 245276928 243217964 241191349 239142284 236899166 234248886 231052723 227334385 223292255 219238682
547 219238682 215516701 212445087 210314159 209399700 209943523 212071304 215674934 220334358 225354652
556 225354652 229936447 233421822 235500603 236277180 236164722 235666847 235163574 234805584 234553928 234316730
566 234316730 234083786 233973465 234166527 234775352 235735588 236793671 237604790 237891712 237578831 236829071
576 236829071 235963707 235307789 235040436 235124054 235340881 235410805 235123062 234414883 233365479 232120438
586 232120438 230797939 229432049 227978306 226371059 224589500 222692795 220803165 219051361 217518120
595 217518120 216203632 215039082 213928699 212797241 211619911 210426025 209282360 208271828 207477570
604 207477570 206976624 206838093 207119770 207861156 209073334 210730419 212763405 215058746 217463188
613 217463188 219798393 221889114 223601151 224877033 225750923 226327705 226727657 227017212 227161102
622 227161102 227023449 226423702 225225544 223416328 221143494 218692646 216424713 214700584 213819733
631 213819733 213980103 215253468 217568798 220707073 224322968 228004284 231362457 234125252 236193600
640 236193600 237638454 238644218 239426670 240164719 240965977 241866207 242847538 243861446 244851837 245778446
650 245778446 246633511 247438965 248214703 248931637 249486885 249740067 249615669 249219608 248882217 249058495
660 249058495 250097122 251988602 254247684 256040020 256528301 255277500 252501011 249000263 245818615
669 245818615 243788681 243213043 243832951 245072002 246387253 247520561 248529072 249624043 250958805
678 250958805 252514553 254139271 255683174 257109470 258496838 259939270 261430397 262828388 263932800
687 263932800 264619923 264935856 265076599 265263653 265595894 265976048 266157494 265878639 264997826 263547592
697 263547592 261685390 259586849 257357693 255020943 252577209 250086956 247708302 245658150 244116631
706 244116631 243131809 242584362 242235470 241832943 241219559 240387993 239459705 238604183 237944107 237495537
716 237495537 237166309 236808586 236291332 235557842 234641247 233639889 232668304 231811333 231099644 230510921
726 230510921 229987774 229459610 228859463 228135300 227259750 226241131 225130653 224017239 223004189
735 223004189 222171230 221539116 221055470 220612965 220093994 219418526 218571186 217593861 216551304 215494099
745 215494099 214442139 213397388 212373066 211414757 210594006 209975052 209575005 209344215 209180946 208974667
755 208974667 208652802 208207588 207691383 207189655 206789722 206559124 206535091 206718712 207067413 207491703
765 207491703 207865868 208061543 207991467 207642574 207073021 206371441 205600662 204766846 203841400 202832813
775 202832813 201866741 201223431 201295567 202477531 205032330 208998566 214177742 220201607 226642914
784 226642914 233121071 239367180 245241127 250711308 255816784 260625648 265196419 269548645 273654213
793 273654213 277453384 280893440 283970985 286751423 289349937 291880875 294404335 296905727 299321976
802 299321976 301599941 303746395 305834866 307963219 310190144 312496090 314798679 317014465 319122982
811 319122982 321185341 323297005 325503578 327736206 329819717 331559486 332861137 333808594 334645576
820 334645576 335662422 337047310 338786583 340672531 342412720 343778839 344710999 345323715 345821190
829 345821190 346379967 347070885 347858429 348663406 349435768 350185242 350952377 351748543 352514763 353135109
839 353135109 353500862 353583870 353467560 353311996 353270607 353407631 353665504 353899498 353955765 353746338 353279076
850 353279076 352632141 351896019 351122093 350304565 349400024 348361549 347161407 345788078 344226494
859 344226494 342441711 340383530 338011169 335317039 332325554 329055901 325465164 321407852 316653557
868 316653557 310980206 304320889 296907291 289336605 282512722 277458115 275051289 275781345 279608002
877 279608002 285976276 293973141 302558823 310788670 317957478 323647079 327698517 330150986 331180038
886 331180038 331040611 330002975 328274117 325919991 322831993 318779984 313560581 307197247 300102177
895 300102177 293106842 287315445 283815136 283348045 286077728 291541538 298803043 306729507 314276772
904 314276772 320677681 325492554 328553162 329874420 329598923 327999268 325505905 322706604 320277214
913 320277214 318846207 318841362 320382690 323266525 327045212 331163750 335100327 338465271 341042061
922 341042061 342779579 343755531 344128685 344089203 343810425 343410339 342933388 342360611 341645279 340755730
932 340755730 339702225 338533134 337304916 336047707 334751930 333385582 331930161 330409660 328887024
941 328887024 327428741 326058922 324734726 323364754 321863213 320208397 318468571 316775246 315256062
950 315256062 313964176 312844143 311754627 310535793 309084396 307397003 305559807 303694344 301890297
959 301890297 300161095 298443432 296635628 294651299 292457848 290083008 287589703 285036774 282448521
968 282448521 279806690 277065449 274176998 271112576 267870140 264467831 260930901 257277222 253503876
977 253503876 249575615 245417252 240921650 235986843 230586967 224860649 219178104 214138851 210467262
986 210467262 208819160 209558697 212593403 217344532 222876110 228138542 232232285 234592876 235041370
995 235041370 233711891 230921307 227057438 222531433 217782707 213288574 209526978 206880322 205515842
1004 205515842 205306416 205843792 206548119 206826649 206211605 204424706 201365795 197065868 191661606
1013 191661606 185416718 178767395 172331619 166828156 162895966 160872002 160625896 161541691 162675934
1022 162675934 163044586 161926861 159070377 154723997 149502411 144150753 139310818 135372429 132447948
1031 132447948 130452662 129238615 128717327 128925753 130018730 132200632 135631552 140344095 146200047
1040 146200047 152894669 160001507 167038212 173532848 179078197 183366890 186208363 187527370 187348957
1049 187348957 185775871 182971573 179161091 174653625 169870815 165349483 161685314 159408255 158818026
1058 158818026 159844398 162004089 164494457 166407261 166987820 165841465 163014412 158931370 154237137
1067 154237137 149619303 145678539 142869549 141490068 141674318 143364964 146273422 149871941 153461962
1076 153461962 156330481 157954798 158175564 157256670 155789585 154467068 153811188 153968191 154653826
1085 154653826 155273123 155162239 153851719 151247644 147668753 143741140 140208387 137736626 136780224
1094 136780224 137533417 139954977 143830128 148835173 154587584 160679588 166704273 172277393 177057323
1103 177057323 180759125 183163910 184128914 183604488 181657524 178493195 174457626 170010910 165666542
1112 165666542 161912365 159133224 157561684 157266970 158181829 160151691 162984200 166481762 170449123
1121 170449123 174681549 178945770 182972126 186469193 189162884 190852165 191462822 191077938 189929390
1130 189929390 188345184 186663036 185136108 183864422 182780151 181699162 180424709 178865070 177118969
1139 177118969 175488873 174414425 174348488 175625496 178369923 182477493 187663097 193548813 199751587
1148 199751587 205941620 211864586 217336369 222226715 226443024 229915428 232580528 234364929 235176430
1157 235176430 234914379 233504639 230951824 227388821 223099365 218497658 214069443 210289726 207547092
1166 207547092 206094646 206037006 207345829 209890194 213467484 217828751 222701435 227814751 232928867
1175 232928867 237862930 242510624 246834755 250841274 254544411 257940731 261004677 263706875 266039791
1184 266039791 268033161 269744205 271226139 272489815 273482456 274094658 274193859 273666306 272449169
1193 272449169 270541821 268002491 264944801 261543407 258048897 254792824 252164173 250546246 250226383
1202 250226383 251309128 253670254 256976299 260768013 264579067 268046684 270973988 273328266 275184784
1211 275184784 276650543 277804546 278679237 279284172 279650421 279866886 280087070 280501823 281292400 282585678
1221 282585678 284428902 286787777 289562225 292607250 295752087 298816853 301632671 304064255 306033421
1230 306033421 307530289 308606091 309344730 309824390 310084324 310111885 309855423 309256763 308288784 306982384
1240 306982384 305431957 303775921 302159004 300690899 299413624 298290691 297220879 296069984 294708710
1249 294708710 293040485 291012230 288608723 285842724 282752819 279416733 275972805 272634773 269682236
1258 269682236 267419052 266109180 265910339 266831760 268731232 271352196 274384747 277530212 280550747
1267 280550747 283295212 285702438 287786179 289609833 291255760 292796097 294271679 295686779 297021065
1276 297021065 298252621 299380360 300434284 301466866 302532215 303662777 304853172 306052399 307158985
1285 307158985 308016548 308415356 308116112 306909161 304702873 301611061 297990780 294391479 291415081
1294 291415081 289531422 288927059 289455299 290712166 292203140 293522053 294465790 295046120 295415096
1303 295415096 295759144 296219082 296861839 297694855 298690529 299794788 300918713 301929836 302663288
1312 302663288 302955589 302682724 301779270 300228024 298034000 295212746 291812572 287964230 283922462
1321 283922462 280054798 276759090 274331589 272846775 272114105 271742153 271285954 270405788 268959751
1330 268959751 266989670 264619598 261937447 258935909 255550442 251770363 247751675 243855629 240578556
1339 240578556 238401279 237631512 238314648 240251522 243101482 246508102 250182514 253909969 257494736
1348 257494736 260692501 263184338 264620190 264723663 263413734 260888386 257624836 254281368 251523895
1357 251523895 249833260 249363651 249911060 251010590 252129631 252879925 253157959 253155022 253234501 253738060
1367 253738060 254812260 256333942 257958794 259260082 259884377 259657288 258604984 256904716 254804916
1376 254804916 252555580 250369358 248407955 246779232 245533924 244663963 244112949 243804283 243677998
1385 243677998 243717709 243949356 244410343 245107098 245990982 246974297 247984219 249025612 250211601 251734333
1395 251734333 253779011 256421642 259561787 262930069 266168976 268949032 271061172 272446480 273158131
1404 273158131 273291950 272931156 272137718 270981503 269572983 268060627 266579208 265173416 263745365
1413 263745365 262066956 259868755 256970844 253396130 249408283 245447922 241988583 239370651 237686329
1422 237686329 236766720 236279621 235891323 235416737 234883099 234474621 234388905 234683895 235204468 235634956
1432 235634956 235655575 235116901 234138641 233076515 232378044 232403927 233302975 234989128 237209301 239648991
1442 239648991 242027187 244157581 245984211 247597904 249219913 251124077 253492088 256249886 258985844
1451 258985844 261041069 261784115 260960922 258929806 256617756 255169067 255438786 257589836 261019917
1460 261019917 264667950 267536888 269149380 269691811 269793434 270095062 270876827 271956215 272888851
1469 272888851 273318100 273242054 273038330 273248730 274275951 276179962 278685570 281371899 283911533
1478 283911533 286214619 288408546 290688114 293139706 295642204 297897339 299567451 300454311 300631714
1487 300631714 300466156 300496407 301205769 302774506 304939575 307063923 308428459 308632832 307896137
1496 307896137 307060699 307235374 309221191 313012848 317667408 321656532 323551674 322699699 319537544
1505 319537544 315386219 311844826 310110130 310558319 312755470 315818310 318881168 321417503 323298607
1514 323298607 324639282 325583382 326168976 326326790 325974083 325121460 323931465 322704239 321801910
1523 321801910 321534348 322040405 323209343 324693489 326041298 326917000 327304726 327567635 328286705
1532 328286705 329926987 332499619 335424156 337705574 338369942 336944580 333730354 329713860 326161842
1541 326161842 324100609 323936462 325381355 327687607 330048065 331961021 333404732 334765625 336574364
1550 336574364 339169235 342429008 345694504 347936325 348137131 345757408 341083794 335271187 330001755
1559 330001755 326861496 326696014 329253273 333306885 337220192 339685440 340271187 339510384 338501968
1568 338501968 338258858 339158211 340780525 342196541 342515869 341382332 339153442 336694412 334928856
1577 334928856 334404068 335088997 336476288 337891006 338820648 339101486 338901825 338553391 338347435 338399315
1587 338399315 338629913 338844833 338853569 338567162 338032341 337397308 336828384 336423149 336164474 335942497
1597 335942497 335633354 335186806 334662361 334182167 333826141 333545227 333168068 332518044 331575317 330563507
1607 330563507 329872742 329832916 330462723 331363716 331859207 331329346 329562073 326907310 324130936 322037201
1617 322037201 321068840 321106415 321568413 321740303 321140099 319729576 317889404 316212006 315243435 315292740
1627 315292740 316352348 318107224 319996281 321318665 321405220 319853420 316758385 312812672 309159679
1636 309159679 306990566 307028332 309151287 312383518 315313148 316765518 316390095 314830627 313350658
1645 313350658 313089142 314346771 316320248 317475376 316389847 312614994 307059879 301650467 298417740
1654 298417740 298500957 301611996 306251240 310537930 313173923 314002323 313881855 314015236 315177040
1663 315177040 317309132 319682922 321458130 322232780 322229805 322040558 322155724 322641907 323194389 323508606
1673 323508606 323675766 324280930 326088486 329492569 334091682 338694191 341804543 342345314 340220184
1682 340220184 336406479 332529716 330152435 330147362 332450562 336264572 340541573 344457893 347641335
1691 347641335 350088806 351898956 353032608 353267670 352367706 350340424 347596855 344883537 342999725
1700 342999725 342447548 343211327 344795990 346510468 347845230 348738670 349587860 350995407 353384209
1709 353384209 356682281 360244675 363065605 364193726 363164749 360250702 356401024 352885895 350790634
1718 350790634 350589981 352004242 354212074 356315880 357815971 358833771 359954376 361772804 364412880
1727 364412880 367316132 369454575 369868279 368224030 365063286 361580162 359044342 358193016 358931427
1736 358931427 360493546 361944275 362711182 362841759 362862625 363364716 364585876 366242332 367688751
1745 367688751 368289871 367772789 366365509 364667892 363352394 362869987 363304214 364412842 365793686
1754 365793686 367063065 367963448 368382607 368324242 367884712 367254219 366720276 366622734 367238960 368632545
1764 368632545 370546799 372428703 373609734 373580971 372233200 369935951 367402992 365406876 364479485
1773 364479485 364740372 365915833 367509727 369018288 370088387 370576363 370531616 370153809 369747200
1782 369747200 369656563 370161362 371339035 372963791 374528961 375427437 375235901 373955154 372063408
1791 372063408 370321770 369416885 369626083 370688629 371955833 372737312 372652817 371802330 370674896
1800 370674896 369864807 369760666 370374451 371383591 372337685 372898521 372981491 372739182 372423134 372224579
1810 372224579 372189560 372245750 372302361 372343445 372447014 372722359 373217316 373866272 374521370 375043030 375383644
1821 375383644 375599747 375782318 375956993 376036720 375868149 375349464 374533272 373635139 372931900 372614784
1831 372614784 372699776 373057709 373540497 374102936 374820786 375781059 376921959 377951202 378428535 377988548
1841 377988548 376575584 374538651 372510986 371130600 370754547 371322136 372432671 373577690 374386559
1850 374386559 374756470 374817429 374786034 374812241 374911346 375004921 375024567 375000534 375072784 375413780 376107407
1861 376107407 377054863 377969246 378474693 378273201 377298393 375776711 374155540 372923660 372408752
1870 372408752 372650490 373410759 374307632 374998474 375314255 375287666 375081635 374877510 374792595 374859009
1880 374859009 375050240 375315590 375594635 375813637 375889168 375756226 375410385 374931221 374460144 374135818
1890 374135818 374024696 374091339 374228745 374326935 374336052 374283676 374244919 374291153 374453926 374720421 375048637
1901 375048637 375382385 375655365 375794411 375740662 375488930 375121803 374802895 374714050 374960060 375497437
1911 375497437 376136971 376629372 376788635 376581993 376133308 375642929 375276299 375090981 375038872 375030212
1921 375030212 375008278 374982414 375004768 375114517 375294876 375473557 375565109 375524445 375377617 375212021 375134773
1932 375134773 375223351 375491638 375883446 376290741 376586494 376662827 376464195 376007462 375380859 374719048
1942 374719048 374159851 373800201 373666840 373716393 373861237 374008751 374093895 374094620 374026070 373922615 373818970
1953 373818970 373736916 373682899 373651619 373634148 373625069 373625450 373640480 373670731 373702965 373706322 373640137 373471260
1965 373471260 373194580 372843628 372482796 372182503 371989441 371906967 371897392 371904297 371881752 371814270 371717377
1976 371717377 371621971 371554108 371523933 371528625 371563988 371632271 371738319 371874924 372009773 372085800 372041168
1987 372041168 371840172 371497688 371081276 370686378 370395927 370245895 370214272 370238495 370251045 370212097 370123138
1998 370123138 370015755 369925842 369868965 369831047 369777107 369671135 369494362 369252663 368970337 368675652 368387833
2009 368387833 368111115 367837982 367559624 367275620 366997490 366744080 366530304 366357841 366212349 366072044
2019 366072044 365921669 365763512 365616646 365502129 365423431 365355110 365250587 365068588 364802666 364494820
2029 364494820 364220047 364047966 364001617 364039459 364073410 364014816 363822327 363524055 363200912 362942467 362800217
2040 362800217 362767525 362792740 362816238 362805862 362769623 362739830 362741966 362769127 362779808 362718430 362547455 362269974
2052 362269974 361930809 361595039 361317329 361117897 360977516 360852013 360697250 360490913 360239983 359974251
2062 359974251 359729080 359530258 359385605 359287949 359222946 359178047 359145851 359123650 359110909 359107857 359116516 359141350
2074 359141350 359188042 359258842 359347839 359439507 359513054 359550476 359545403 359505806 359449806 359396172 359354515 359320526
2086 359320526 359279175 359213943 359117050 358997116 358877716 358790359 358761635 358801308 358897209 359017410 359121132
2097 359121132 359172859 359154396 359069099 358939590 358799248 358682556 358617859 358621902 358695488 358820152 358959312
2108 358959312 359065323 359095840 359032249 358892632 358727570 358599434 358552818 358591881 358679504 358758392 358784180
2119 358784180 358749504 358685265 358637657 358637047 358677368 358721619 358727341 358677139 358592186 358518677 358497314 358533669
2131 358533669 358591347 358613052 358555870 358419991 358250313 358109703 358039055 358029633 358026505 357961655 357798271
2142 357798271 357559319 357320938 357173576 357172356 357304497 357494659 357644501 357684860 357610435 357479591 357378502
2153 357378502 357373581 357479401 357657967 357847481 358000755 358108940 358197212 358299713 358430481 358571587
2163 358571587 358684502 358736954 358725967 358682861 358655968 358684235 358775482 358905144 359033699 359131165 359193802
2174 359193802 359244728 359317169 359433136 359589691 359758759 359901276 359985542 359999504 359952278 359864235 359753876
2185 359753876 359629097 359487228 359323730 359141808 358957558 358794136 358670807 358590813 358539009 358490639
2195 358490639 358428917 358359108 358311386 358326721 358433838 358628845 358870506 359095764 359246712 359297218 359263153
2206 359263153 359192390 359140930 359147911 359221573 359341545 359472542 359581261 359645920 359659157 359624901 359554367
2217 359554367 359464607 359377747 359318542 359307899 359353905 359445953 359554672 359640656 359669037 359622231 359506035
2228 359506035 359345512 359172974 359014854 358883781 358780441 358701744 358650093 358636780 358675308 358769302 358902931
2239 358902931 359042282 359148636 359198074 359194870 359169388 359160957 359194603 359266891 359350090 359410515 359431839 359423676
2251 359423676 359413567 359425583 359461937 359500656 359511833 359479828 359418030 359362755 359351540 359398308 359482956 359561081
2263 359561081 359589386 359549675 359458427 359354820 359277039 359239616 359224930 359193916 359108658 358955612 358756523
2274 358756523 358562546 358433800 358415871 358522682 358734856 359011803 359310036 359597855 359856987 360075760
2284 360075760 360238037 360320930 360304146 360186424 359996834 359791069 359630852 359557190 359573326 359647675 359736443
2295 359736443 359813461 359889717 360011482 360238228 360611458 361128883 361734467 362328110 362789421 363010292
2305 363010292 362926559 362544060 361949921 361305885 360818405 360689011 361050835 361909294 363105888 364329453
2315 364329453 365187111 365327606 364579315 363043900 361089592 359220352 357864151 357173424 356945229
2324 356945229 356717873 356007690 354565239 352509766 350263901 348327141 347022514 346362572 346097984
2333 346097984 345889626 345465012 344647179 343260536 341033859 337653694 333017960 327573433 322497215
2342 322497215 319511070 320306587 325799332 335580254 347876015 360089149 369692268 375068626
2350 375068626 375928726 373160896 368258438 362646790 357225456 352271309 347640762 343076096 338430901
2359 338430901 333731194 329111977 324725494 320695381 317127876 314137173 311841106 310319519 309565163
2368 309565163 309467506 309848633 310530586 311396675 312414494 313616886 315059948 316785336 318801861
2377 318801861 321085205 323584137 326225510 328918037 331559296 334048576 336301842 338261375 339896278
2386 339896278 341195869 342163200 342813797 343178635 343306847 343261833 343111229 342915344 342720184 342556953
2396 342556953 342446175 342399635 342418900 342490730 342586594 342668648 342701607 342665138 342560081 342405167 342227592
2407 342227592 342051773 341893196 341757355 341643143 341546478 341461296 341379623 341291084 341184387 341051254 340890427
2418 340890427 340709915 340524979 340352898 340204430 340077858 339956627 339814720 339626503 339378090 339074440
2428 339074440 338738060 338399048 338082619 337798996 337542343 337297592 337050896 336796494 336536980 336276894
2438 336276894 336016426 335750389 335473328 335187607 334906158 334647865 334425621 334235916 334056587 333857117
2448 333857117 333614388 333325958 333011475 332700081 332413673 332154732 331907845 331653557 331384926 331114845
2458 331114845 330869331 330669174 330513382 330375862 330217896 330010872 329754868 329480629 329232941 329044991
2468 329044991 328917923 328818321 328695259 328506699 328239632 327914162 327568436 327235832 326927261 326628799
2478 326628799 326314430 325965309 325582199 325186043 324806175 324464989 324169312 323911629 323679199 323463593
2488 323463593 323262939 323076782 322897797 322708664 322487297 322218361 321903954 321566467 321239815 320955276
2498 320955276 320728645 320556488 320420799 320299950 320175743 320035820 319869919 319667797 319420319 319126129
2508 319126129 318797207 318458462 318139267 317860565 317624493 317415104 317208519 316987915 316754208 316525402
2518 316525402 316325817 316170959 316059074 315972366 315888271 315793438 315690441 315594826 315522499 315476036 315437756
2529 315437756 315374184 315250340 315046768 314770145 314452286 314137764 313865223 313652134 313490791 313355656
2539 313355656 313220425 313073311 312924385 312800140 312728500 312722282 312770004 312838974 312888546 312887421 312824612
2550 312824612 312711372 312572536 312434063 312313137 312215881 312140713 312085133 312049026 312033272 312035122 312043781
2561 312043781 312041073 312007275 311929150 311806450 311651688 311484566 311323090 311176147 311042480 310914021 310782986
2572 310782986 310646973 310510483 310381851 310268993 310175800 310101719 310042553 309991894 309940586 309875603 309779873
2583 309779873 309634800 309426060 309149723 308816280 308449001 308077431 307729168 307422256 307163162 306948471
2593 306948471 306769466 306616154 306479435 306350250 306219330 306077633 305918465 305739861 305545979 305344810
2603 305344810 305144482 304948330 304751701 304541950 304301815 304014702 303670368 303268738 302820797 302346191
2613 302346191 301867275 301403217 300963917 300547676 300142536 299731312 299297848 298832722 298334904 297810383
2623 297810383 297268219 296715946 296157780 295594921 295028267 294461155 293900185 293354511 292831421 292332859
2633 292332859 291852493 291375866 290884724 290363350 289805565 289217930 288618202 288028126 287464561 286933289
2643 286933289 286428185 285937500 285452576 284974003 284510536 284071236 283655682 283248940 282826309 282366371
2653 282366371 281865520 281345863 280850773 280428963 280115337 279917355 279813423 279764099 279729748 279686012
2663 279686012 279630909 279580841 279559422 279583988 279657211 279766197 279889851 280009727 280118141 280220413 280328121
2674 280328121 280448704 280576420 280692234 280772228 280802307 280788250 280754967 280733395 280741825 280773754 280800209
2685 280800209 280787106 280717659 280606136 280493145 280425282 280428524 280492535 280573635 280615158 280573673 280436401
2696 280436401 280222912 279971924 279722366 279499435 279309654 279144840 278989544 278826714 278641644 278424435
2706 278424435 278172321 277891102 277593479 277293396 276998043 276702862 276393433 276054554 275681648 275286808
2716 275286808 274895973 274536247 274221783 273945236 273680725 273395596 273065186 272681484 272253208 271798096
2726 271798096 271334114 270874138 270427113 270002193 269611416 269269428 268989086 268777409 268633518 268550529
2736 268550529 268517666 268521862 268546543 268569641 268564777 268505287 268373013 268164673 267894344 267588387 267276669
2747 267276669 266983547 266723690 266502838 266322098 266180763 266076050 266000977 265941887 265880432 265798988 265687542
2758 265687542 265547333 265388870 265225468 265066643 264914055 264764175 264613552 264463978 264322281 264195442
2768 264195442 264082737 263972206 263842602 263673115 263454075 263194218 262918911 262659492 262438889 262260342
2778 262260342 262104301 261936760 261723137 261442375 261093674 260693340 260265141 259828129 259389915 258947220
2788 258947220 258493061 258025780 257555389 257103004 256694698 256352749 256086655 255890255 255743027 255616112
2798 255616112 255481529 255320168 255126591 254908695 254682083 254461174 254251709 254047031 253831654 253589783
2808 253589783 253314571 253012333 252700367 252397346 252113571 251843643 251568508 251263199 250907917 250496960
2818 250496960 250040340 249559498 249078102 248613243 248170033 247741547 247314186 246875057 246419086 245952206
2828 245952206 245489025 245045929 244633141 244249191 243881512 243512993 243131237 242735329 242336082 241950150
2838 241950150 241590919 241260929 240951138 240645218 240326729 239984379 239613018 239210682 238775883 238306408
2848 238306408 237802639 237270966 236725960 236186962 235671196 235185566 234722424 234260426 233771019 233227291
2858 233227291 232609367 231905994 231110954 230218830 229223900 228124771 226932507 225677547 224409637
2867 224409637 223186951 222059517 221052704 220161648 219358673 218610840 217896309 217210236 216556606
2876 216556606 215932674 215317783 214676876 213978825 213218536 212429314 211675129 211024761 210520134 210153179
2886 210153179 209857941 209515266 208961964 208002186 206426773 204054394 200799065 196750793 192235966
2895 192235966 187816353 184202023 182090950 181982079 184029598 187996197 193320274 199271317 205131607
2904 205131607 210341549 214568596 217698574 219776363 220935402 221345329 221187134 220646839 219911747
2913 219911747 219158096 218528481 218107986 217909813 217877979 217907028 217871056 217653904 217170830 216378479
2923 216378479 215275631 213897800 212312984 210620308 208949986 207461376 206332588 205740070 205828075
2932 205828075 206676140 208271332 210497398 213145981 215952263 218648319 221023102 222971668 224518032
2941 224518032 225802269 227035007 228431358 230146885 232235928 234643879 237232246 239823284 242246437
2950 242246437 244371662 246123486 247478085 248451462 249085083 249433136 249551620 249489002 249279556 248942528
2960 248942528 248488045 247928391 247287617 246601734 245905457 245209332 244479561 243635769 242576237 241226292
2970 241226292 239591961 237791252 236042156 234603195 233685913 233375282 233595181 234137096 234742794
2979 234742794 235204716 235440369 235508118 235561867 235769100 236232185 236947441 237814026 238681202 239405479
2989 239405479 239892292 240109043 240073204 239829369 239429245 238920422 238343105 237730236 237106056 236485672
2999 236485672 235875149 235275593 234687443 234113312 233557072 233019447 232494221 231966972 231418018 230827789
3009 230827789 230182476 229477921 228722191 227935314 227147312 226392136 225698318 225078697 224524708 224008331
3019 224008331 223494015 222953587 222377815 221776676 221168766 220564995 219958706 219327431 218646793 217908573
3029 217908573 217130795 216353111 215618706 214953213 214351597 213781700 213202324 212586212 211934471 211275215
3039 211275215 210646114 210071354 209544239 209026146 208461647 207802868 207030945 206165142 205254955 204361057
3049 204361057 203533669 202798252 202153625 201579742 201050396 200543098 200041637 199534245 199008446 198449612
3059 198449612 197842674 197178135 196457405 195695381 194919147 194163208 193462257 192843838 192321529 191890278
3069 191890278 191524696 191182976 190815849 190379448 189848404 189223099 188529587 187809277 187104702 186445274
3079 186445274 185838966 185273590 184724483 184165382 183577652 182953014 182292042 181598988 180878315 180134392
3089 180134392 179374180 178610001 177859325 177139530 176460247 175816936 175190773 174556389 173894596 173202915
3099 173202915 172499161 171813374 171173134 170588703 170046139 169513397 168955212 168349724 167698650 167024288
3109 167024288 166357098 165719795 165115891 164529018 163931694 163298397 162616901 161892338 161144562 160400620
3119 160400620 159686623 159021549 158413095 157856045 157331572 156809797 156255512 155637569 154940271 154170809
3129 154170809 153360100 152553864 151798162 151123800 150537243 150021286 149544067 149071789 148579197 148053503
3139 148053503 147492237 146897678 146272497 145618191 144936886 144233580 143517885 142802868 142103004 141431284
3149 141431284 140796099 140199165 139634142 139086504 138536749 137966175 137364025 136733065 136089325 135455694
3159 135455694 134851189 134281387 133734236 133185196 132608824 131991053 131336746 130667677 130012350 129392986
3169 129392986 128816204 128271484 127739220 127202892 126660242 126127214 125632181 125202637 124850435 124561787
3179 124561787 124298096 124007387 123642874 123181171 122631512 122033262 121441193 120905933 120456591 120093889
3189 120093889 119794188 119522820 119249239 118957253 118646221 118324232 117999001 117669821 117326860 116956120
3199 116956120 116546478 116096249 115614862 115120335 114635210 114182596 113783541 113454914 113205576 113032484
3209 113032484 112917337 112828102 112726860 112581406 112376251 112116575 111823273 111519861 111220236 110921612
3219 110921612 110608063 110261316 109873819 109455805 109034243 108643808 108314180 108059731 107874537 107734003
3229 107734003 107602205 107442322 107226562 106943817 106600475 106215906 105812693 105406990 105004034 104601021
3239 104601021 104194851 103790617 103403616 103053017 102751188 102493610 102257557 102010069 101721582 101377907
3249 101377907 100984344 100561171 100134239 99726734 99355259 99030886 98760891 98548841 98391724 98277674
3259 98277674 98187637 98100653 98001699 97886724 97761164 97633648 97508745 97383814 97252607 97112722 96971655
3270 96971655 96845818 96752462 96698551 96674709 96657219 96621075 96553831 96464672 96381245 96336470 96351414 96424665
3282 96424665 96533098 96643839 96729717 96780157 96800890 96804752 96800346 96784506 96743793 96663418 96536140 96366673
3294 96366673 96168995 95957975 95742302 95521002 95286007 95028076 94741526 94427233 94091797 93744383
3304 93744383 93393974 93045855 92698460 92341900 91958790 91529179 91039639 90492725 89911547 89335327
3314 89335327 88806362 88352470 87974224 87641449 87303829 86908894 86421299 85834198 85170012 84471664
3324 84471664 83787985 83159819 82609921 82138329 81724558 81335707 80938473 80512476 80058928 79601812
3334 79601812 79178638 78825102 78560510 78381100 78263817 78178992 78103337 78027287 77953024 77886519 77829666
3345 77829666 77778182 77725821 77670946 77620234 77586064 77579045 77600236 77638721 77673802 77681804 77642703 77543430
3357 77543430 77379131 77153311 76877732 76572766 76264873 75979972 75734978 75530281 75348520 75161138
3367 75161138 74939747 74667807 74346418 73992033 73629045 73280196 72960372 72674923 72422571 72199917
3377 72199917 72005401 71841922 71717134 71642594 71631474 71695347 71841521 72070589 72376051 72744579 73158484
3388 73158484 73597717 74042287 74474983 74883738 75263467 75616517 75951276 76278615 76608562 76948271
3398 76948271 77301784 77671652 78060312 78470230 78902030 79353147 79817505 80287905 80759735 81234159
3408 81234159 81718311 82221937 82751217 83302488 83859653 84396124 84882727 85298424 85640917 85930634
3418 85930634 86207323 86517715 86899500 87368155 87912655 88501987 89099455 89677477 90225325 90747490
3428 90747490 91254530 91753416 92243195 92718220 93175821 93622561 94073277 94543352 95037231 95540524
3438 95540524 96022034 96445580 96788721 97058811 97299194 97578592 97968006 98511333 99204206 99991674
3448 99991674 100787172 101505995 102097988 102565041 102953997 103330832 103749895 104234104 104774828 105348587
3458 105348587 105937757 106541805 107173214 107841997 108540525 109238815 109894142 110470085 110953436 111362429
3468 111362429 111740637 112141314 112608929 113164434 113800907 114488525 115187883 115865221 116503239 117103186
3478 117103186 117677002 118234978 118777514 119295130 119778843 120232086 120675001 121135950 121633472 122161379
3488 122161379 122688665 123175993 123601294 123976374 124342566 124745989 125207434 125705824 126186876 126592150
3498 126592150 126889629 127087307 127220421 127323170 127403069 127434931 127377501 127199364 126896629 126491709
3508 126491709 126015577 125488005 124910164 124273100 123574085 122826920 122058077 121292095 120537462 119785662
3518 119785662 119024801 118259153 117519741 116859798 116335335 115985880 115824986 115845289 116030502 116362963
3528 116362963 116822081 117378721 117994890 118638535 119304533 120028830 120877676 121911621 123139677 124494514
3538 124494514 125847187 127060070 128050594 128828297 129482546 130127592 130840816 131630850 132455769 133275375
3548 133275375 134098711 134992571 136043139 137299013 138735743 140268431 141802931 143287258 144722872
3557 144722872 146125441 147464695 148631268 149467907 149856672 149811058 149514818 149271841 149389324 150053654
3567 150053654 151263371 152849751 154564228 156183596 157581110 158745623 159758587 160753078 161870747
3576 161870747 163216267 164808693 166543026 168190880 169463768 170131207 170144634 169695721 169163113
3585 169163113 168959408 169352398 170354214 171736946 173161678 174344540 175170517 175706577 176130028
3594 176130028 176631241 177349453 178357143 179671917 181259861 183019638 184770107 186275311 187319469
3603 187319469 187803860 187811069 187594337 187488041 187779331 188598709 189870110 191334000 192629108 193412457
3613 193412457 193494225 192952175 192174892 191781235 192401867 194382935 197545471 201144505 204099216
3622 204099216 205422993 204659042 202102318 198686104 195586491 193746891 193552685 194790974 196866207
3631 196866207 199121895 201098728 202640457 203860264 205038643 206508579 208538818 211206455 214280872
3640 214280872 217189617 219143314 219425983 217743645 214446259 210471420 206997147 204961052 204689789
3649 204689789 205828857 207592545 209180984 210135612 210468712 210549927 210861683 211774368 213433399
3658 213433399 215756645 218490677 221277103 223725166 225503731 226444130 226603737 226230602 225619392
3667 225619392 224927044 224067898 222773762 220803356 218179970 215304451 212861137 211560211 211858444
3676 211858444 213802032 217048283 221012421 225031967 228472786 230781460 231542492 230582848 228093128
3685 228093128 224673290 221220150 218659363 217629929 218274174 220233822 222840614 225385704 227335682
3694 227335682 228422680 228630371 228145905 227321854 226634407 226581402 227501183 229371204 231710415 233690872
3704 233690872 234456444 233516750 231014290 227714710 224710121 222981110 223028717 224739418 227512627
3713 227512627 230552502 233164845 234938183 235772724 235801849 235282135 234509201 233775444 233351269 233460445
3723 233460445 234232044 235630341 237392368 239019451 239870281 239371414 237294655 233981457 230369129
3732 230369129 227732773 227194996 229205589 233260651 238045959 241981277 243911686 243589783 241688690
3741 241688690 239344902 237498226 236412220 235645351 234463978 232422028 229735851 227223339 225851974
3750 225851974 226182537 228047104 230647392 232994785 234420071 234861221 234791031 234869747 235547333 236838455
3760 236838455 238359852 239563274 240009995 239548492 238344135 236792736 235383816 234563198 234613724
3769 234613724 235565948 237164574 238926487 240299988 240879765 240579929 239667358 238624096 237905598
3778 237905598 237727642 238001251 238445587 238797302 238978519 239121933 239451809 240118694 241105556 242266178
3788 242266178 243448219 244595451 245740032 246891899 247917309 248522835 248382854 247341213 245546703
3797 245546703 243416615 241435986 239920044 238899574 238207645 237704773 237475834 237843895 239172134
3806 239172134 241576080 244740391 247976665 250501766 251775036 251695538 250556278 248811512 246826344
3815 246826344 244768620 242689552 240698776 239075241 238212299 238420086 239722061 241793690 244099979
3824 244099979 246153221 247731304 248921871 249967365 251019669 251966419 252445221 252042542 250553665
3833 250553665 248144608 245316467 242696228 240783978 239808350 239770012 240620785 242432194 245401497
3842 245401497 249645691 254887314 260243149 264312229 265614147 263223534 257298985 249210701 241145229
3851 241145229 235323563 233173065 234831066 239198799 244495945 249032345 251827755 252822571 252643661
3860 252643661 252110920 251769867 251674614 251487122 250784035 249374390 247454929 245540943 244232082
3869 244232082 243949013 244770508 246431465 248457928 250353470 251748142 252462063 252489147 251945496
3878 251945496 251021748 249952354 248984699 248326817 248076973 248174477 248417282 248564892 248486538 248273792
3888 248273792 248235397 248755608 250076504 252118969 254445667 256396389 257334061 256885529 255069084
3897 255069084 252266769 249075737 246117859 243884354 242654400 242486725 243260021 244734688 246617737
3906 246617737 248619156 250488548 252031364 253110218 253645401 253626137 253128223 252317390 251417351
3915 251417351 250644016 250132637 249901695 249877949 249967728 250125141 250368099 250729313 251179848 251589680
3925 251589680 251766701 251562443 250980473 250213852 249577885 249367752 249717598 250535526 251546993 252418327
3935 252418327 252896442 252899494 252525463 251986008 251503181 251216450 251137218 251165905 251158562 251009312 250706673
3946 250706673 250334682 250022640 249872246 249908161 250076923 250288162 250466385 250577545 250622253 250610924
3956 250610924 250550632 250452232 250344982 250274754 250276661 250342636 250415287 250423069 250333099 250180149 250042286 249979115
3968 249979115 249983025 249987335 249927845 249805126 249687862 249647160 249675293 249666367 249490147 249106331 248620052
3979 248620052 248215351 248006420 247929420 247782154 247399788 246826153 246313152 246107769 246178951 246133347
3989 246133347 245464249 244002838 242207909 240937462 240665531 240551968 238030548 229409695 211419640
3998 211419640 183004189 146374722
4000 146374722
##END=$$ End of the data block
