##TITLE=$$ Begin of the data block
##JCAMP-DX=5.00 $$ ACD/SpecManager v 10.08
##SPECTROMETER/DATA SYSTEM=16PC
##DATE=Wed Aug 21 09:54:43 2013
##DATA TYPE=INFRARED SPECTRUM
##DATA CLASS=XYDATA
##ORIGIN=
##OWNER=
##NPOINTS=3601
##FIRSTX=400.00000000
##LASTX=4000.00000000
##MAXX=4000.00000000
##MINX=400.00000000
##MAXY=469.23074341
##MINY=5.97524643
##XFACTOR=1.0000000000
##YFACTOR=0.000001000000000
##FIRSTY=46.99451828
##DELTAX=1.00000000
##XUNITS=1/CM
##YUNITS=TRANSMITTANCE
##XYDATA=(X++(Y..Y))
$$ plain form
400 46994518 279659119 469230743 336772797 143065689 80251053 75308632 149413712
407 149413712 212121201 142745422 53183510 27133131 28506779 54863312 88961029 118410782
415 118410782 126213577 72126747 13492060 5975246 14361691 12786794 28865957 100425980
423 100425980 170967728 178613403 177325562 218528717 247959167 212220169 160135101 125315712
431 125315712 99999977 94495178 88205124 52659561 21787691 29600573 47382187 46090244
439 46090244 60714268 142542343 213636353 191455368 141095871 103866318 68589737 33798672
447 33798672 11673117 21399666 40490795 52411556 58490540 45927357 40573765 77119995
455 77119995 116249992 123505470 119003105 110129837 100616310 97757652 98247147 103764816 106645348
$$ packed form
400D6994518K32664601J89571624j32457946j93707108o2814636m942421P4105080
407A49413712O2707489o9375779q9561912k6050379J373648K6356533L4097717K9449753
415A18410782P802795n4086830n8634687p516814Q386445j574897J6079163P1560023
423A00425980P0541748P645675j287841M1203155K9430450l5738998n2085068l4819389
431A25315712k5315735n504799o290054l5545563l0871870P812882J7781614j291943
439D6090244J4624024Q1828075P1094010k2180985n0359497l7229553l5276581l4791065
447C3798672k2125555R726549J9091129J1920761O078984j2563183n353592L6546230
455G7119995L9129997P255478m502365q873268r513527k858658M89495N517669K880532
$$ plain form
464 106645348 95988609 83178856 76762535 74352737 77801392 82938171 86500481 87616898
472 87616898 82315918 76635193 76602150 78275749 79884430 80947090 79761055 78219292 77830627
481 77830627 78044724 79404282 80138947 77847549 74965195 73260857 72331528 72467590 73357773 75271515
491 75271515 76756905 75654671 74356102 75177979 76184227 75903656 75258209 74693489 74167038 73807167
501 73807167 73546860 73304276 73252151 73709198 74155762 74126793 73776886 72884178 72112869 72292374 72704933
512 72704933 72909309 72905136 72391846 71828506 71624229 71628281 71970490 72217987 71787880 71259811 71121689
523 71121689 71065613 70865181 70763565 71064758 71359825 71206238 71008537 71069290 71251823 71644119 71874474
534 71874474 71392441 70822052 70680023 70737602 71042969 71281647 71041557 70663383 70344688 70102524
$$ packed form
464A06645348j0656739j2809753o416321k409798L448655N136779L562310J116417
472H7616898n300980n680725l3043J673599J608681J062660j186035j541763l88665
481G7830627K14097J359558P34665k291398k882354j704338r29329J36062Q90183J913742
491G5271515J485390j102234j298569Q21877J006248k80571o45447n64720n26451l59871
501G3807167k60307k42584n2125M57047M46564k8969l49907q92708p71309J79505M12559
512G2704933K04376m173n13290n63340k04277M052L42209K47497m30107n28069j38122
523G1121689n6076k00432j01616L01193K95067j53587j97701O0753J82533L92296K30355
534G1874474m82033n70389j42029N7579L05367K38678k40090l78174l18695k42164
$$ plain form
544 70102524 70097183 70096420 69802116 69572021 69807175 70079399 69973610 69851372 70055389 70227097 69949028
555 69949028 69740532 70182442 70672607 70770050 70571808 69886353 69138077 68748833 68534561 68478203 68500328
566 68500328 68459702 68524551 68907524 69334053 69542885 69706467 69923737 70153877 70381096 70628929 70907188
577 70907188 71241066 71728470 72161057 72238091 72334602 72885658 73410057 73488739 73370125 73099258 72867249
588 72867249 72968933 73138069 73114944 73174736 73621368 74108673 74373413 74470642 74263641 74064232 74188782
599 74188782 74486710 74967720 75467278 75782036 76038048 76332733 76548386 76516632 76486633 76743004 77010818
610 77010818 76977135 77040413 77674339 78340271 78545143 78625633 78740906 78930305 79396629 79808380 79843475
621 79843475 79676414 79278015 78936935 79078629 79263161 79095963 78866173 78688980 78691505 79176476 79732254
$$ packed form
544G0102524n341p63k94304k30095K35154K72224j05789j22238K04017J71708k78069
555F9949028k08496M41910M90165R7443j98242o85455p48276l89244k14272n6358K2125
566F8500328m0626O4849L82973M26529K08832J63582K17270K30140K27219K47833K78259
577G0907188L33878M87404M32587P7034R6511N51056N24399P8682j18614k70867k32009
588G2867249J01684J69136k3125N9792M46632M87305K64740R7229k07001j99409J24550
599G4188782K97928M81010M99558L14758K56012K94685K15653l1754k9999K56371K67814
610G7010818l3683O3278O33926O65932K04872Q0490J15273J89399M66324M11751L5095
621G9843475j67061l98399l41080J41694J84532j67198k29790j77193K525M84971N55778
$$ plain form
632 79732254 80017235 80123756 79992058 79736664 79406670 79138397 79158211 79244873 79192802 79181122 79385902
643 79385902 79610703 79653885 79707077 79954597 80216690 80379578 80429550 80306915 80035637 79482033 79059456
654 79059456 79343056 79713631 79617523 79433250 79383514 79382034 79441330 79487656 79506805 79332687 78495766
665 78495766 77892014 78630997 79602432 79997375 80021355 79378532 78763870 79011536 79408005 79435562 79340530
676 79340530 79208755 79003738 78668167 78350159 78205109 78153702 78155922 78249359 78479073 78782318 79165771
687 79165771 79466080 79438164 79333664 79316475 79404518 79757477 80113747 80202843 80211090 80287430 80273529 79950287
699 79950287 79648712 79666473 79884483 80372002 80861473 81078293 81112793 80898239 80630966 80514381 80460213
710 80460213 80455139 80477455 80518272 80525681 80418419 80275681 80162140 80039833 79867027 79719330 79686829
$$ packed form
632G9732254K84981J06521j31698k55394l29994k68273J9814Q6662n2071j1680K04780
643G9385902K24801M3182N3192K47520K62093J62888M9972j22635k71278n53604m22577
654G9059456K83600L70575r6108j84273m9736j480N9296M6326J9149j74118q36921
665G8495766o03752P38983R71435L94943K3980o42823o14662K47666L96469K7557r5032
676G9340530j31775k05017l35571l18008j45050n1407K220R3437K29714L03245L83453
687G9165771L00309k7916j04500j7189Q8043L52959L56270Q9096Q247P6340j3901l23242
699G9950287l01575J7761K18010M87519M89471K16820L4500k14554k67273j16585n4168
710H0460213n074K2316M0817P409j07262j42738j13541j22307j72806j47697l2501
$$ plain form
721 79686829 79684044 79657295 79601074 79485657 79329773 79164314 78922867 78471184 78043457 77859688 77828217
732 77828217 77975372 78167198 78224304 78309204 78610992 78870483 78848335 78673843 78341743 78016113 77896309
743 77896309 77871178 77941582 77970764 77760147 77495720 77305984 77164818 77101967 77078270 77068619 77060463 77019028
755 77019028 76985909 77001740 77034592 77047256 77096222 77261734 77435425 77506042 77562263 77700066 77785995 77692078
767 77692078 77497604 77195526 76916458 76856926 76811813 76606796 76345947 76089241 75794411 75411316 75023437
778 75023437 74713806 74433281 74165817 73895119 73594902 73278831 72929070 72613815 72429893 72273209
788 72273209 72067215 71825981 71528198 71203445 70917320 70540169 69889191 69189430 68651199 68135765
798 68135765 67554497 66967300 66397095 65866112 65404274 65011192 64747879 64459755 63916851 63405968
$$ packed form
721G9686829k785k6749n6221j15417j55884j65459k41447m51683m27727j83769l1471
732G7828217J47155J91826N7106Q4900L01788K59491k2148j74492l32100l25630j19804
743G7896309k5131P0404K9182k10617k64427j89736j41166o2851k3697r651q156m1435
755G7019028l3119J5831L2852J2664M8966J65512J73691P0617N6221J37803Q5929r3917
767G7692078j94474l02078k79068n9532m5113k05017k60849k56706k94830l83095l87879
778G5023437l09631k80525k67464k70698l00217l16071l49761l15255j83922j56684
788G2273209k05994k41234k97783l24753k86125l77151o50978o99761n38231n15434
798F8135765n81268n87197n70205n30983m61838l93082k63313k88124n42904n10883
$$ plain form
808 63405968 63141514 63110519 63541794 63924313 63706398 63238693 62660694 62053848 61585449 61137245
818 61137245 60674713 60113789 59298683 58409691 57599876 56795143 55941628 55131386 54430534 53862740
828 53862740 53505539 53263237 53078533 52913666 52702831 52472759 52182793 51969292 52023624 52139854
838 52139854 52151443 52131367 52090981 52048515 52021767 52023361 52066254 52167248 52367474 52606846 52838062 53063656
850 53063656 53268982 53457951 53628517 53783703 53920746 54054665 54215694 54355145 54418541 54453232 54486824
861 54486824 54523804 54555965 54648804 54873634 55204628 55679535 56178928 56585266 56930470 57198120 57415749
872 57415749 57604099 57766769 57927727 58046555 58079411 58060551 57980656 57926441 58031727 58145714 58114265
883 58114265 58080982 58132076 58285404 58649158 59038280 59251522 59445454 59740067 60043671 60323166 60522438
$$ packed form
808F3405968k64454l0995M31275L82519k17915m67705n77999o06846m68399m48204
818F1137245m62532n60924q15106q88992q09815q04733q53515q10242p00852n67794
828E3862740l57201k42302j84704j64867k10835k30072k89966k13501N4332J16230
838E2139854J1589k0076m0386m2466k6748J594M2893J00994K00226K39372K31216K25594
850E3063656K05326J88969J70566J55186J37043J33919J61029J39451O3396L4691L3592
861E4486824L6980L2161R2839K24830L30994M74907M99393M06338L45204K67650K17629
872E7415749J88350J62670J60958J18828L2856j8860p9895n4215J05286J13987l1449
883E8114265l3283N1094J53328L63754L89122K13242J93932K94613L03604K79495J99272
$$ plain form
894 60522438 60535957 60478664 60467529 60390926 60148167 59823227 59471153 59077953 58636520 58181046 57728363
905 57728363 57323311 57073284 56807400 56334541 55822754 55396915 54995132 54578377 54202915 53949619
915 53949619 53705311 53342510 52984978 52764893 52529312 52130985 51684975 51264618 50847553 50423527
925 50423527 50029518 49711464 49432064 49172234 48923134 48678303 48411488 48075630 47726368 47406242
935 47406242 47107460 46842911 46592758 46337273 46089005 45836353 45632004 45561146 45514606 45380402 45251991
946 45251991 45199226 45180630 45170189 45191193 45232750 45371223 45711517 46156979 46636749 47178223 47769093
957 47769093 48457291 49320175 50257088 51210808 52128265 52913330 53637672 54347515 55022930 55680893
967 55680893 56256630 56666183 56983902 57261444 57482552 57669903 57758213 57655907 57464409 57269478
$$ packed form
894F0522438J3519n7293j1135p6603k42759l24940l52074l93200m41433m55474m52683
905E7728363m05052k50027k65884m72859n11787m25839m01783m16755l75462k53296
915E3949619k44308l62801l57532k20085k35581l98327m46010m20357m17065m24026
925E0423527l94009l18054k79400k59830k49100k44831k66815l35858l49262l20126
935D7406242k98782k64549k50153k55485k48268k52652k04349p0858m6540j34204j28411
946D5251991n2765j8596j0441K1004M1557J38473L40294M45462M79770N41474N90870
957D7769093O88198Q62884R36913R53720R17457P85065P24342P09843O75415O57963
967E5680893N75737M09553L17719K77542K21108J87351Q8310j02306j91498j94931
$$ plain form
977 57269478 57026505 56703304 56348274 56008030 55655457 55267620 54878498 54529118 54175041 53756859
987 53756859 53360462 53062035 52831291 52674271 52557968 52441025 52354477 52321098 52324059 52354527 52410934
998 52410934 52489998 52588009 52708912 52826405 52935146 52976059 52867104 52671577 52409317 52128624 51871872
1009 51871872 51676559 51624443 51625084 51642704 51594879 51374481 51019646 50498867 49913860 49375629 48824764
1020 48824764 48214413 47617889 47115707 46639370 46159889 45639061 44976521 44329716 43850254 43455269
1030 43455269 43121574 42821621 42506577 42217064 41992401 41787361 41536831 41339447 41302944 41334892
1040 41334892 41373970 41434265 41513107 41599369 41691517 41757797 41766121 41715717 41585827 41404152 41168404 40947678
1052 40947678 40862347 40756012 40473007 40131332 39799427 39470146 39169003 38866402 38532784 38193512
$$ packed form
977E7269478k42973l23201l55030l40244l52573l87837l89122l49380l54077m18182
987E3756859l96397k98427k30744j57020j16303j16943q6548l3379K961L0468N6407
998E2410934P9064R8011J20903J17493J08741M0913j08955j95527k62260k80693k56752
1009E1871872j95313n2116O41J7620m7825k20398l54835n20779n85007n38231n50865
1020D8824764o10351n96524n02182m76337m79481n20828o62540o46805m79462l94985
1030D3455269l33695k99953l15044k89513k24663k05040k50530j97384l6503L1948
1040D1334892L9078O0295P8842Q6262R2148O6280Q324n0404j29890j81675k35748k20726
1052D0947678q5331j06335k83005l41675l31905l29281l01143l02601l33618l39272
$$ plain form
1062 38193512 37844131 37544395 37386013 37268543 37117481 36946465 36724876 36510872 36365200 36249256
1072 36249256 36173939 36051178 35763596 35409760 35056496 34681366 34246086 33864880 33702614 33569027
1082 33569027 33284473 32981728 32742645 32539986 32398033 32243992 31984615 31705475 31464338 31251192
1092 31251192 31090855 30936384 30723213 30528784 30427479 30363798 30300331 30257107 30251003 30253769 30234169
1103 30234169 30217743 30229401 30239677 30222464 30192352 30144047 30111074 30149412 30186295 30141068 30093025 30108093
1115 30108093 30145645 30181908 30232025 30316616 30395199 30417847 30433441 30497478 30540062 30473064 30406403 30447197
1127 30447197 30515362 30565643 30600452 30594563 30585384 30612707 30643963 30659294 30660080 30624985 30602287 30659199 30717564
1140 30717564 30701710 30671288 30660295 30669975 30711914 30788898 30908060 31067825 31263828 31511450 31842113
$$ packed form
1062C8193512l49381k99736j58382j17470j51062j71016k21589k14004j45672j15944
1072C6249256p5317j22761k87582l53836l53264l75130m35280l81206j62266j33587
1082C3569027k84554l02745k39083k02659j41953j54041k59377k79140k41137k13146
1092C1251192j60337j54471k13171j94429j01305o3681o3467m3224o104K766j9600
1103C0234169j6426J1658J0276j7213l0112m8305l2973L8338L6883m5227m8043J5068
1115C0108093L7552L6263N0117Q4591P8583K2648J5594O4037M2584o6998o6661M0794
1127C0447197O8165N0281L4809n889r179K7323L1256J5331P86l5095k2698N6912N8365
1140C0717564j5854l0422j0993R680M1939P6984J19162J59765J96003K47622L30663
$$ plain form
1151 31842113 32203102 32517578 32889320 33408047 34039070 34790947 35623596 36495876 37419556 38389061
1161 38389061 39415215 40516998 41664242 42840240 44023537 45197392 46330761 47378349 48366070
1170 48366070 49317337 50194122 50977707 51633263 52106262 52436783 52658485 52735924 52652336 52385330
1180 52385330 51860428 51216911 50522518 49917076 49555756 49460102 49731232 50285385 51097034 52092480
1190 52092480 53206680 54388119 55584908 56732895 57747269 58637978 59382034 59993385 60475685
1199 60475685 60836624 61074352 61220909 61313034 61334492 61287643 61153316 60913109 60566948 60077404 59537983
1210 59537983 59037663 58552383 58085941 57643486 57244778 56849766 56429314 55970097 55432034 54865982
1220 54865982 54313873 53762150 53218269 52660774 52075459 51448013 50744987 50009369 49281548 48535633
$$ packed form
1151C1842113L60989L14476L71742N18727O31023P51877Q32649Q72280R23680R69505
1161C8389061J026154J101783J147244J175998J183297J173855J133369J047588R87721
1170D8366070R51267Q76785P83585O55556M72999L30521K21702P7439q3588k67006
1180E2385330n24902o43517o94393o05442l61320r5654K71130N54153Q11649R95446
1190E2092480J114200J181439J196789J147987J014374Q90709P44056O11351M82300
1199F0475685L60939K37728J46557R2125K1458m6849j34327k40207l46161m89544n39421
1210E9537983n00320m85280m66442m42455l98708l95012m20452m59217n38063n66052
1220E4865982n52109n51723n43881n57495n85315o27446p03026p35618p27821p45915
$$ plain form
1230 48535633 47753906 46951984 46119072 45316673 44623138 43976997 43351936 42720558 42031956 41330360
1240 41330360 40623833 39969753 39469456 38999199 38405968 37878872 37595604 37437153 37316681 37315105
1250 37315105 37491058 37824463 38317608 38961937 39769318 40680717 41623520 42650318 43849659 45040989
1260 45040989 46051098 46946430 47729301 48418571 49048378 49575089 49961735 50222229 50349663 50369381
1270 50369381 50312351 50154781 49868393 49497269 49072910 48604797 48107483 47597122 47086311 46600319
1280 46600319 46177628 45791054 45417641 45082878 44819260 44582630 44325756 44090080 43906307 43759060
1290 43759060 43647171 43558575 43468903 43413925 43424179 43490814 43618702 43797134 44018600 44278381 44564175
1301 44564175 44891022 45255829 45700382 46293686 46951031 47601151 48272419 48981117 49691986 50388931
$$ packed form
1230D8535633p81727q01922q32912q02399o93535o46141o25061o31378o88602p01596
1240D1330360p06527o54080n00297m70257n93231n27096k83268j58451j20472j576
1250C7315105J75953L33405M93145O44329Q07381R11399R42803J026798J199341J191330
1260D5040989J010109Q95332P82871O89270O29807N26711L86646K60494J27434J9718
1270E0369381n7030j57570k86388l71124m24359m68113m97314n10361n10811m85992
1280D6600319m22691l86574l73413l34763k63618k36630k56874k35676j83773j47247
1290D3759060j11889q8596q9672n4978J0254O6635J27888J78432K21466K59781K85794
1301D4564175L26847L64807M44553N93304O57345O50120O71268P08698P10869O96945
$$ plain form
1311 50388931 51030731 51567913 52008797 52336456 52576996 52775574 52858116 52744507 52497818 52087830
1321 52087830 51714207 51596523 51644802 51854420 52188610 52625729 53115799 53597260 54083015 54569935
1331 54569935 55044510 55527733 55912613 56078293 56087135 56008411 55700397 55065273 54040573 52422737
1341 52422737 50536991 48582958 46733593 45214962 44067192 43472313 43230629 43211342 43389629
1350 43389629 43700123 44133522 44650291 45275475 46090199 46886539 47427105 47881222 48320007 48800350
1360 48800350 49458241 50127220 50686909 51134777 51341484 51566959 52146935 52724361 52996517 53135777
1370 53135777 53163673 53229786 53586052 53946899 54043102 54077435 54151989 54299618 54615738 55014610 55474998
1381 55474998 55898499 56085350 56318115 56860306 57569050 58480286 59321140 59766983 60008835 60031582
$$ packed form
1311E0388931O41800N37182M40884L27659K40540J98578Q2542j13609k46689m09988
1321E2087830l73623j17684M8279K09618L34190M37119M90070M81461M85755M86920
1331E4569935M74575M83223L84880J65680Q842p8724l08014o35124j024700j617836
1341E2422737j885746j954033j849365j518631j147770n94879k41684j9287J78287
1350D3389629L10494M33399N16769O25184Q14724P96340N40566M54117M38785M80343
1360D8800350O57891O68979N59689M47868K06707K25475N79976N77426K72156J39260
1370E3135777K7896O6113L56266L60847R6203L4333P4554J47629L16120L98872M60388
1381E5474998M23501J86851K32765N42191P08744R11236Q40854M45843K41852K2747
$$ plain form
1391 60031582 60128689 60759617 61411285 61595249 61696793 61983990 62319683 62729073 62993050 62717724
1401 62717724 62452625 62769222 63207626 63482666 63641666 63584328 63468170 63425922 63431549 63537003 63640930
1412 63640930 63638878 63591957 63461472 63442062 63755226 64281487 65178230 65836243 65381859 64765594 64893410
1423 64893410 65025139 64573982 63985466 63539577 63145901 62919998 62523674 61575554 60320427 58697605
1433 58697605 57241940 56717491 56375767 55652142 54759026 53623486 52536678 51880074 51309658 50570679
1443 50570679 49776577 48888062 48108505 47772743 47446823 46664406 45857452 45486164 44999481 43517040
1453 43517040 42486881 43655159 45247124 45915794 46123909 45791126 45199440 44434212 44004990 44783688
1463 44783688 45768188 46130989 46219872 46028233 45791389 45593716 45881104 47510147 49332905 50274872
$$ packed form
1391F0031582R7107O30928O51668J83964J01544K87197L35693M09390K63977k75326
1401F2717724k65099L16597M38404K75040J59000n7338j16158m2248N627J05454J03927
1412F3640930k052m6921j30485j9410L13164N26261Q96743O58013m54384o16265J27816
1423F4893410J31729m51157n88516m45889l93676k25903l96324r48120j255127j622822
1433E8697605j455665n24449l41724p23625q93116j135540j086808o56604n70416p38979
1443E0570679p94102q88515p79557l35762l25920p82417q06954l71288m86683j482441
1453D3517040j030159J168278J591965O68670K08115l32783n91686p65228m29222P78698
1463D4783688R84500L62801Q8883j91639k36844j97673K87388J629043J822758R41967
$$ plain form
1473 50274872 50972294 51752708 52467419 53074551 53581142 53944279 54271816 54738235 55100586 55061794
1483 55061794 54958702 55033611 55272820 55706833 56445026 57830383 59192562 59839104 60179375 60261559
1493 60261559 60476612 61511848 62526226 62804390 62656284 62194206 61295628 59795929 57933521
1502 57933521 55663967 53670979 53077007 52521179 50713135 48563480 46353222 44680740 44501377
1511 44501377 45024967 45498680 46765781 49949883 53456997 55762863 57781792 59926270 62177395
1520 62177395 65032646 67355156 67601845 67488792 68619347 69788429 70148445 70230171 70281792 70303535
1530 70303535 70286011 70506165 71624756 72480843 71643044 70583176 70384689 70781349 72254112 73644447
1540 73644447 73585106 73183205 73235893 73305679 73174095 72980881 72756531 72610306 72777031 72910332 72595505
$$ packed form
1473E0274872O97422P80414P14711O07132N06591L63137L27537M66419L62351l8792
1483E5061794j03092P4909K39209M34013P38193J385357J362179O46542L40271Q2184
1493F0261559K15053J035236J014378K78164j48106m62078q98578j499699j862408
1502E7933521k269554j992988n93972n55828j808044k149655k210258j672482j79363
1511D4501377N23590M73713J267101L184102L507114K305866K018929K144478K251125
1520F2177395K855251K322510K46689j13053J130555J169082L60016Q1726N1621K1743
1530G0303535j7524K20154J118591Q56087q37799j059868j98487L96660J472763J390335
1540G3644447n9341m01901N2688O9786j31584j93214k24350j46225J66725J33301l14827
$$ plain form
1551 72595505 72272255 72472023 72504852 71370079 70531227 71603943 73130943 74278381 74791214 73643730
1561 73643730 72314003 72309135 72516129 72151588 71733475 71520210 71506691 72016167 72321960 71542358
1571 71542358 70465515 69491508 68902710 69527695 70127777 69376373 68365356 67763565 67513275 67915848
1581 67915848 68562744 69122437 69665314 70170830 70580078 70804146 70912460 70948364 70901199 70753502
1591 70753502 70569061 70445183 70263863 69915581 69472031 68957207 68404602 67893311 67310265 66561295
1601 66561295 65668633 64583733 63424660 62229610 61189533 60507084 60185097 60353424 60833717
1610 60833717 61552834 62324810 62668205 63396049 65657188 67962669 69003105 69388603 69064377 68715668
1620 68715668 69233177 69945595 70501686 70831802 70547081 70253799 70654465 71071480 70970490 70624115
$$ packed form
1551G2595505l23250J99768L2829j134773q38852J072716J527000J147438N12833j147484
1561G3643730j329727m868K06994l64541m18113k13265j3519N09476L05793p79602
1571G1542358j076843r74007n88798O24985O00082p51404j011017o01791k50290M02573
1581F7915848O46896N59693N42877N05516M09248K24068J08314L5904m7165j47697
1591G0753502j84441j23878j81320l48282m43550n14824n52605n11291n83046p48970
1601F6561295q92662j084900j159073j195050j040077o82449l21987J68327M80293
1610F0833717P19117P71976L43395P27844K261139K305481J040436L85498l24226l48709
1620F8715668N17509P12418N56091L30116k84721k93282M00666M17015j00990l46375
$$ plain form
1630 70624115 70016266 69478676 69304466 69593094 70949509 72150185 71756508 71018387 70893600 70819733
1640 70819733 70485641 70095253 69587257 69446228 70502998 71657326 72052094 71788498 70065094 68732574
1650 68732574 70017479 71990753 73525215 74441406 73761414 72753456 72566483 72580124 72452881 72497009
1660 72497009 73080566 73694565 73897049 73855019 73435211 73096321 73382118 73904106 74606918 75034805
1670 75034805 74362518 73642899 73868011 74394920 75030708 75417328 74855042 74175735 74234299 74261787
1680 74261787 73277878 72771454 74700859 76677299 76394249 75563194 75237724 75084663 75247314 75349663
1690 75349663 74905182 74388695 74080566 74077675 74899223 75558708 74656609 73951172 75450493 77005341
1700 77005341 76667473 75841667 75291420 74992279 75387123 75837418 75694870 75431511 75368073 75310181
$$ packed form
1630G0624115o07849n37590j74210K88628J356415J200676l93677p38121j24787p3867
1640G0819733l34092l90388n07996j41029J056770J154328L94768k63596j723404j332520
1650F8732574J284905J973274J534462R16191o79992j007958j86973J3641j27243M4128
1660G2497009N83557O13999K02484m2030m19808l38890K85797N21988P02812M27887
1670G5034805o72287p19619K25112N26909O35788L86620n62286o79307N8564K7488
1680G4261787r83909n06424J929405J976440k83050q31055l25470j53061J62651J02349
1690G5349663m44481n16487l08129k891Q21548O59485r02099p05437J499321J554848
1700G7005341l37868q25806n50247k99141L94844M50295j42548k63359o3438n7892
$$ plain form
1710 75310181 75154305 74948479 74623611 74427559 74633911 75096344 75961563 76624008 76264832 75670433
1720 75670433 75426224 75316193 75372574 75435783 75303558 75135757 75052452 74970627 74875763 74682259 73988007
1731 73988007 73728058 75362823 76914124 76326797 75292015 74943947 74898293 75308136 75695374 75449249
1741 75449249 75120476 75178619 75256157 75047775 74836136 74828888 74945328 75209686 75514626 75826790 75948120
1752 75948120 75461487 74990463 75236725 75548553 75379776 75115273 74914459 74907539 75496864 76025459
1762 76025459 75757072 75331665 75209137 75193314 75297188 75352859 75010536 74828743 75533867 76272514
1772 76272514 76249077 76016525 75907776 75787064 75567841 75435257 75669266 75898766 75712273 75510811
1782 75510811 75650047 75854256 75966576 75986053 75822403 75586678 75260307 75141647 75754379 76403763
$$ packed form
1710G5310181j55876k05826l24868j96052K06352M62433Q65219O62445l59176n94399
1720G5670433k44209j10031N6381O3209j32225j67801q3305q1825r4864j93504o94252
1731G3988007k59949J634765J551301n87327j034782l48068m5654M09843L87238k46125
1741G5449249l28773N8143P7538k08382k11639p248J16440K64358L04940L12164J21330
1752G5948120m86633m71024K46262L11828j68777k64503k00814o920N89325N28595
1762G6025459k68387m25407j22528j5823J03874N5671l42323j81793P05124P38647
1772G6272514k3437k32552j08749j20712k19223j32584K34009K29500j86493k01462
1782G5510811J39236K04209J12320J9477j63650k35725l26371j18660O12732O49384
$$ plain form
1792 76403763 76431183 76251816 76048256 75859383 75794098 75824905 76000336 76200867 76326111 76367096 76232819
1803 76232819 76068787 76011398 75996872 75995110 76041267 76193527 76352600 76437447 76451447 76330734 76195648
1814 76195648 76171112 76179459 76180008 76186584 76231293 76218605 75955940 75766281 76054642 76382355 76363823 76244614
1826 76244614 76096939 76055237 76422974 76765060 76620224 76370308 76278999 76239349 76237251 76257614 76310822
1837 76310822 76306030 76112106 75860001 75543884 75442955 76080940 76718353 76593636 76296448 76222420 76191856
1848 76191856 76154686 76117371 76057243 76011612 76029373 76052879 76023956 75992874 76009415 76016594 75962021 75881454
1860 75881454 75792740 75697281 75602386 75507950 75371078 75327255 75593445 75882050 75947861 75880501 75629356
1871 75629356 75369812 75306274 75301025 75280617 75256516 75212219 75157974 75096771 75033783 74964859 74920845 74979546
$$ packed form
1792G6403763K7420j79367k03560j88873o5285L0807J75431K00531J25244M0985j34277
1803G6232819j64032n7389j4526j762M6157J52260J59073Q4847J4000j20713j35086
1814G6195648k4536Q347N49O576M4709j2688k62665j89659K88361L27713j8532j19209
1826G6244614j47675m1702L67737L42086j44836k49916r1309l9650k098K0363N3208
1837G6310822m792j93924k52105l16117j00929O37985O37413j24717k97188p4028l0564
1848G6191856l7170l7315o0128m5631J7761K3506k8923l1082J6541P179n4573q0567
1860G5881454q8714r5459r4895r4436j36872m3823K66190K88605O5811o7360k51145
1871G5629356k59544o3538n249k0408k4101m4297n4245o1203o2988o8924m4014N8701
$$ plain form
1883 74979546 74995682 74766449 74541977 74560806 74654984 74751640 74803993 74680450 74562576 74647049 74756859
1894 74756859 74754425 74718094 74694611 74641060 74498604 74361488 74331406 74327156 74303864 74254135 74127266 74008133
1906 74008133 73984818 73996689 74018074 74032043 74009941 73961189 73869179 73782967 73752380 73758408 73847412 73873070
1918 73873070 73605751 73341560 73379829 73481201 73488808 73454330 73362160 73257301 73199654 73128746 72978401
1929 72978401 72825478 72736526 72676178 72646263 72601440 72477249 72332886 72205162 72096725 72009781 71982338
1940 71982338 72108505 72221924 72123886 72005249 72040009 72079994 72001266 71904846 71864082 71837975 71803574
1951 71803574 71779892 71791649 71798874 71745255 71704506 71761513 71826431 71823051 71795181 71758034 71721146 71698212
1963 71698212 71691803 71708038 71749901 71846939 71925446 71895531 71835327 71789528 71768448 71814438 71876053 71914818
$$ packed form
1883G4979546J6136k29233k24472J8829R4178R6656N2353j23543j17874Q4473J09810
1894G4756859k434l6331k3483n3551j42456j37116l0082m250k3292m9729j26869j19133
1906G4008133k3315J1871K1385J3969k2102m8752r2010q6212l0587O028Q9004K5658
1918G3873070k67319k64191L8269J01372P607l4478r2170j04859n7647p0908j50345
1929G2978401j52923q8952o0348k9915m4823j24191j44363j27724j08437q6944k7443
1940G1982338J26167J13419r8038j18637L4760L9985p8728r6420m0764k6107l4401
1951G1803574k3682J1757P225n3619m0749N7007O4918l380k7870l7147l6888k2934
1963G1698212o409J6235M1863R7038P8507k9915o0204m5799k1080M5990O1615L8765
$$ plain form
1975 71914818 71934105 71903870 71885635 71957756 72039627 72064659 72069168 72056320 72058746 72135948 72210480 72195435
1987 72195435 72178558 72227356 72315430 72464226 72597527 72612259 72610451 72681168 72759819 72794937 72836235 72931000
1999 72931000 73034981 73122360 73184708 73178055 73183083 73305847 73426247 73424721 73405411 73444153 73506020 73591637
2011 73591637 73669907 73689148 73711731 73796150 73902321 74019478 74117950 74147057 74158859 74197075 74235748 74262497
2023 74262497 74279953 74288727 74282333 74238441 74205017 74229691 74290848 74410370 74505257 74464348 74393723 74377296
2035 74377296 74370193 74341560 74333046 74399277 74470230 74491524 74470779 74364639 74271484 74310013 74375870 74395348
2047 74395348 74395157 74363708 74341896 74381950 74438263 74481079 74514961 74535873 74539734 74511932 74479820 74467896 74470047
2060 74470047 74488136 74522568 74593880 74643257 74590179 74520302 74511337 74506424 74460175 74415710 74408195 74415924 74434158
$$ packed form
1975G1914818J9287l0235j8235P2121Q1871K5032M509j2848K426P7202P4532j5045
1987G2195435j6877M8798Q8074J48796J33301J4732j808P0717P8651L5118M1298R4765
1999G2931000J03981Q7379O2348o653N028J22764J20400j526j9310L8742O1867Q5617
2011G3591637P8270J9241K2583Q4419J06171J17157R8472K9107J1802L8216L8673K6749
2023G4262497J7456Q774o394m3892l3424K4674O1157J19522R4887m0909p0625j6427
2035G4377296p103k8633q514O6231P0953K1294k0745j06140r3155L8529O5857J9478
2047G4395348j91l1449k1812M0054N6313M2816L3882K0912L861k7802l2112j1924K151
2060G4470047J8089L4432P1312M9377n3078o9877q965m913m6249m4465p515P729J8234
$$ plain form
2073 74434158 74446869 74426651 74402641 74403191 74403236 74381783 74354675 74333282 74309944 74277283 74245522 74225471 74207878
2086 74207878 74187065 74162933 74126198 74098564 74111488 74126366 74100471 74077293 74088837 74126671 74211411 74287842
2098 74287842 74296143 74270721 74215317 74162125 74158524 74162605 74138000 74115417 74115135 74132034 74180199 74222328 74213882
2111 74213882 74190453 74175552 74160431 74139473 74126556 74138283 74160477 74191833 74210098 74182251 74139236 74090218
2123 74090218 74067261 74130058 74204544 74224518 74226021 74225830 74215271 74189926 74153542 74086807 74054459 74154305 74267769
2136 74267769 74304222 74277260 74132683 73983170 73941422 73952934 74012611 74084663 74132492 74153427 74121048 74069931
2148 74069931 74020027 73988770 74012085 74054359 74095871 74124695 74111580 74088791 74081512 74081375 74093918 74102188 74075249
2161 74075249 74060486 74114609 74178574 74207642 74215508 74189735 74163727 74177528 74198601 74200180 74204727 74225235 74263237
$$ packed form
2073G4434158J2711k0218k4010N50M5k1453k7108k1393k3338l2661l1761k0051j7593
2086G4207878k0813k4132l6735k7634J2924J4878k5895k3178J1544L7834Q4740P6431
2098G4287842Q301k5422n5404n3192l601M081k4605k2583k82J6899M8165M2129q446
2111G4213882k3429j4901j5121k0958j2917J1727K2194L1356J8265k7847m3015m9018
2123G4090218k2957O2797P4486J9974J503j91j0559k5345l6384o6735l2348R9846J13464
2136G4267769L6453k6962j44577j49513m1748J1512N9677P2052M7829K0935l2379n1117
2148G4069931m9904l1257K3315M2274M1512K8824j3115k2789p279j37J2543Q270k6939
2161G4075249j4763N4123O3965K9068P866k5773k6008J3801K1073J579M547K0508L8002
$$ plain form
2174 74263237 74343895 74409149 74385002 74344109 74343750 74356079 74375793 74392410 74385620 74379349 74398422 74419716 74425102
2187 74425102 74424072 74420639 74413063 74388412 74384048 74454948 74535156 74570015 74580383 74559044 74535301 74551270 74561218
2200 74561218 74517700 74467514 74445389 74439766 74456169 74478027 74487114 74493881 74509766 74513603 74474907 74432899 74420044
2213 74420044 74426102 74459076 74496437 74514030 74524498 74540588 74537468 74471260 74411537 74435402 74476334 74493935
2225 74493935 74486633 74420502 74352005 74335266 74343155 74370644 74405334 74434494 74453758 74446465 74436569 74445389 74464012
2238 74464012 74501656 74524948 74489784 74437241 74390289 74358917 74365471 74395752 74456551 74506996 74498131 74460793
2250 74460793 74401619 74344131 74316116 74311256 74347069 74379753 74356750 74321892 74298431 74295380 74339554 74400475
2262 74400475 74461411 74507668 74516510 74495148 74420593 74360344 74397682 74462105 74511650 74543617 74523994 74504593
$$ packed form
2174G4263237Q0658O5254k4147m0893l59J2329J9714J6617o790o271J9073K1294N386
2187G4425102j030l433p576k4651m364P0900Q0208L4859J0368k1339k3743J5969R948
2200G4561218m3518n0186k2125n623J6403K1858R087O767J5885L837l8696m2008j2855
2213G4420044O058L2974L7361J7593J0468J6090l120o6208n9723K3865M0932J7601
2225G4493935p302o6131o8497j6739P889K7489L4690K9160J9264p293r896Q820J8623
2238G4464012L7644K3292l5164n2543m6952l1372O554L0281O0799N0445q865l7338
2250G4460793n9174n7488k8015m860L5813L2684k3003l4858k3461l051M4174O0921
2262G4400475O0936M6257Q842k1362p4555o0249L7338O4423M9545L1967j9623j9401
$$ plain form
2274 74504593 74542854 74587753 74601982 74601578 74591637 74567368 74517250 74466347 74434853 74425674 74463676 74502899 74496719
2287 74496719 74471901 74434753 74399734 74385544 74385689 74402908 74427917 74455070 74476028 74475952 74468567 74468300 74457863 74420403
2301 74420403 74368813 74308754 74244644 74175117 74123024 74119904 74138191 74167015 74187729 74172737 74138000 74081017
2313 74081017 74029587 74017570 74024055 74042084 74063515 74070862 74085144 74140312 74180008 74140480 74077797 74006866
2325 74006866 73987457 74120163 74297310 74455307 74562454 74541901 74465324 74338913 74282265 74500397 74743034
2336 74743034 74767326 74755768 74807312 74929550 75162598 75507690 76105621 76577736 76596214 76149323 74849251
2347 74849251 73496178 72865341 72643616 72875740 73263191 73441055 73652908 74117134 74544502 74627731
2357 74627731 74639153 74774460 74955963 75168396 75419975 75759338 76049896 76117393 76123497 76181198 76261971
$$ packed form
2274G4504593L8261M4899J4229m04r941k4269n0118n0903l1494r179L8002L9223o180
2287G4496719k4818l7148l5019j4190J45J7219K5009K7153K0958p6p385k67j0437l7460
2301G4420403n1590o0059o4110o9527n2093l120J8287K8824K0714j4992l4737n6983
2313G4081017n1430j2017O485J8029K1431P347J4282N5168L9696l9528o2683p0931
2325G4006866j9409J32706J77147J57997J07147k0553p6577j26411n6648K18132K42637
2336G4743034K4292j1558N1544J22238K33048L45092N97931M72115J8478m46891j300072
2347G4849251j353073o30837k21725K32124L87451J77864K11853M64226M27368Q3229
2357G4627731J1422J35307J81503K12433K51579L39363K90558O7497O104N7701Q0773
$$ plain form
2368 76261971 76400848 76520111 76545975 76501587 76370171 76197578 76003906 75849533 75849983 75859787 75740173
2379 75740173 75586510 75447777 75324249 75240326 75172493 75106834 75038788 74940132 74867699 74888611 74943634
2390 74943634 75004387 75045395 75013542 74963257 74928352 74917557 74969627 75028107 75040413 75033691 75018456 74991821
2402 74991821 74948380 74906013 74882744 74872635 74875664 74892113 74930099 74966095 74978493 74969460 74925400 74871895
2414 74871895 74828697 74799683 74803230 74815346 74820641 74811363 74756714 74710175 74733040 74770760 74787476 74788071 74749969
2427 74749969 74719643 74762634 74798843 74738930 74675987 74691864 74730682 74761703 74791313 74820091 74834564 74813225
2439 74813225 74780586 74757767 74733231 74691818 74665306 74692627 74736855 74775574 74803833 74803635 74791428 74773048
2451 74773048 74762276 74787926 74810600 74789879 74757408 74732948 74711540 74696663 74682785 74665878 74644760 74606537
$$ packed form
2368G6261971J38877J19263K5864m4388j31416j72593j93672j54373M50R804j19614
2379G5740173j53663j38733j23528q3923o7833o5659o8046r8656p2433K0912N5023
2390G4943634O0753M1008l1853n0285l4905j0795N2070N8480J2306o722j5235k6635
2402G4991821m3441m2367k3269j0109L029J6449L7986L5996J2398r033m4060n3505
2414G4871895m3198k9014L547J2116N295r278n4649m6539K2865L7720J6716N95l8102
2427G4749969l0326M2991L6209n9913o2943J5877L8818L1021K9610K8778J4473k1339
2439G4813225l2639k2819k4536m1413k6512K7321M4228L8719K8259j98j2207j8380
2451G4773048j0772K5650K2674k0721l2471k4460k1408j4877j3878j6907k1118l8223
$$ plain form
2463 74606537 74582268 74617790 74655533 74639633 74610542 74595024 74578217 74550865 74522659 74496750 74483345 74504402
2475 74504402 74527809 74526123 74507019 74456314 74412132 74428848 74443344 74389313 74330734 74322441 74325249 74315620 74301529
2488 74301529 74288559 74260139 74176003 74112556 74166557 74236488 74237801 74216293 74173523 74157379 74252106 74349930
2500 74349930 74345993 74315552 74303909 74295784 74298500 74289154 74233055 74172806 74146416 74132919 74120567 74119446 74138168
2513 74138168 74169205 74211479 74253990 74288269 74305367 74294113 74252441 74156998 74060371 74019051 73997566 73974350
2525 73974350 73963974 73977020 74003891 74045418 74080681 74084564 74070168 74034431 74000313 73997757 74002670 73996208 73992226
2538 73992226 74000977 74014305 74035576 74040199 73980286 73929146 73970840 74025177 74031570 74015137 73970650 73928329 73927879
2551 73927879 73935555 73922417 73913643 73935936 73955559 73942856 73912308 73864769 73811340 73757103 73720810 73732117
$$ packed form
2463G4606537k4269L5522L7743j5900k9091j5518j6807k7352k8206k5909j3405K1057
2475G4504402K3407j686j9104n0705m4182J6716J4496n4031n8579q293K808r629j4091
2488G4301529j2970k8420q4136o3447N4001O9931J313k1508m2770j6144R4727R7824
2500G4349930l937l0441j1643q125K716r346n6099o0249k6390j3497j2352j121J8722
2513G4138168L1037M2274M2511L4279J7098j1254m1672r5443r6627m1320k1485k3216
2525G3974350j0376J3046K6871M1527L5263L883j4396l5737l4118k556M913o462l982
2538G3992226Q751J3328K1271M623n9913n1140M1694N4337O393j6433m4487m2321m50
2551G3927879P676j3138q774K2293J9623j2703l0548m7539n3429n4237l6293J1307
$$ plain form
2563 73732117 73763130 73806381 73830345 73784378 73718094 73664497 73622467 73613235 73602486 73545624 73494675 73501060
2575 73501060 73521950 73529053 73529984 73522377 73507523 73488281 73457382 73398659 73341515 73321602 73303627 73262474 73203041
2588 73203041 73101547 73018715 73021790 73067215 73144485 73221298 73262405 73265930 73194145 73119286 73115250 73139214
2600 73139214 73178391 73216461 73235962 73227524 73156425 73080948 73063683 73056725 73023537 72992393 72975945 72984505 73053146
2613 73053146 73120163 73118210 73099136 73093964 73097778 73126030 73148636 73130295 73101974 73085663 73072815 73060699 73053787
2626 73053787 73058868 73066208 73070885 73065308 73030212 72995712 72990273 72999359 73028496 73045708 73007057 72953941 72915459
2639 72915459 72884224 72860023 72850105 72872398 72894600 72880173 72859451 72857689 72853279 72830986 72796677 72746567 72694229
2652 72694229 72653008 72619698 72599007 72580360 72558403 72521927 72444679 72366211 72327065 72297958 72263695 72222328
$$ packed form
2563G3732117L1013M3251K3964m5967o6284n3597m2030r232j0749n6862n0949O385
2575G3501060K0890P103R31p607j4854j9242l0899n8723n7144j9913j7975m1153n9433
2588G3203041j01494q2832L075M5425P7270P6813M1107L525p1785p4859m036K3964
2600G3139214L9177L8070J9501q438p1099p5477j7265o958l3188l1144j6448Q560O8641
2613G3053146O7017j953j9074n172L814K8252K2606j8341k8321j6311j2848j2116o912
2626G3053787N081P340M677n577l5096l4500n439R086K9137J7212l8651n3116l8482
2639G2915459l1235k4201r918K2293K2202j4427k0722j762m410k2293l4309n0110n2338
2652G2694229m1221l3310k0691j8647k1957l6476p7248p8468l9146k9107l4263m1367
$$ plain form
2664 72222328 72158073 72097015 72080231 72046593 71928146 71786453 71666077 71550034 71445251 71324280 71144150
2675 71144150 70958183 70820663 70685623 70517204 70339226 70171738 69990089 69768074 69530060 69290901
2685 69290901 69052933 68817474 68602394 68441772 68288017 68084572 67892433 67771339 67668106 67544411
2695 67544411 67415283 67280197 67147354 67025566 66912415 66812042 66713455 66594437 66492798 66468666
2705 66468666 66432739 66289093 66117500 65967369 65833664 65742157 65649864 65507004 65359566 65244080 65138985
2716 65138985 65035820 64931633 64821075 64702751 64562515 64433197 64351913 64291641 64235184 64190102 64172272
2727 64172272 64139465 64033699 63917850 63843845 63786339 63731503 63696598 63709618 63724400 63689423 63648487 63634132
2739 63634132 63628460 63622498 63621902 63632225 63644527 63652706 63653446 63628292 63616325 63681293 63730644 63660240 63568306
$$ packed form
2664G2222328o4255o1058j6784l3638j18447j41693j20376j16043j04783j20971j80130
2675G1144150j85967j37520j35040j68419j77978j67488j81649k22015k38014k39159
2685F9290901k37968k35459k15080j60622j53755k03445j92139j21094j03233j23695
2695F7544411j29128j35086j32843j21788j13151j00373r8587j19018j01639k4132
2705F6468666l5927j43646j71593j50131j33705r1507r2293j42860j47438j15486j05095
2716F5138985j03165j04187j10558j18324j40236j29318q1284o0272n6457m5082j7830
2727F4172272l2807j05766j15849p4005n7506n4836l4905J3020J4782l4977m0936j4355
2739F3634132n672n962n96J0323J2302Q179P40k5154j1967O4968M9351p0404r1934
$$ plain form
2752 63568306 63525963 63510109 63544128 63559437 63475418 63351513 63213707 63081669 62999390 62919926 62805031
2763 62805031 62672424 62516403 62368629 62275146 62187077 62062050 61926556 61802696 61661003 61468552
2773 61468552 61257698 61047745 60844612 60664059 60495495 60334541 60178139 60025692 59865334 59676193
2783 59676193 59484482 59315445 59151054 58985352 58807327 58592533 58375263 58200264 58011532 57747650
2793 57747650 57469463 57222748 56990982 56769920 56568527 56410694 56247307 56031109 55780174 55482719
2803 55482719 55180740 54921127 54677273 54437782 54203751 53976822 53743671 53485847 53220295 52955460
2813 52955460 52698421 52466156 52237366 51991104 51743221 51506783 51268959 51013016 50763416 50553848
2823 50553848 50339890 50084591 49799229 49473095 49135185 48818707 48500229 48169064 47819901 47441124
$$ packed form
2752F3568306m2343j5854L4019J5309q4019j23905j37806j32038q2279p9464j14895
2763F2805031j32607j56021j47774r3483q8069j25027j35494j23860j41693j92451
2773F1468552k10854k09953k03133j80553j68564j60954j56402j52447j60358j89141
2783E9676193j91711j69037j64391j65702j78025k14794k17270j74999j88732k63882
2793E7747650k78187k46715k31766k21062k01393j57833j63387k16198k50935k97455
2803E5482719l01979k59613k43854k39491k34031k26929k33151k57824k65552k64835
2813E2955460k57039k32265k28790k46262k47883k36438k37824k55943k49600k09568
2823E0553848k13958k55299k85362l26134l37910l16478l18478l31165l49163l78777
$$ plain form
2833 47441124 47040630 46619797 46186184 45744610 45304394 44874214 44460583 44076275 43710922 43362808
2843 43362808 43018677 42656754 42300842 41963673 41656662 41404320 41179943 40964245 40759491 40559673
2853 40559673 40370033 40195156 40031029 39870571 39727448 39615990 39527107 39459919 39403915 39339279 39293026
2864 39293026 39302299 39316704 39285706 39246704 39207767 39206051 39309166 39433693 39507439 39564014 39605667 39654160
2876 39654160 39742493 39838982 39924957 39994286 40023540 40045834 40094830 40145374 40176056 40209270 40264965 40328812
2888 40328812 40391087 40457870 40539787 40613483 40656235 40676617 40665699 40653038 40678001 40701962 40689682 40670227
2900 40670227 40651085 40661407 40760540 40865326 40895176 40901398 40908741 40916229 40929771 40953300 41006111 41047932
2912 41047932 41024612 40996838 41011547 41055656 41140892 41239643 41332626 41406609 41422581 41438530 41518665 41605042
$$ packed form
2833D7441124m00494m20833m33613m41574m40216m30180m13631l84308l65353l48114
2843D3362808l44131l61923l55912l37169l07011k52342k24377k15698k04754j99818
2853D0559673j89640j74877j64127j60458j43123j11458q8883o7188n6004o4636m6253
2864C9293026R273J4405l0998l9002l8937j716J03115J24527P3746N6575M1653M8493
2876C9654160Q8333R6489Q5975O9329K9254K2294M8996N0544L0682L3214N5695O3847
2888D0328812O2275O6783Q1917P3696M2752K0382j0918j2661K4963K3961j2280j9455
2900D0670227j9142J0322R9133J04786K9850O222P343P488J3542K3529N2811M1821
2912D1047932k3320k7774J4709M4109Q5236R8751R2983P3983J5972J5949Q0135Q6377
$$ plain form
2924 41605042 41658020 41686676 41671680 41658546 41690327 41754959 41871429 41989471 42052197 42098309 42143559 42199898
2936 42199898 42298054 42397331 42465042 42507721 42504597 42504669 42571404 42640472 42649364 42655872 42710041 42772484 42814682
2949 42814682 42853973 42895794 42947197 43025089 43105080 43143867 43214989 43393852 43631149 43903900 44208241
2960 44208241 44533707 44876934 45230579 45595860 45963715 46357655 46802975 47285007 47794678 48340298
2970 48340298 48929119 49555206 50224922 50908424 51570129 52233337 52897499 53598236 54393028 55215454
2980 55215454 56028534 56801201 57461906 58094810 58786892 59457851 60041714 60582352 61100483 61599396
2990 61599396 62099838 62570145 62976170 63345764 63695408 64025070 64346695 64640762 64880661 65099335
3000 65099335 65320946 65545059 65792229 66023544 66188194 66342422 66535233 66737488 66939285 67131828
$$ packed form
2924D1605042N2978K8656j4996j3134L1781O4632J16470J18042O2726M6112M5250N6339
2936D2199898R8156R9277O7711M2679l124P2O6735O9068Q892O508N4169O2443M2198
2949D2814682L9291M1821N1403P7892P9991L8787P1122J78863K37297K72751L04341
2960D4208241L25466L43227L53645L65281L67855L93940M45320M82032N09671N45620
2970D8340298N88821O26087O69716O83502O61705O63208O64162P00737P94792Q22426
2980E5215454Q13080P72667O60705O32904O92082O70959N83863N40638N18131M98913
2990F1599396N00442M70307M06025L69594L49644L29662L21625K94067K39899K18674
3000F5099335K21611K24113K47170K31315J64650J54228J92811K02255K01797J92543
$$ plain form
3010 67131828 67301178 67452599 67579910 67703484 67852493 67994049 68099953 68185188 68253998 68310165 68363022
3021 68363022 68400146 68407013 68399025 68391228 68369888 68321777 68260361 68196037 68124603 68034599 67958000 67938232 67929413
3034 67929413 67886993 67850235 67837166 67866608 67988113 68127296 68209717 68284988 68382050 68488457 68620491
3045 68620491 68720795 68712021 68670341 68646385 68639496 68677139 68725464 68749001 68779968 68855263 68925140 68940643
3057 68940643 68936180 68921402 68921570 68968491 69051956 69185616 69329430 69439651 69541077 69645264 69748070
3068 69748070 69856575 69948433 69986961 70022133 70101860 70195602 70291138 70381256 70451096 70511101 70565483 70617966
3080 70617966 70682213 70732307 70728516 70725822 70781540 70848633 70899872 70933006 70921181 70910736 70959831 71006035
3092 71006035 70993279 70960449 70916130 70895027 70960045 71035172 71055054 71050476 71011734 70994781 71069809 71184067
$$ packed form
3010F7131828J69350J51421J27311J23574J49009J41556J05904Q5235O8810N6167N2857
3021F8363022L7124O867p988p797k1340m8111o1416o4324p1434r0004p6599j9768q819
3034F7929413m2420l6758j3069K9442J21505J39183Q2421P5271R7062J06407J32034
3045F8620491J00304q774m1680k3956o889L7643M8325K3537L0967P5295O9877J5503
3057F8940643m463j4778J68M6921Q3465J33660J43814J10221J01426J04187J02806
3068F9748070J08505R1858L8528L5172P9727R3742R5536R0118O9840O0005N4382N2483
3080G0617966O4247N0094l791k694N5718O7093N1239L3134j1825j0445M9095M6204
3092G1006035j2756l2830m4319k1103O5018P5127J9882m578l8742j6953P5028J14258
$$ plain form
3104 71184067 71327736 71442123 71436218 71397110 71389053 71389534 71392990 71412613 71480537 71534325 71503067 71444199 71388123
3117 71388123 71345070 71343445 71358871 71377731 71395943 71402382 71404243 71397827 71404457 71453598 71516777 71575142 71629097
3130 71629097 71683929 71705963 71638611 71555801 71523834 71509003 71494225 71495750 71530678 71579384 71633438 71676300
3142 71676300 71676781 71670273 71694206 71711182 71683884 71649315 71646881 71631836 71547935 71468712 71464180 71488480 71522926
3155 71522926 71555901 71569229 71563866 71526382 71481728 71447441 71432259 71457718 71502808 71563316 71610023 71599892
3167 71599892 71570038 71540497 71519257 71533226 71545624 71518158 71482086 71457718 71439484 71429085 71424820 71419235
3179 71419235 71431137 71499344 71555923 71524284 71469025 71433090 71404793 71389076 71378685 71363235 71356895 71379517
3191 71379517 71403435 71404266 71391586 71358994 71329712 71335724 71344139 71334290 71301392 71214821 71131203 71105217 71111916
$$ packed form
3104G1184067J43669J14387n905l9108q057M81L456J9623O7924N3788l1258n8868n6076
3117G1388123m3053j625J5426J8860J8212O439J861o416O630M9141O3179N8365N3955
3130G1629097N4832K2034o7352q2810l1967j4831j4778J525L4928M8706N4054M2862
3142G1676300M81o508K3933J6976k7298l4569k434j5045q3901p9223m532K4300L4446
3155G1522926L2975J3328n363l7484m4654l4287j5182K5459M5090O0508M6707j0131
3167G1599892k9854k9541k1240J3969J2398k7466l6072k4368j8234j0399m265n585
3179G1419235J1902O8207N6579l1639n5259l5935k8297j5717j0391j5450o340K2622
3191G1379517K3918Q31j2680l2592k9282O012Q415r849l2898q6571q3618k5986O699
$$ plain form
3204 71111916 71157387 71203018 71201851 71184967 71166374 71150040 71143532 71149994 71191788 71218750 71167564 71099899 71057869
3217 71057869 71036530 71054146 71082901 71100113 71108269 71102478 71082047 71039291 70990227 70949341 70913246 70880745
3229 70880745 70859459 70864845 70871880 70859459 70830917 70768120 70714142 70723984 70743584 70727776 70704674 70688156 70675659
3242 70675659 70671776 70668839 70656082 70647263 70662903 70671890 70624779 70597076 70699455 70776871 70658157 70502045
3254 70502045 70423698 70382240 70390366 70402336 70361473 70313217 70284035 70273880 70309044 70336792 70288635 70237877
3266 70237877 70247505 70279930 70330070 70363281 70327782 70269821 70223526 70173218 70103363 70047523 70049690 70062927
3278 70062927 70053101 70025612 69958138 69899704 69910576 69934319 69929527 69911171 69872047 69837067 69836166 69846794 69853523
3291 69853523 69864914 69892975 69911835 69895744 69856171 69774437 69714996 69779350 69837379 69754883 69645622 69589188
$$ packed form
3204G1111916M5471M5631j167j6884j8593j6334o508O462M1794K6962n1186o7665m2030
3217G1057869k1339J7616K8755J7212Q156n791k0431m2756m9064m0886l6095l2501
3229G0880745k1286N386P035j2421k8542o2797n3978R842J9600j5808k3102j6518j2497
3242G0675659l883k937j2757q819J5640Q987m7111k7703J02379P7416j18714j56112
3254G0502045p8347m1458Q126J1970m0863m8256k9182j0155L5164K7748m8157n0758
3266G0237877R628L2425N0140L3211l5499n7961m6295n0308o9855n5840K167J3237
3278G0062927r826k7489o7474n8434J0872K3743m792j8356l9124l4980r01J0628O729
3291F9853523J1391K8061J8860j6091l9573q1734n9441O4354N8029q2496j09261n6434
$$ plain form
3303 69589188 69553444 69535324 69527145 69521645 69514229 69491028 69472382 69486046 69495605 69468185 69420937 69341187 69285347
3316 69285347 69345116 69401741 69340469 69240807 69138718 69049881 69015167 68994858 68959358 68919037 68867233 68825409
3328 68825409 68820122 68829514 68857430 68853065 68732765 68598846 68543198 68513199 68486496 68464233 68437317 68413902
3340 68413902 68411301 68392799 68313889 68215012 68117119 68033958 68003342 67973923 67890381 67802406 67755554 67706589
3352 67706589 67603592 67517761 67529823 67559074 67541573 67507698 67462799 67417816 67392136 67365646 67316864 67269089
3364 67269089 67247345 67224739 67184090 67121246 67003441 66899231 66898849 66904327 66826965 66729065 66644981 66569809
3376 66569809 66512154 66465805 66428307 66396881 66376282 66341377 66247871 66157722 66139267 66129013 66072037 66010689
3388 66010689 65975426 65946793 65914108 65881180 65856697 65815163 65717888 65613083 65539619 65486504 65466263 65447067
$$ packed form
3303F9589188l5744j8120q179n500p416k3201j8646J3664R559k7420m7248p9750n5840
3316F9285347N9769N6625o1272r9662j02089q8837l4714k0309l5500m0321n1804m1824
3328F8825409n287R392K7916m365j20300j33919n5648k9999k6703k2263k6916k3415
3340F8413902k601j8502p8910r8877r7893q3161l0616k9419q3542q7975m6852m8965
3352F7706589j02997q5831J2062K9251j7501l3875m4899m4983k5680k6490m8782m7775
3364F7269089k1744k2606m0649o2844j17805j04210l82N478p7362r7900q4084p5172
3376F6569809n7655m6349l7498l1426k0599l4905r3506r0149j8455j0254n6976o1348
3388F6010689l5263k8633l2685l2928k4483m1534r7275j04805p3464n3115k0241j9196
$$ plain form
3400 65447067 65390274 65328743 65300842 65251373 65098785 64960266 64959381 64995148 65004257 64997192 64964584 64902618
3412 64902618 64787003 64669655 64604973 64561058 64525131 64493919 64463852 64423058 64355347 64269829 64165024
3423 64165024 64056183 63953876 63870502 63833260 63808205 63768410 63719894 63652397 63587761 63555672 63522293 63456989
3435 63456989 63379574 63291836 63217209 63195110 63179111 63127373 63065266 63001106 62944149 62911343 62887909 62878132
3447 62878132 62841751 62716866 62572670 62459087 62371658 62334656 62311672 62267971 62222672 62178757 62149765
3458 62149765 62174393 62179970 62069847 61954498 61938240 61942577 61915684 61881565 61856987 61811684 61687134 61584900
3470 61584900 61627865 61693455 61688137 61647343 61564209 61471821 61394165 61351631 61394978 61457085 61491348 61486671
3482 61486671 61377335 61280418 61333893 61409332 61411621 61378624 61295010 61225010 61245823 61302948 61382389 61439705
$$ packed form
3400F5447067n6793o1531k7901m9469j52588j38519q85L5767R109p065l2608o1966
3412F4902618j15615j17348o4682m3915l5927l1212l0067m0794o7711q5518j04805
3423F4165024j08841j02307q3374l7242k5055l9795m8516o7497o4636l2089l3379o5304
3435F3456989p7415q7738p4627k2099j5999n1738o2107o4160n6957l2806k3434r777
3447F2878132l6381j24885j44196j13583q7429l7002k2984m3701m5299m3915k8992
3458F2149765K4628N577j10123j15349j6258M337k6893l4119k4578m5303j24550j02234
3470F1584900M2965O5590n318m0794q3134r2388p7656m2534M3347O2107L4263m677
3482F1486671j09336r6917N3475P5439K289l2997q3614p0000K0813N7125P9441N7316
$$ plain form
3494 61439705 61404800 61340546 61271477 61242390 61337208 61462856 61548828 61611320 61628319 61643791 61699677 61780022
3506 61780022 61900139 62007832 62031891 62044453 62122059 62180115 62128304 62060047 62046814 62063885 62117100 62186123
3518 62186123 62237240 62316059 62487007 62659813 62741924 62804626 62897587 62992931 63083984 63156773 63182831 63198898
3530 63198898 63220406 63282608 63462162 63650059 63752197 63800385 63766766 63735985 63793541 63908981 64092514
3541 64092514 64307426 64537521 64731285 64806839 64838982 64861366 64915276 65085693 65274788 65421440 65500191
3552 65500191 65425323 65316269 65271545 65267944 65347527 65412758 65345047 65249443 65152237 65171097 65469238 65935921
3564 65935921 66650131 67205811 67052605 66702202 66517662 66394516 66362381 66381882 66435265 66487030 66483284
3575 66483284 66461418 66453171 66421417 66321327 66207672 66083168 66059090 66280388 66648552 67202377 67674782
$$ packed form
3494F1439705l4905o4254o9069k9087R4818J25648Q5972O2492J6999J5472N5886Q0345
3506F1780022J20117J07693K4059J2562P7606N8056n1811o8257j3233J7071N3215O9023
3518F2186123N1117P8819J70948J72806Q2111O2702R2961R5344R1053P2789K6058J6067
3530F3198898K1508O2202J79554J87897J02138M8188l3619l0781N7556J15440J83533
3541F4092514K14912K30095J93764P5554L2143K2384N3910J70417J89095J46652P8751
3552F5500191p4868j09054m4724l601P9583O5231o7711r5604r7206J8860K98141M66683
3564F5935921P14210N55680j53206l50403j84540j23146l2135J9501N3383N1765l746
3575F6483284k1866q247l1754j00090j13655j24504k4078K21298L68164N53825M72405
$$ plain form
3586 67674782 67734596 67612747 67383789 67185524 67228386 67368912 67549965 67722916 67793701 67841408 67924355
3597 67924355 68010422 68110779 68153572 68018082 67861938 67783592 67839859 68201187 68624786 68926170 69100662
3608 69100662 69002060 68870255 68971085 69080307 68979668 68916794 69092964 69428726 70056824 70541740
3618 70541740 70356079 69908073 69382523 68922211 68717194 68810150 69374039 70208023 71396400 72256638
3628 72256638 71761414 71029404 71030045 71183441 71195862 71177986 71126724 71089432 71159836 71195602 71061493 70829796
3640 70829796 70485214 70155289 69891022 69906593 70578888 71470383 72326324 72975159 73090103 72882011
3650 72882011 72295403 71802353 72034790 72457527 72755669 72900322 72650887 72327545 72238327 72178886
3660 72178886 72034119 71844223 71556519 71334480 71325615 71524857 72120163 72680023 72737549 72586731 72161125
$$ packed form
3586F7674782N9814j21849k28958j98265M2862J40526J81053J72951P0785M7707Q2947
3597F7924355Q6067J00357M2793j35490j56144p8346N6267L61328M23599L01384J74492
3608F9100662r8602j31805J00830J09222j00639o2874J76170L35762O28098M84916
3618G0541740j85661m48006n25550m60312k05017R2956N63889Q33984J188377Q60238
3628G2256638m95224p32010O41J53396J2421j7876n1262l7292P0404L5766j34109k31697
3640G0829796l44582l29925k64267J5571O72295Q91495Q55941O48835J14944k08092
3650G2882011n86608m93050K32437M22737K98142J44653k49435l23342q9218n9441
3660G2178886j44767j89896k87704k22039q865J99242N95306N59860N7526j50818m25606
$$ plain form
3671 72161125 72074821 73405312 74695732 74477127 73862839 73571228 73318031 73060249 72792145 72471764
3681 72471764 72164703 71830177 71745110 72325302 73112961 73839546 74352859 74287605 74014618 73807716
3691 73807716 73592285 73371002 73185539 73089127 73049355 73022507 73095772 73445442 73760414 73743393 73529076
3702 73529076 73071716 72615074 72392464 72389175 72725273 73229553 73852280 74348785 74391579 74179268 73730705
3713 73730705 73257614 73014214 72891594 72868134 72935989 73111275 73300240 73398232 73453949 73499229 73480057
3724 73480057 73370789 73117920 72492073 71995094 72217415 72663521 72956802 73330902 74053696 74645569
3734 74645569 74644562 74265381 73418495 72554276 72112701 72035339 72545914 73237656 73899651 74167847 73126030
3745 73126030 72219467 73061417 74231430 74729202 74907562 74747826 74364235 73756340 73249481 73293495
$$ packed form
3671G2161125q6304J330491J290420k18605o14288k91611k53197k57782k68104l20381
3681G2471764l07061l34526q5067N80192P87659P26585N13313o5254k72987k06902
3691G3807716k15431k21283j85463r6412l9772k6848P3265L49670L14972j7021k14317
3702G3529076m57360m56642k22610l289L36098N04280O22727M96505M2794k12311m48563
3713G3730705m73091k43400j22620k3460O7855J75286J88965R7992N5717M5280j9172
3724G3480057j09268k52869o25847m96979K22321M46106K93281L74100P22794N91873
3734G4645569j007l79181q46886q64219m41575p7362N10575O91742O61995K68196j041817
3745G3126030r06563Q41950J170013M97772J78360j59736l83591o07895n06859M4014
$$ plain form
3755 73293495 73514267 73697136 73813583 73722458 73546837 73322678 73169876 73301170 73473831 73442078
3765 73442078 73427490 73645065 73868752 73935081 73871109 73593048 73269722 73043991 72909882 72899078 73041222
3776 73041222 73498276 73904892 73821854 73632477 73615791 73645470 73697540 73743752 73739769 73709511 73682663 73597313
3788 73597313 73361084 73094872 72888039 72742531 72699043 72730301 72844002 72975876 72976257 73108673 73810837
3799 73810837 74410294 74154137 73721313 73574471 73609398 74055817 74374580 73899841 73241234 72821045
3809 72821045 72535347 72395706 72477844 73009445 73545837 73610115 73526672 73396042 73412727 74031853 74571777
3820 74571777 74300697 73823975 73537537 73337959 73302696 73284821 73102333 72937607 72983170 73026566 72837303
3831 72837303 72661949 72673439 72862007 73390488 73913765 74067329 74072052 74025055 73932816 73874855 73728752
$$ packed form
3755G3293495K20772J82869J16447r1125j75621k24159j52802J31294J72661l1753
3765G3442078j4588K17575K23687O6329o3972k78061l23326k25731j34109j0804J42144
3776G3041222M57054M06616q3038j89377j6686K9679N2070M6212l983l0258k6848q5350
3788G3597313k36229k66212k06833j45508m3488L1258J13701J31874L81J32416P02164
3799G3810837N99457k56157m32824j46842L4927M46419L18763m74739o58607m20189
3809G2821045k85698j39641Q2138N31601N36392O4278q3443j30630J6685O19126N39924
3820G4571777k71080m76722k86438j99578l5263j7875j82488j64726M5563M3396j89263
3831G2837303j75354J1490J88568N28481N23277J53564M723m6997r2239n7961j46103
$$ plain form
3842 73728752 73364975 72884155 72298836 71743774 71294167 71141098 71526100 72372749 74042747 75463295
3852 75463295 75375793 74698952 73859497 73074409 72799919 72744965 72771263 72876717 73032188 73180412 73267365
3863 73267365 73253922 72944595 72754219 73237274 73779251 73852348 73750710 73576714 73377609 73286148 73148224
3874 73148224 72727798 72403381 72620918 72941971 73040344 73025040 72787811 72654053 73116325 73564766
3884 73564766 73391891 73082825 72922279 72903732 73258781 73557495 73333450 72927498 72490433 72125748
3894 72125748 72000481 72074677 72435211 72868469 73152565 73399063 73693848 73891953 73839256 73648926
3904 73648926 73348450 73040649 72859428 72738716 72670723 72614548 72491364 72407005 72465607 72593430 72783951
3915 72783951 72939590 72933105 72846840 72696999 72554802 72513672 72523140 72593185 72635506 72517754 72381851
$$ packed form
3842G3728752l63777m80820n85319n55062m49607j53069L85002Q46649J669998J420548
3852G5463295q7502o76841q39455p85088k74490n4954K6298J05454J55471J48224Q6953
3863G3267365j3443l09327j90376M83055N41977P3097j01638j73996j99105r1461j37924
3874G3148224m20426l24417K17537L21053R8373j5304k37229j33758M62272M48441
3884G3564766j72875l09066j60546j8547L55049K98714k24045m05952m37065l64685
3894G2125748j25267P4196L60534M33258K84096K46498K94785J98105n2697j90330
3904G3648926l00476l07801j81221j20712o7993n6175j23184q4359N8602J27823J90521
3915G2783951J55639o485q6265j49841j42197m1130R468P0045M2321j17752j35903
$$ plain form
3926 72381851 72334267 72349022 72462341 72593979 72683426 72707344 72583481 72427986 72341896 72288132 72265335
3937 72265335 72267082 72287560 72323517 72392441 72425964 72303841 72198914 72310425 72438721 72412804 72345856
3948 72345856 72301842 72257088 72190025 72158096 72256348 72350403 72300461 72217705 72167900 72147537 72191833 72250130
3960 72250130 72290108 72291611 72207382 72086243 71951767 71832230 71763824 71746040 71817421 71896889 71901489 71875069
3972 71875069 71818832 71777557 71835350 71875381 71760345 71635529 71628281 71654984 71675423 71686508 71664856 71631195
3984 71631195 71604301 71566345 71481636 71422485 71472786 71562027 71665886 71729492 71653625 71546913 71495056 71467499
3996 71467499 71467255 71479126 71489525 71496490
4000 71496490
$$ packed form
3926G2381851m7584J4755J13319J31638Q9447K3918j23863j55495q6090n3764k2797
3937G2265335J747K0478L5957O8924L3523j22123j04927J11511J28296k5917o6948
3948G2345856m4014m4754o7063l1929R8252R4055m9942q2756m9805k0363M4296N8297
3960G2250130L9978J503q4229j21139j34476j19537o8406j7784P1381P9468M600k6420
3972G1875069n6237m1275N7793M0031j15036j24816p248K6703K0439J1085k1652l3661
3984G1631195k6894l7956q4709n9151N0301Q9241J03859O3606p5867j06712n1857k7557
3996G1467499k44J1871J0399O965
4000G1496490
##END=$$ End of the data block
