##TITLE=$$ Begin of the data block
##JCAMP-DX=5.00 $$ ACD/SpecManager v 10.08
##SPECTROMETER/DATA SYSTEM=16PC
##DATE=Mon Aug 12 10:33:16 2013
##DATA TYPE=INFRARED SPECTRUM
##DATA CLASS=XYDATA
##ORIGIN=
##OWNER=
##NPOINTS=3601
##FIRSTX=400.00000000
##LASTX=4000.00000000
##MAXX=4000.00000000
##MINX=400.00000000
##MAXY=37.38508987
##MINY=14.40845013
##XFACTOR=1.0000000000
##YFACTOR=0.000000100000000
##FIRSTY=17.93460464
##DELTAX=1.00000000
##XUNITS=1/CM
##YUNITS=TRANSMITTANCE
##XYDATA=(X++(Y..Y))
$$ plain form
400 179346046 224038486 258515205 281059990 293887882 301145840 306471786 311539841 316169987
408 316169987 319503574 321182899 321725883 322047806 322721024 323642616 324330750 324522781 324534912 325093231
418 325093231 326797218 329653549 333027229 336013794 337937851 338646202 338468552 337969055 337699051
427 337699051 338069496 339306488 341396599 344009476 346495819 348070602 348166618 346778793 344559212
436 344559212 342548676 341659546 342203598 343747940 345389557 346284714 346122551 345278015 344579430 344844894
446 344844894 346456337 349187737 352344818 355101128 356836281 357321777 356710625 355401421 353885422
455 353885422 352646179 352106323 352569809 354128799 356569214 359359169 361784668 363210831 363348732
464 363348732 362380219 360859146 359437103 358565865 358332863 358499641 358688660 358593102 358105316 357331772
$$ packed form
400A79346046M4692440L4476719K2544785J2827892P257958N325946N068055M630146
408C16169987L333587J679325N42984L21923O73218R21592O88134J92031J2131N58319
418C25093231J703987K856331L373680K986565J924057P08351j77650m99497k70004
427C37699051L70445J236992K090111K612877K486343J574783R6016j387825k219581
436C44559212k010536q89130N44052J544342J641617Q95157j62163q44536o98585K65464
446C44844894J611443K731400L157081K756310J735153M85496o11152j309204j515999
455C53885422j239243n39856M63486J558990K440415K789955K425499J426163J37901
464C63348732r68513j521073j422043q71238k33002J66778J89019r5558m87786p73544
$$ plain form
474 357331772 356535645 356060524 356257629 357402000 359593163 362667999 366187363 369538345 372127838
483 372127838 373582191 373850899 373170052 371919899 370466423 369062881 367835922 366820030 365994110
492 365994110 365298309 364647026 363960609 363215828 362482262 361909828 361661415 361828156 362381897 363196220
502 363196220 364118690 365042953 365933037 366793900 367621422 368381157 369033623 369581337 370091515 370660782
512 370660782 371339111 372066116 372673836 372968216 372844505 372359428 371709595 371123886 370737801 370533829
522 370533829 370385933 370174561 369887390 369629402 369531441 369621086 369752922 369659615 369101562 368023796
532 368023796 366617889 365244141 364255943 363828011 363883820 364153709 364322586 364180946 363706245 363047600
542 363047600 362436180 362072830 362038841 362259254 362524948 362565079 362144089 361151657 359650154 357858009
$$ packed form
474C57331772p96127m75121J97105J144371K191163L074836L519364L350982K589493
483C72127838J454353K68708o80847j250153j453476j403542j226959j015892q25920
492C65994110o95801o51283o86417p44781p33566n72434k48413J66741N53741Q14323
502C63196220R22470R24263Q90084Q60863Q27522P59735O52466N47714N10178N69267
512C70660782O78329P27005O07720K94380j23711m85077o49833n85709l86085k03972
522C70533829j47896k11372k87171k57988r7961Q9645J31836r3307n58053j077766
532C68023796j405907j373748r88198m27932N5809K69889J68877j41640m74701o58645
542C63047600o11420l63350l3989K20413K65694M0131m20990r92432j501503j792145
$$ plain form
552 357858009 356074219 354576263 353535194 352982521 352834587 352953987 353210030 353512573 353807373 354045372
562 354045372 354150963 354011345 353500366 352529335 351099968 349327393 347410774 345558777 343903351
571 343903351 342452126 341109200 339753418 338328133 336883163 335543976 334430237 333581581 332942581
580 332942581 332414055 331930847 331507645 331217003 331117020 331180801 331277313 331216812 330827675 330013123 328755302
591 328755302 327072830 324967804 322400131 319302826 315623512 311365013 306605854 301498566 296252632
600 296252632 291108990 286305046 282029419 278377762 275329971 272768993 270543327 268544292 266759109
609 266759109 265267143 264181843 263573666 263422604 263628025 264067822 264664593 265414333 266357498 267513065
619 267513065 268820381 270129833 271252575 272043381 272467766 272612343 272627144 272626648 272601395 272392921
$$ packed form
552C57858009j783790j497956j041069n52673j47934J19400K56043L02543K94800K37999
562C54045372J05591j39618n10979r71031j429367j772575j916619j851997j655426
571C43903351j451225j342926j355782j425285j444970j339187j113739q48656o39000
580C32942581n28526m83208m23202k90642r9983O3781R6512o0501l89137q14552j257821
591C28755302j682472k105026k567673l097305l679314m258499m759159n107288n245934
600B96252632n143642m803944m275627l651657l047791k560978k225666j999035j785183
609B66759109j491966j085300o08177j51062K05421M39797N96771P49740R43165J155567
619B67513065J307316J309452J122742P90806M24385J44577J4801m96k5253k08474
$$ plain form
629 272392921 271757603 270497875 268602772 266319809 264109726 262490063 261839676 262263699 263590355
638 263590355 265498352 267695103 270037479 272530212 275221252 278086128 280993519 283780231 286374779
647 286374779 288869228 291476765 294400234 297704372 301280251 304918041 308422203 311682854 314663887
656 314663887 317349548 319720116 321790123 323659401 325492859 327388687 329207191 330503311 330674400
665 330674400 329287872 326405144 322673874 319085445 316505527 315249252 314959679 314861908 314232178
674 314232178 312789326 310782642 308755360 307165775 306118603 305357342 304483814 303232613 301617317
683 301617317 299878902 298301544 297038021 296052856 295199890 294361134 293547516 292902107 292615700 292813969
693 292813969 293484459 294480629 295594044 296651516 297586060 298446693 299347553 300390491 301607285
$$ packed form
629B72392921o35318j259728j895103k282963k210083j619663o50387M24023J326656
638B63590355J907997K196751K342376K492733K691040K864876K907391K786712K594548
647B86374779K494449K607537K923469L304138L575879L637790L504162L260651K981033
656C14663887K685661K370568K070007J869278J833458J895828J818504J296120J71089
665C30674400j386528k882728l731270l588429k579918j256275k89573r7771o29730
674C14232178j442852k006684k027282j589585j047172p61261q73528j251201j615296
683C01617317j738415j577358j263523r85165q52966q38756q13618o45409k86407J98269
693B92813969O70490R96170J113415J057472R34544Q60633R00860J042938J216794
$$ plain form
702 301607285 302958736 304387817 305890465 307552414 309520283 311917896 314756908 317897701 321087875
711 321087875 324057693 326620941 328726616 330442429 331889687 333171959 334336128 335375175 336257095
720 336257095 336953354 337451096 337748566 337848511 337760353 337510910 337150612 336743622 336337204 335926476
730 335926476 335434875 334729881 333672485 332177391 330254784 328009453 325600357 323186646 320892487
739 320892487 318810596 317034760 315691566 314941311 314937859 315767326 317400646 319688187 322401085
748 322401085 325296059 328172531 330897980 333400002 335639458 337585602 339207153 340479507 341400642
757 341400642 342004013 342359085 342556725 342682533 342790565 342889404 342950020 342933159 342821579 342638206 342438889
768 342438889 342284813 342214317 342231979 342320251 342459908 342639656 342844315 343033676 343134880 343066635 342788086
$$ packed form
702C01607285J351451J429081J502648J661949J967869K397613K839012L140793L190174
711C21087875K969818K563248K105675J715813J447258J282272J164169J039047Q81920
720C36257095O96259M97742K97470R9945q8158k49443l60298m06990m06418m10728
730C35926476m91601p04994j057396j495094j922607k245331k409096k413711k294159
739C20892487k081891j775836j343194p50255l452Q29467J633320K287541K712898
748C22401085K894974K876472K725449K502022K239456J946144J621551J272354R21135
757C41400642O03371L55072J97640J25808J08032R8839O0616j6861j11580j83373j99317
768C42438889j54076p0496J7662Q8272J39657J79748K04659J89361J01204o8245k78549
$$ plain form
779 342788086 342341843 341857758 341505280 341415825 341620255 342039604 342534866 342984657 343343582 343647652
789 343647652 343969078 344354706 344789085 345204201 345526047 345722237 345820961 345890579 345997467 346172752
799 346172752 346407547 346674919 346958046 347260818 347594337 347951088 348291245 348554382 348691139 348691940 348590736
810 348590736 348436394 348251801 348007698 347632828 347054100 346241951 345229683 344092751 342902222 341682396
820 341682396 340399513 338989601 337406082 335659485 333826218 332024117 330369797 328940277 327756310
829 327756310 326790466 325995140 325334892 324809608 324457397 324334831 324481506 324886589 325476341 326132851
839 326132851 326736526 327209435 327535324 327743492 327870255 327923546 327876167 327690659 327357101 326915970
849 326915970 326448441 326042862 325758972 325614395 325596237 325685081 325868454 326135712 326462708 326803932
$$ packed form
779C42788086m46243m84085l52478q9455K04430M19349M95262M49791L58925L04070
789C43647652L21426L85628M34379M15116L21846J96190R8724O9618J06888J75285
799C46172752K34795K67372K83127L02772L33519L56751L40157K63137J36757Q01j01204
810C48590736j54342j84593k44103l74870n78728q12149j012268j136932j190529j219826
820C41682396j282883j409912j583519j746597j833267j802101j654320j429520j183967
829C27756310r65844p95326o60248n25284l52211j22566J46675M05083N89752O56510
839C26132851O03675M72909L25889K08168J26763N3291m7379j85508l33558m41131
849C26915970m67529m05579k83890j44577j8158Q8844J83373K67258L26996L41224
$$ plain form
859 326803932 327104530 327325554 327463875 327552185 327635651 327743683 327876663 328014297 328138733 328251686
869 328251686 328371544 328514595 328675079 328822403 328919220 328948212 328929558 328914719 328961105 329101639 329328804
880 329328804 329601784 329870720 330103340 330298767 330480995 330677910 330896912 331114006 331281815 331354408
890 331354408 331314735 331188507 331033516 330906372 330823517 330738525 330551949 330154266 329482231 328562088 327514915
901 327514915 326517868 325737152 325262146 325070572 325041008 325007057 324828911 324448700 323905182 323302307
911 323302307 322749290 322303467 321945114 321594925 321159325 320576630 319837627 318975067 318037415 317068825
921 317068825 316108875 315204353 314412842 313784485 313326092 312976151 312614975 312114964 311405640 310511494
931 310511494 309535999 308597946 307759457 306991253 306197166 305277996 304191990 302970409 301681557 300371933
$$ packed form
859C26803932L00598K21024J38321Q8310Q3466J08032J32980J37634J24436J12953
869C28251686J19858J43051J60484J47324R6817K8992j8654j4839M6386J40534K27165
880C29328804K72980K68936K32620J95427J82228J96915K19002K17094J67809P2593
890C31354408l9673j26228j54991j27144q2855q4992j86576l97683o72035r20143j047173
901C27514915r97047p80716m75006j91574k9564l3951j78146l80211n43518o02875
911C23302307n53017m45823l58353l50189m35600n82695p39003q62560r37652r68590
921C17068825r59950r04522p91511o28357m58393l49941l61176n00011p09324q94146
931C10511494r75495r38053q38489p68204p94087r19170j086006j221581j288852j309624
$$ plain form
941 300371933 299025993 297573071 295934772 294079647 292048969 289938393 287850151 285846634 283932495
950 283932495 282071304 280221977 278371277 276547146 274809704 273231773 271881981 270815964 270076027
959 270076027 269691105 269672966 270008869 270656128 271544342 272588234 273706379 274841080 275970078 277107811
969 277107811 278298092 279600220 281074505 282767544 284698124 286846905 289153366 291525993 293865013
978 293865013 296091537 298168411 300101509 301918964 303640022 305251942 306710701 307966385 308997364
987 308997364 309832420 310545197 311223774 311933212 312692432 313476677 314241352 314950314 315592003 316176395
997 316176395 316718674 317223663 317681446 318076115 318401012 318669071 318911190 319163151 319447575 319760456
1007 319760456 320070686 320331612 320501022 320559196 320516014 320404739 320264206 320120735 319978390 319822655
$$ packed form
941C00371933j345940j452922j638299j855125k030678k110576k088242k003517j914139
950B83932495j861191j849327j850700j824131j737442j577931j349792j066017p39937
959B70076027l84922j8139L35903O47259Q88214J043892J118145J134701J128998J137733
969B77107811J190281J302128J474285J693039J930580K148781K306461K372627K339020
978B93865013K226524K076874J933098J817455J721058J611920J458759J255684J030979
987C08997364Q35056P12777O78577P09438P59220P84245P64675P08962O41689N84392
997C16176395N42279N04989M57783L94669L24897K68059K42119K51961K84424L12881
1007C19760456L10230K60926J69410N8174m3182j11275j40533j43471j42345j55735
$$ plain form
1017 319822655 319635429 319411507 319167404 318936672 318754234 318638744 318581295 318547096 318488426 318361683
1027 318361683 318140717 317818241 317397022 316874523 316234303 315450001 314507561 313434887 312324963 311335335
1037 311335335 310655155 310448780 310795746 311653824 312862720 314188976 315394955 316304207 316839752
1046 316839752 317023888 316945171 316709824 316399345 316047478 315642242 315144749 314512749 313716297 312740231
1056 312740231 311575260 310206718 308607960 306742172 304569073 302051964 299162617 295887794 292241268
1065 292241268 288282413 284132671 279976902 276042900 272561798 269728546 267680607 266503220 266249485
1074 266249485 266952553 268612938 271163387 274434834 278153439 281983299 285601425 288772411 291387138
1083 291387138 293451767 295040188 296238594 297110615 297691860 298004875 298077888 297953358 297684746 297326050
$$ packed form
1017C19822655j87226k23922k44103k30732j82438j15490n7449l4199n8670j26743
1027C18361683k20966l22476m21219n22499o40220p84302r42440j072674j109924r89628
1037C11335335o80180k06375L46966Q58078J208896J326256J205979R09252N35545
1046C16839752J84136p8717k35347l10479l51867m05236m97493o32000p96452r76066
1056C12740231j164971j368542j598758j865788k173099k517109k889347l274823l646526
1065B92241268l958855m149742m155769l934002l481102k833252k047939j177387k53735
1074B66249485P03068J660385K550449L271447L718605L829860L618126L170986K614727
1083B91387138K064629J588421J198406Q72021N81245L13015P3013j24530k68612l58696
$$ plain form
1093 297326050 296921406 296498585 296067715 295625420 295165844 294693775 294234886 293834362 293540535 293381329
1103 293381329 293345413 293378849 293397789 293308449 293019009 292441559 291488628 290079346 288160362 285735264
1113 285735264 282884407 279759159 276550426 273445396 270594368 268101101 266031761 264429798 263321514
1122 263321514 262711086 262573929 262858562 263500767 264440880 265633087 267040634 268623276 270328503
1131 270328503 272098331 273888168 275688286 277532825 279489613 281634998 284025211 286677895 289568729
1140 289568729 292642040 295826931 299049740 302238426 305319309 308212967 310835991 313113689 315000744
1149 315000744 316498604 317659607 318569012 319310055 319928169 320411644 320701828 320727997 320451889 319898815
1159 319898815 319162312 318380642 317696953 317220612 317003345 317036552 317266655 317621365 318034363 318461437
$$ packed form
1093B97326050m04644m22821m30870m42295m59576m72069m58889m00524k93827j59206
1103B93381329l5916L3436J8940q9340k89440n77450r52931j409282j918984k425098
1113B85735264k850857l125248l208733l105030k851028k493267k069340j601963j108284
1122B63321514o10428j37157K84633O42205R40113J192207J407547J582642J705227
1131B70328503J769828J789837J800118J844539J956788K145385K390213K652684K890834
1140B89568729L073311L184891L222809L188686L080883K893658K623024K277698J887055
1149C15000744J497860J161003R09405P41043O18114M83475K90184K6169k76108n53074
1159C19898815p36503p81670o83689m76341k17267L3207K30103L54710M12998M27074
$$ plain form
1169 318461437 318881149 319283447 319654026 319964676 320177803 320261688 320205078 320018845 319718475 319296856
1179 319296856 318706303 317866783 316702099 315187759 313381653 311417046 309456635 307629528 305985203
1188 305985203 304488239 303055878 301616936 300159779 298744850 297479115 296467514 295768986 295375748
1197 295375748 295222626 295217552 295276699 295350838 295435219 295561848 295779972 296130409 296623783 297230339 297887650
1208 297887650 298523312 299083557 299550629 299938526 300266552 300523682 300645638 300517006 299999332 298968315
1218 298968315 297340889 295080986 292188606 288689423 284637280 280130692 275327358 270436935 265683708
1227 265683708 261250153 257226830 253594551 250248108 247048378 243878136 240675735 237438183 234200115
1236 234200115 231005230 227886143 224857140 221917305 219057846 216268749 213540630 210863724 208221340
$$ packed form
1169C18461437M19712M02298L70579L10650K13127Q3885n6610j86233l00370m21619
1179C19296856n90553q39520j164684j514340j806106j964607j960411j827107j644325
1188C05985203j496964j432361j438942j457157j414929j265735j011601o98528l93238
1197B95375748j53122n074N9147P4139Q4381J26629K18124L50437M93374O06556O57311
1208B97887650O35662N60245M67072L87897L28026K57130J21956j28632n17674j031017
1218B98968315j627426k259903k892380l499183m052143m506588m803334m890423m753227
1227B65683708m433555m023323l632279l346443l199730l170242l202401l237552l238068
1236B34200115l194885l119087l029003k939835k859459k789097k728119k676906k642384
$$ plain form
1245 208221340 205581074 202889500 200078125 197088070 193909225 190618687 187394543 184489441 182163601
1254 182163601 180603561 179859962 179835682 180329132 181111755 182003460 182912521 183830032 184789200 185817623
1264 185817623 186905708 188001728 189028645 189909458 190589104 191047440 191304092 191416473 191472359 191577263
1274 191577263 191836147 192333336 193113899 194171162 195442810 196817703 198153381 199303646 200150757
1283 200150757 200636482 200780888 200684376 200510902 200458241 200723286 201470566 202809067 204779377 207354660
1293 207354660 210452709 213959084 217750912 221714745 225752087 229775448 233703270 237463760 241007767
1302 241007767 244321957 247429333 250370274 253171825 255822487 258268986 260438747 262274113 263757496
1311 263757496 264911785 265778027 266386566 266740837 266824112 266623344 266153030 265464954 264637070 263748455
$$ packed form
1245B08221340k640266k691574k811375k990055l178845l290538l224144k905102k325840
1254A82163601j560040p43599k4280M93450P82623Q91705R09061R17511R59168J028423
1264A85817623J088085J096020J026917Q80813O79646M58336K56652J12381N5886J04904
1274A91577263K58884M97189P80563J057263J271648J374893J335678J150265Q47111
1283B00150757M85725J44406r6512j73474n2661K65045P47280J338501J970310K575283
1293B07354660L098049L506375L791828L963833M037342M023361L927822L760490L544007
1302B41007767L314190L107376K940941K801551K650662K446499K169761J835366J483383
1311B63757496J154289Q66242O08539L54271Q3275k00768m70314o88076q27884q88615
$$ plain form
1321 263748455 262855797 261982059 261123123 260266895 259414101 258590240 257843895 257236805 256833076 256696892
1331 256696892 256898689 257521782 258658695 260393162 262772388 265783997 269348850 273329315 277544918
1340 277544918 281784306 285813580 289392223 292306309 294416103 295697746 296251526 296267014 295961132
1349 295961132 295524464 295103741 294819851 294791679 295132275 295908947 297093143 298544521 300051384 301413288
1359 301413288 302516460 303358860 304016018 304577980 305102482 305605869 306079769 306502838 306828747 306964855
1369 306964855 306773090 306113033 304912930 303226147 301236286 299207497 297409096 296057873 295295582
1378 295295582 295188789 295727501 296812992 298255177 299810123 301262875 302523079 303675804 304945011
1387 304945011 306578465 308710575 311276321 314022064 316603489 318719730 320219765 321137962 321652985
$$ packed form
1321B63748455q92658q73738q58936q56228q52794q23861p46345o07090m03729j36184
1331B56696892K01797O23093J136913J734467K379226L011609L564853L980465M215603
1340B77544918M239388M029274L578643K914086K109794J281643N53780J5488l05882
1349B95961132m36668m20723k83890k8172L40596P76672J184196J451378J506863J361904
1359C01413288J103172Q42400O57158N61962N24502N03387M73900M23069L25909J36108
1369C06964855j91765o60057j200103j686783j989861k028789j798401j351223p62291
1378B95295582j06793N38712J085491J442185J554946J452752J260204J152725J269207
1387C04945011J633454K132110K565746K745743K581425K116241J500035R18197N15023
$$ plain form
1396 321652985 321994438 322340622 322748337 323143044 323368912 323271103 322762833 321840439 320544739 318903866
1406 318903866 316911411 314563141 311925049 309169674 306527653 304163952 302049198 299915600 297338181
1415 297338181 293900471 289351292 283673515 277055054 269819126 262380981 255246220 249002705 244239883
1424 244239883 241385250 240526047 241327839 243120384 245127468 246729851 247641640 247941132 247983246
1433 247983246 248265743 249303551 251522369 255157948 260168152 266200600 272659283 278867054 284257984
1442 284257984 288506947 291549702 293521786 294688816 295415020 296137638 297275276 299038582 301223946
1451 301223946 303154297 303894176 302700005 299478722 294962635 290442562 287169533 285760288 285962677
1460 285962677 286924343 287793598 288275127 288797836 290206013 293184223 297779217 303303165 308655834
$$ packed form
1396C21652985L41453L46184M07715L94707K25868r7809n08270r22394j295700j640873
1406C18903866j992455k348270k638092k755375k642021k363701k114754k133598k577419
1415B97338181l437710m549179n677777o618461p235928p438145p134761o243515m762822
1424B44239883k854633q59203Q01792J792545K007084J602383R11789K99492M2114
1433B47983246K82497J037808K218818L635579N010204O032448O458683O207771N390930
1442B84257984M248963L042755J972084J167030P26204P22618J137638J763306K185364
1451C01223946J930351P39879j194171l221283m516087m520073l273029j409245K02389
1460B85962677R61666Q69255M81529N22709J408177K978210M594994N523948N352669
$$ plain form
1469 308655834 312853489 315459290 316695538 317223492 317754612 318718376 320143204 321764488 323257065
1478 323257065 324442253 325361862 326199532 327116127 328106308 328966103 329397697 329197884 328428078 327462807
1488 327462807 326870422 327163506 328529930 330683250 332929726 334456520 334731903 333828888 332484741
1497 332484741 331816483 332779350 335622063 339636574 343384171 345336227 344619102 341467590 337127037
1506 337127037 333248749 331114845 331115913 332740288 335015869 337086601 338570900 339541588 340234833
1515 340234833 340752220 340966377 340650826 339686661 338171730 336372757 334597664 333104591 332091408
1524 332091408 331710320 332028770 332936745 334101486 335076447 335558090 335628242 335775986 336615143 338436127
1534 338436127 340887947 343033676 343791695 342514000 339355659 335219994 331328278 328678169 327681770
$$ packed form
1469C08655834M197655K605801J236248N27954N31120R63764J424828J621284J492577
1478C23257065J185188R19609Q37670R16595R90181Q59795M31594j99813p69806r65271
1488C27462807n92385K93084J366424K153320K246476J526794K75383r03015j344147
1497C32484741o68258R62867K842713M014511L747597J952056p17125l151512m340553
1506C37127037l878288k133904J068J624375K275581K070732J484299R70688O93245
1515C40234833N17387K14157l15551r64165j514931j798973j775093j493073j013183
1524C32091408l81088L18450R07975J164741R74961M81643P0152J47744Q39157J820984
1534C38436127K451820K145729P58019j277695l158341m135665l891716k650109r96399
$$ plain form
1543 327681770 328128052 329414597 330878677 332068176 332876091 333534241 334479027 336114693 338530388
1552 338530388 341296997 343490486 344014091 342121124 337881813 332312698 327040367 323630219 322910309
1561 322910309 324637299 327666664 330525017 332081375 331991997 330730972 329235115 328366318 328459854
1570 328459854 329168358 329664268 329089966 327028847 323751678 320110474 317135830 315560455 315525723
1579 315525723 316617050 318170300 319638824 320799866 321714592 322528839 323290558 323910141 324254875
1588 324254875 324268036 324003601 323562927 323007660 322335548 321535912 320662041 319845715 319238319 318935356
1598 318935356 318956165 319286079 319923782 320865555 322030029 323207436 324124451 324622002 324821777 325121765
1608 325121765 325964775 327503510 329397278 330919838 331351280 330418282 328494568 326420021 325048409
$$ packed form
1543C27681770M46282J286545J464080J189499Q07915O58150R44786J635666K415695
1552C38530388K766609K193489N23605j892967m239311n569115n272331l410148p19910
1561C22910309J726990L029365K858353J556358q9378j261025j495857q68797R3536
1570C28459854P08504M95910n74302k061119l277169l641204k974644j575375l4732
1579C15525723J091327J553250J468524J161042R14726Q14247P61719O19583L44734
1588C24254875J3161k64435m40674n55267o72112p99636q73871q16326o07396l02963
1598C18935356K0809L29914O37703R41773J164474J177407R17015M97551J99775K99988
1608C25121765Q43010J538735J893768J522560M31442r32998j923714k074547j371612
$$ plain form
1617 325048409 324804687 325513039 326567230 327301178 327321434 326635971 325569267 324576912 324081268 324373817
1627 324373817 325556908 327484360 329720535 331584320 332333183 331460686 328981628 325545082 322271614
1636 322271614 320343628 320510025 322732468 326159859 329479523 331511726 331774445 330720558 329487991
1645 329487991 329246521 330472298 332565536 334078407 333486443 330099182 324580803 318739357 314659081
1654 314659081 313646469 315589104 319089012 322278824 323826103 323542938 322285423 321270866 321282310
1663 321282310 322253113 323437653 323989563 323522644 322293282 320924454 319915123 319301167 318706245
1672 318706245 317727432 316361179 315141716 314861012 316031036 318433838 321071014 322580833 321909027
1681 321909027 318857536 314209347 309368095 305720863 304066448 304385509 306015282 308072891 309864159
$$ packed form
1617C25048409k43722P08352J054191P33948K0256o85463j066704r92355m95644K92549
1627C24373817J183091J927452K236175J863785P48863q72497k479058l436546l273468
1636C22271614j927986J66397K222443L427391L319664K032203K62719j053887j232567
1645C29487991k41470J225777K093238J512871n91964l387261n518379n841446m080276
1654C14659081j012612J942635L499908L189812J547279k83165j257515j014557J1444
1663C21282310R70803J184540N51910m66919j229362j368828j009331o13956n94922
1672C18706245r78813j366253j219463k80704J170024K402802K637176J509819o71806
1681C21909027l051491m648189m841252l647232j654415L19061J629773K057609J791268
$$ plain form
1690 309864159 311068859 311660004 311671753 311002750 309389038 306554394 302427387 297274036 291645107
1699 291645107 286152039 281188526 276751842 272466488 267801132 262362194 256104870 249347115 242585697
1708 242585697 236221371 230348682 224722061 218910828 212551594 205567150 198246670 191162682 184973564
1717 184973564 180202885 177081852 175509281 175137196 175548172 176450272 177799435 179783077 182657509
1726 182657509 186523056 191168537 196099224 200758572 204829998 208434963 212091408 216437607 221877060
1735 221877060 228356171 235408344 242430534 249014874 255129642 261049194 267094669 273361740 279605598
1744 279605598 285343285 290098553 293638382 296075459 297798328 299289608 300933418 302897758 305123367
1753 305123367 307398510 309468498 311132088 312294312 312971611 313268452 313348198 313413715 313690338 314386272
$$ packed form
1690C09864159J204700N91145J1749o69003j613712k834644m127007n153351n628929
1699B91645107n493068m963513m436684m285354m665356n438938o257324o757755o761418
1708B42585697o364326n872689n626621n811233o359234o984444p320480p083988o189118
1717A84973564m770679l121033j572571l72085M10976R02100J349163J983642K874432
1726A82657509L865547M645481M930687M659348M071426L604965L656445M346199N439453
1735B21877060O479111P052173P022190O584340O114768N919552O045475O267071O243858
1744B79605598N737687M755268L539829K437077J722869J491280J643810J964340K225609
1753C05123367K275143K069988J663590J162224O77299K96841P9746O5517K76623O95934
$$ plain form
1763 314386272 315617237 317314701 319174461 320709343 321419411 321019440 319604301 317645874 315805225
1772 315805225 314650917 314435062 315041008 316108952 317240028 318153210 318727131 318955708 318897781 318673248
1782 318673248 318483429 318584480 319172630 320228081 321433563 322267303 322258682 321269913 319621944 317964344
1792 317964344 316948204 316891174 317630100 318641453 319343452 319397182 318840771 318010235 317323208 317062836
1802 317062836 317268276 317759914 318256035 318508492 318400211 317975006 317399979 316880970 316568089 316494904
1812 316494904 316582928 316707478 316784019 316816845 316880569 317051716 317345066 317703209 318040695 318298035 318456955
1823 318456955 318506031 318397274 318049850 317413921 316548309 315638027 314917297 314541340 314501514 314656143
1833 314656143 314860992 315096760 315484791 316163158 317109718 318053017 318563862 318287983 317175159 315548592
$$ packed form
1763C14386272J230965J697464J859760J534882P10068l99971j415139j958427j840649
1772C15805225j154308k15855O05946J067944J131076R13182N73921K28577n7927k24533
1782C18673248j89819J01051N88150J055451J205482Q33740q621r88769j647969j657600
1792C17964344j016140n7030P38926J011353P01999N3730n56411q30536o87027k60372
1802C17062836K05440M91638M96121K52457j08281m25205n75027n19009l12881p3185
1812C16494904Q8024J24550P6541L2826O3724J71147K93350L58143L37486K57340J58920
1823C18456955M9076j08757l47424o35929q65612r10282p20730l75957l9826J54629
1833C14656143K04849K35768L88031O78367R46560R43299N10845k75879j112824j626567
$$ plain form
1843 315548592 313960781 312919922 312652531 313034821 313713779 314321823 314651814 314705620 314620285 314545689
1853 314545689 314554119 314624538 314689178 314702435 314689903 314752026 315018005 315565834 316345139 317147827 317661266
1864 317661266 317598839 316851788 315576248 314153843 313030262 312513218 312641468 313194962 313834667 314281425
1874 314281425 314431171 314353561 314200745 314101200 314107494 314210625 314385395 314617844 314894161 315172253 315372772
1885 315372772 315409050 315237923 314892235 314469109 314079933 313797474 313634453 313561993 313545437 313567028 313620644
1896 313620644 313691597 313748875 313761654 313730373 313700600 313739948 313886414 314104748 314288712 314318161 314138470
1907 314138470 313809338 313483295 313321781 313396454 313640881 313882713 313939991 313721752 313272972 312741318
1917 312741318 312290630 312017555 311918354 311916447 311924229 311895275 311838493 311794453 311797295 311848984 311920033 311968613
$$ packed form
1843C15548592j587811j040859k67391L82290O78958O08044L29991N3806q5335p4596
1853C14545689Q430P0419O4640J3257j2532O2123K65979N47829P79305Q02688N13439
1864C17661266o2427p47051j275540j422405j123581n17044J28250N53494O39705M46758
1874C14281425J49746p7610j52816r9545O294J03131J74770K32449K76317K78092K00519
1885C15372772L6278j71127l45688m23126l89176k82459j63021p2460j6556K1591N3616
1896C13620644P0953N7278J2779l1281k9773L9348J46466K18334J83964K9449j79691
1907C14138470l29132l26043j61514P4673K44427K41832N7278k18239m48780n31654
1917C12741318m50688k73075r9201j907P782k8954n6782m4040K842N1689P1049M8580
$$ plain form
1929 311968613 311965866 311910934 311831760 311773186 311776733 311859493 311998520 312130337 312169609 312044239 311730099
1940 311730099 311268387 310752640 310290737 309960785 309784431 309728966 309734402 309746323 309738464 309713669 309690819
1951 309690819 309686584 309703789 309730339 309746990 309739590 309709644 309677143 309673576 309724178 309828587 309950943 310028248
1963 310028248 309997158 309826679 309538136 309199314 308894958 308688869 308598194 308592815 308617439 308620930 308577194
1974 308577194 308489475 308379707 308273773 308191185 308142529 308132343 308163834 308239307 308357620 308508282 308665695
1985 308665695 308789024 308830700 308753471 308549595 308251171 307923813 307641830 307456341 307373562 307355309 307344036
1996 307344036 307296524 307208595 307115154 307067451 307100983 307214012 307367439 307505989 307586536 307598171 307564373
2007 307564373 307526779 307521076 307557983 307618008 307661915 307651119 307565804 307413292 307221737 307024136 306842384
$$ packed form
1929C11968613k747n4932p9174n8574L547Q2760J39027J31817L9272j25370l14140
1940C11730099m61712n15747m61903l29952j76354n5465N436J1921p859k4795k2850
1951C09690819m235J7205K6550J6651p400k9946l2501l567N0602J04409J22356P7305
1963C10028248l1090j70479k88543l38822l04356k06089r0675n379K4624L491m3736
1974C08577194q7719j09768j05934q2588m8656j0186L1491P5473J18313J50662J57413
1985C08665695J23329M1676p7229k03876k98424l27358k81983j85489q2779j8253j1273
1996C07344036m7512q7929r3441m7703L3532J13029J53427J38550Q0547J1635l3798
2007C07564373l7594n703L6907O0025M3907j0796q5315j52512j91555j97601j81752
$$ plain form
2018 306842384 306680279 306528282 306376228 306224003 306083393 305970364 305893650 305848598 305820255 305794010 305765476
2029 305765476 305742779 305739002 305760612 305799122 305832977 305838394 305802555 305731392 305645924 305569401 305513000 305467186
2041 305467186 305406094 305301895 305142498 304942265 304739132 304578838 304493618 304486771 304531746 304586563 304615555
2052 304615555 304606876 304575405 304550381 304555912 304593983 304642372 304665165 304630985 304528275 304369068 304183025 304004993
2064 304004993 303864079 303777542 303749332 303770199 303818321 303861980 303866405 303805637 303674297 303493328 303303871
2075 303303871 303150768 303064404 303049450 303087482 303149414 303209476 303251915 303268070 303249550 303185959 303071136
2086 303071136 302913952 302743473 302601357 302523670 302521687 302574482 302640381 302679443 302674522 302636967 302594719 302570591
2098 302570591 302566261 302561035 302525616 302440491 302307205 302146454 301985188 301843605 301728706 301637745 301567078
$$ packed form
2018C06842384j62105j51997j52054j52225j40610j13029p6714m5052k8343k6245k8534
2029C05765476k2697l777K1610L8510L3855N417l5839p1163q5468p6523n6401m5814
2041C05467186o1092j04199j59397k00233k03133j60294q5220o847M4975N4817K8992
2052C04615555q679l1471k5024N531L8071M8389K2793l4180j02710j59207j86043j78032
2064C04004993j40914q6537k8210K0867M8122M3659M425o0768j31340j80969j89457
2075C03303871j53103q6364j4954L8032O1932O0062M2439J6155j8520o3591j14823
2086C03071136j57184j70479j42116p7687j983N2795O5899L9062m921l7555m2248k4128
2098C02570591m330n226l5419q5125j33286j60751j61266j41583j14899r0961p0667
$$ plain form
2109 301567078 301517582 301494961 301503773 301540642 301592407 301639843 301665058 301657429 301615772 301546383 301459827 301368408
2121 301368408 301286697 301230221 301213455 301243973 301316471 301410275 301494503 301537724 301520557 301443214 301324673 301194191
2133 301194191 301078835 300993366 300936298 300892925 300843506 300771542 300670757 300546570 300413113 300287342 300180874
2144 300180874 300095673 300023422 299951591 299871826 299786377 299708118 299653416 299631748 299638271 299654770 299657593 299630127
2156 299630127 299571133 299495258 299425144 299380035 299366302 299374485 299384937 299378338 299347134 299301891 299268093 299273987
2168 299273987 299333382 299433804 299537029 299594307 299571228 299466038 299312439 299162273 299057579 299009151 298993874
2179 298993874 298973560 298920918 298837662 298751659 298697491 298692760 298727016 298768330 298781586 298746128 298661060 298539162
2191 298539162 298395729 298242702 298090038 297950897 297842770 297781124 297769966 297796707 297836285 297863331 297864075
$$ packed form
2109C01567078m9496k2621Q812L6869N1765M7436K5215p629m1657o9389q6556r1419
2121C01368408q1711n6476j6766L0518P2498R3804Q4228M3221j7167p7343j18541j30482
2133C01194191j15356q5469n7068m3373m9419p1964j00785j24187j33457j25771j06468
2144C00180874q5201p2251p1831p9765q5449p8259n4702k1668O523J6499K823k7466
2156B99630127n8994p5875p0114m5109j3733Q183J0452o599l1204m5243l3798N894
2168B99273987N9395J00422J03225N7278k3079j05190j53599j50166j04694m8428j5277
2179B98993874k0314n2642q3256q6003n4168m731L4256M1314J3256l5458q5068j21898
2191B98539162j43433j53027j52664j39141j08127o1646j1158K6741L9578K7046P44
$$ plain form
2202 297864075 297839622 297799835 297752399 297695980 297622185 297524166 297404346 297275200 297152424 297046032 296956615
2213 296956615 296878185 296806087 296741791 296691341 296659107 296641293 296625595 296596680 296543121 296461582 296355476 296231651
2225 296231651 296099339 295971241 295865917 295804024 295799370 295848045 295925293 295993996 296023216 296004009 295953274
2236 295953274 295901432 295871506 295864048 295858078 295826626 295756607 295659218 295564575 295504627 295495968 295532665 295591297
2248 295591297 295642719 295663166 295638943 295567093 295454063 295314121 295168037 295038395 294943047 294889450 294873219
2259 294873219 294882393 294903927 294928188 294949284 294963055 294966011 294957714 294943123 294931774 294931297 294938679 294935741 294893570
2272 294893570 294786243 294605598 294369621 294118843 293903980 293769264 293740616 293820248 293987789 294204884
2282 294204884 294422798 294591713 294672489 294647484 294526768 294346809 294160194 294019909 293963451 294002533 294121571
$$ packed form
2202B97864075k4453l9787m7436n6419p3795r8019j19820j29146j22776j06392q9417
2213B96956615p8430p2098o4296n0450l2234j7814j5698k8915n3559q1539j06106j23825
2225B96231651j32312j28098j05324o1893m654M8675P7248O8703K9220j9207n0735
2236B95953274n1842k9926p458n970l1452p0019r7389r4643n9948q659L6697N8632
2248B95591297N1422K0447k4223p1850j13030j39942j46084j29642r5348n3597j6231
2259B94873219R174K1534K4261K1096J3771K956q297j4591j1349m77P382k938m2171
2272B94893570j07327j80645k35977k50778k14863j34716k8648P9632J67541K17095
2282B94204884K17914J68915Q0776k5005j20716j79959j86615j40285n6458L9082J19038
$$ plain form
2293 294121571 294285736 294455910 294604530 294726543 294840107 294976521 295163803 295411205 295701942 295996590
2303 295996590 296244526 296398811 296430511 296340256 296166306 295985928 295903721 296024647 296414032 297057533
2313 297057533 297841206 298566170 299002514 298967743 298400955 297400780 296203766 295103264 294335937 293982410
2323 293982410 293931217 293931141 293713875 293128834 292218666 291190434 290298176 289705181 289410057 289275684 289130211
2334 289130211 288855782 288393307 287663784 286487961 284614029 281895027 278537807 275253181 273151073
2343 273151073 273355827 276496563 282334671 289745827 297098560 302854786 306100693 306763706 305451488
2352 305451488 303046761 300296860 297592545 294991074 292394180 289730644 287037163 284424133 281991291
2361 281991291 279773502 277751389 275905323 274261417 272891045 271867237 271210804 270865746 270721836
$$ packed form
2293B94121571J64165J70174J48620J22013J13564J36414J87282K47402K90737K94648
2303B95996590K47936J54285L1700r0255j73950j80378q2207J20926L89385O43501
2313B97057533P83673P24964M36344l4771n66788j000175j197014j100502p67327l53527
2323B93982410n1193p6k17266n85041r10168j028232q92258n92995k95124j34373j45473
2334B89130211k74429m62475p29523j175823j873932k719002l357220l284626k102108
2343B73151073K04754L140736N838108P411156P352733N756226L245907O63013j312218
2352C05451488k404727k749901k704315k601471k596894k663536k693481k613030k432842
2361B81991291k217789k022113j846066j643906j370372j023808o56433l45058j43910
$$ plain form
2370 270721836 270669937 270658760 270721073 270957470 271486397 272386303 273656368 275214157 276926098 278655758
2380 278655758 280304184 281824360 283208408 284459496 285568581 286508770 287248592 287772255 288093891
2389 288093891 288256874 288321877 288348846 288381882 288440399 288517075 288584118 288606739 288561192 288451195 288311329
2400 288311329 288195267 288151169 288198719 288320351 288472805 288609581 288702049 288745155 288749390 288727207 288685646
2411 288685646 288629303 288567505 288515549 288486290 288476925 288463364 288408699 288284740 288092384 287867851 287669296
2422 287669296 287549477 287530994 287597256 287703266 287799053 287852097 287858276 287835960 287810020 287794628 287784195 287756824
2434 287756824 287687187 287562656 287392750 287207489 287045002 286934185 286882153 286872501 286874332 286858311 286809158
2445 286809158 286729641 286635857 286547432 286479206 286438198 286424637 286433811 286456776 286479778 286485367 286457253 286387615
$$ packed form
2370B70721836n1899j1177O2313K36397N28927Q99906J270065J557789J711941J729660
2380B78655758J648426J520176J384048J251088J109085R40189P39822N23663L21636
2389B88093891J62983O5003K6969L3036N8517P6676O7043K2621m5547j09997j39866
2400B88311329j16062m4098M7550J21632J52454J36776R2468M3106M235k2183m1561
2411B88685646n6343o1798n1956k9259r365j3561n4665j23959j92356k24533j98555
2422B87669296j19819j8483O6262J06010R5787N3044O179k2316k5940j5392j0433k7371
2434B87756824o9637j24531j69906j85261j62487j10817n2032r652J831j6021m9153
2445B86809158p9517r3784q8425o8226m1008j3561R174K2965K3002N589k8114o9638
$$ plain form
2457 286387615 286282787 286162701 286052818 285973034 285928917 285911388 285903854 285892105 285870190 285839195 285800800
2468 285800800 285751934 285685081 285594902 285485706 285373230 285278549 285215797 285182190 285157547 285113449 285027828
2479 285027828 284896355 284734058 284567261 284421463 284311619 284239616 284197445 284172382 284150467 284117336 284059734
2490 284059734 283968830 283845196 283702850 283566246 283461552 283404579 283392124 283403473 283410835 283394527 283352356
2501 283352356 283298454 283251305 283218517 283188000 283132420 283023529 282849979 282627449 282394962 282200699 282083263
2512 282083263 282058086 282114582 282221451 282338810 282429886 282470436 282454090 282391796 282306004 282220097 282146740
2523 282146740 282082138 282009239 281909695 281777973 281627369 281484165 281372757 281301956 281262531 281236553 281211910
2534 281211910 281189880 281179237 281181374 281180573 281147747 281060467 280923615 280775681 280672188 280653782 280719395 280822926
$$ packed form
2457B86387615j04828j20086j09883p9784m4117j7529p534j1749k1915l0995l8395
2468B85800800m8866o6853r0179j09196j12476r4681o2752l3607k4643m4098q5621
2479B85027828j31473j62297j66797j45798j09844p2003m2171k5063k1915l3131n7602
2490B84059734r0904j23634j42346j36604j04694n6973j2455J1349P362j6308m2171
2501B83352356n3902m7149l2788l0517n5580j08891j73550k22530k32487j94263j17436
2512B82083263k5177N6496J06869J17359R1076M0550j6346o2294q5792q5907p3357
2523B82146740o4602p2899r9544j31722j50604j43204j11408p0801l9425k5978k4643
2534B81211910k2030j0643K137q01l2826q7280j36852j47934j03493j8406O5613J03531
$$ plain form
2546 280822926 280896950 280890331 280795803 280650768 280511665 280418892 280373669 280342484 280282078 280170021 280020065
2557 280020065 279874649 279780540 279762840 279812946 279895191 279966145 279994907 279973621 279914684 279839821 279768047 279708862
2569 279708862 279663601 279630318 279608822 279602661 279615192 279645214 279682293 279707832 279700813 279647446 279549713 279427395
2581 279427395 279312267 279234543 279208298 279223557 279250183 279252758 279209137 279122524 279020557 278940716 278910923 278935719
2593 278935719 278994808 279054241 279083309 279066963 279009705 278929596 278849277 278787060 278752899 278746548 278758736 278773098
2605 278773098 278771381 278739605 278675041 278588467 278499584 278427353 278379993 278350983 278324089 278284016 278226509 278161240
2617 278161240 278106918 278080883 278089867 278126469 278171253 278200188 278192215 278136024 278034401 277904491 277774086 277672653
2629 277672653 277620754 277621899 277660580 277708969 277739201 277733765 277691097 277622623 277545300 277475014 277422867 277395515
$$ packed form
2546B80822926P4024o619r4528j45035j39103r2773m5223l1185o0406j12057j49956
2557B80020065j45416r4109j7700N0106Q2245P0954K8762k1286n8937p4863p1774n9185
2569B79708862m5261l3283k1496o161J2531L0022L7079K5539p019n3367r7733j22318
2581B79427395j15128p7724k6245J5259K6626K575m3621q6613j01967p9841k9793K4796
2593B78935719N9089N9433K9068j6346n7258q0109q0319o2217l4161o351J2188J4362
2605B78773098j717l1776o4564q6574q8883p2231m7360k9010k6894m0073n7507o5269
2617B78161240n4322k6035Q984L6602M4784K8935p973n6191j01623j29910j30405j01433
2629B77672653n1899J145L8681M8389L0232n436m2668o8474p7323p0286n2147k7352
$$ plain form
2641 277395515 277396240 277424145 277472668 277528820 277576313 277602177 277601986 277582054 277554913 277531109 277512589 277490826 277451916
2654 277451916 277385559 277292252 277185688 277088661 277024536 277007942 277038555 277100163 277165337 277204247 277194862 277130375
2666 277130375 277021275 276891232 276767578 276670704 276606445 276564884 276525784 276467648 276376781 276252575 276107330
2677 276107330 275962219 275840569 275762310 275739708 275776176 275865898 275994759 276142387 276285248 276402016 276479111
2688 276479111 276513996 276514721 276493626 276459122 276409092 276331348 276211891 276047134 275852318 275660667 275510921
2699 275510921 275430584 275422897 275465736 275523605 275564003 275572071 275552883 275524883 275507660 275512753 275540218 275581036
2711 275581036 275620403 275641499 275628948 275573082 275475235 275350418 275223846 275121269 275057373 275028172 275013885
2722 275013885 274988976 274934635 274845333 274728279 274597015 274466133 274348621 274255657 274194336 274162388 274143982
$$ packed form
2641B77395515P25K7905M8523N6152M7493K5864j91j9932k7141k3804j8520k1763l8910
2654B77451916o6357r3307j06564r7027o4125j6594L0613O1608O5174L8910r385o4487
2666B77130375j09100j30043j23654r6874o4259m1561l9100n8136r0867j24206j45245
2677B76107330j45111j21650p8259k2602L6468Q9722J28861J47628J42861J16768P7095
2688B76479111L4885P25k1095l4504n0030p7744j19457j64757j94816j91651j49746
2699B75510921q0337p687M2839N7869M0398Q068j9188k8000j7223N093K7465M0818
2711B75581036L9367K1096j2551n5866r7847j24817j26572j02577o3896k9201j4287
2722B75013885k4909n4341q9302j17054j31264j30882j17512r2964o1321l1948j8406
$$ plain form
2733 274143982 274112244 274040737 273918934 273762054 273607082 273495064 273450985 273472519 273534851 273607159 273668518
2744 273668518 273713474 273747063 273775043 273799839 273823872 273855801 273911381 274005070 274137249 274287510 274419651
2755 274419651 274497795 274502831 274440403 274335899 274221115 274121990 274052563 274015751 274006939 274016018 274027863 274024181
2767 274024181 273987446 273907318 273785591 273635960 273481064 273345604 273251190 273211079 273225517 273278465 273339138
2778 273339138 273369598 273339348 273238792 273084526 272911568 272754879 272631626 272533092 272432060 272299137
2788 272299137 272119427 271899090 271661911 271438408 271254482 271124191 271045647 271001110 270960159 270886803 270750484
2799 270750484 270535984 270247421 269902363 269519482 269107113 268660603 268169575 267630348 267054405 266466980
2809 266466980 265898781 265375423 264912243 264515057 264184093 263916283 263705235 263540668 263411045 263307705
$$ packed form
2733B74143982l1738p1507j21803j56880j54972j12018m4079K1534O2332P2308O1359
2744B73668518M4956L3589K7980K4796K4033L1929N5580R3689J32179J50261J32141
2755B74419651P8144N036o2428j04504j14784r9125o9427l6812q812R079J1845l682
2767B74024181l6735q0128j21727j49631j54896j35460r4414m0111J4438N2948O0673
2778B73339138L0460l0250j00556j54266j72958j56689j23253r8534j01032j32923
2788B72299137j79710k20337k37179k23503j83926j30291p8544m4537m0951p3356j36319
2799B70750484k14500k88563l45058l82881m12369m46510m91028n39227n75943n87425
2809B66466980n68199n23358m63180l97186l30964k67810k11048j64567j29623j03340
$$ plain form
2819 263307705 263228149 263172665 263137188 263105087 263047142 262930050 262729855 262440643 262071724 261634846 261128712
2830 261128712 260532627 259812546 258937168 257894211 256697216 255379791 253980637 252527714 251028576
2839 251028576 249469757 247824631 246064777 244168720 242126827 239940071 237617092 235173378 232635345
2848 232635345 230048256 227482128 225030270 222796345 220874233 219329453 218191509 217459202 217114220
2857 217114220 217131138 217475910 218093929 218897877 219767723 220568962 221185360 221550503 221665325 221592216
2867 221592216 221433468 221301804 221297665 221495934 221942043 222651329 223609905 224775372 226081486 227446671
2877 227446671 228784389 230012474 231057701 231857548 232361469 232535267 232367039 231871071 231084862
2886 231084862 230057335 228832150 227432976 225859184 224091702 222108192 219897594 217468204 214846535
$$ packed form
2819B63307705p9556n5484l5477l2101n7945j17092k00195k89212l68919m36878n06134
2830B61128712n96085p20081q75378j042957j196995j317425j399154j452923j499138
2839B51028576j558819j645126j759854j896057k041893k186756k322979k443714k538033
2848B32635345k587089k566128k451858k233925j922112j544780j137944p32307l44982
2857B17114220J6918L44772O18019Q03948Q69846Q01239O16398L65143J14822p3109
2867B21592216j58748j31664m139J98269M46109P09286R58576J165467J306114J365185
2877B27446671J337718J228085J045227P99847N03921J73798j68228m95968p86209
2886B31084862j027527j225185j399174j573792j767482j983510k210598k429390k621669
$$ plain form
2895 214846535 212068901 209172115 206188335 203145676 200073833 197009792 194000893 191103191 188374786
2904 188374786 185866394 183611507 181619473 179874611 178341656 176977425 175744648 174620781 173598270
2913 173598270 172675018 171840210 171063519 170295887 169482155 168582191 167589073 166535416 165484581 164511032
2923 164511032 163680096 163036289 162605324 162405529 162460194 162803307 163473225 164498539 165882416 167593899
2933 167593899 169569492 171723824 173964443 176204720 178372059 180408897 182269115 183911953 185295391
2942 185295391 186372757 187093887 187411633 187294579 186739674 185782032 184496365 182987747 181375809
2951 181375809 179776344 178287430 176983624 175917015 175123596 174629536 174455204 174616146 175121250
2960 175121250 175970325 177152424 178647118 180427990 182469940 184754848 187274914 190028648 193010635
$$ packed form
2895B14846535k777634k896786k983780l042659l071843l064041l008899k897702k728405
2904A88374786k508392k254887j992034j744862j532955j364231j232777j123867j022511
2913A73598270r23252q34808p76691p67632q13732q99964r93118j053657j050835r73549
2923A64511032q30936o43807m30965j99795N4665L43113O69918J025314J383877J711483
2933A67593899J975593K154332K240619K240277K167339K036838J860218J642838J383438
2942A85295391J077366P21130L17746j17054n54905r57642j285667j508618j611938
2951A81375809j599465j488914j303806j066609p93419m94060j74332J60942N05104
2960A75121250Q49075J182099J494694J780872K041950K284908K520066K753734K981987
$$ plain form
2969 193010635 196199589 199550743 202998867 206472530 209913158 213291168 216608829 219888630 223151646
2978 223151646 226397114 229593105 232684212 235611515 238334999 240847168 243170109 245338879 247379131
2987 247379131 249292698 251058693 252649651 254052887 255284195 256384869 257402363 258366165 259274101
2996 259274101 260097141 260802555 261380272 261857777 262292461 262746773 263257980 263821030 264392948 264914951
3006 264914951 265341034 265657043 265882969 266060524 266234283 266435890 266676693 266948261 267228413 267488842
3016 267488842 267703724 267858295 267954216 268010902 268058891 268128281 268236523 268382130 268547764 268710423 268852520
3027 268852520 268967819 269059448 269133568 269194069 269242878 269283924 269327164 269386272 269471207 269579735 269694958
3038 269694958 269792957 269855442 269879971 269879780 269873543 269871407 269868507 269849930 269804764 269737911 269670353 269626369 269616222
$$ packed form
2969A93010635L188954L351154L448124L473663L440628L378010L317661L279801L263016
2978B23151646L245468L195991L091107K927303K723484K512169K322941K168770K040252
2987B47379131J913567J765995J590958J403236J231308J100674J017494R63802R07936
2996B59274101Q23040P05414N77717M77505M34684M54312N11207N63050N71918N22003
3006B64914951M26083L16009K25926J77555J73759K01607K40803K71568K80152K60429
3016B67488842K14882J54571R5921N6686M7989O9390J08242J45607J65634J62659J42097
3027B68852520J15299R1629P4120O0501M8809M1046M3240N9108Q4935J08528J15223
3038B69694958R7999O2485K4529j91o237k136k900j8577m5166o6853o7558m3984j0147
$$ plain form
3051 269616222 269626522 269626465 269586048 269494839 269368820 269240971 269142227 269085751 269063187 269054146 269039841 269011574
3063 269011574 268970776 268922787 268873539 268831310 268812084 268840160 268940639 269124889 269377460 269655113 269899921
3074 269899921 270060730 270113297 270067883 269963474 269851532 269779587 269778080 269856586 270004463 270195751 270396595
3085 270396595 270573349 270701694 270771885 270790043 270772762 270738678 270700092 270659199 270610123 270545101 270461960
3096 270461960 270368252 270281639 270224400 270214500 270256214 270334721 270418301 270469799 270463867 270401306 270313892 270253468
3108 270253468 270269909 270388012 270594349 270842648 271073551 271239758 271322536 271332321 271296253 271240215 271177216
3119 271177216 271107082 271025677 270934410 270843697 270767803 270715351 270682564 270654697 270614796 270554295 270479183 270408058
3131 270408058 270363541 270362473 270408821 270492935 270594940 270690804 270759029 270786419 270772934 270732288 270688133 270664730
$$ packed form
3051B69616222J0300n7m0417r1209j26019j27849r8744n6476k2564r041j4305k8267
3063B69011574m0798m7989m9248m2229j9226K8076J00479J84250K52571K77653K44808
3074B69899921J60809N2567m5414j04409j11942p1945j507P8506J47877J91288K00844
3085B70396595J76754J28345P0191J8158j7281l4084l8586m0893m9076o5022q3141
3096B70461960r3708q6613n7239r900M1714P8507Q3580N1498n932o2561q7414o0424
3108B70253468J6441J18103K06337K48299K30903J66207Q2778R785l6068n6038o2999
3119B71177216p0134q1405r1267r0713p5894n2452l2787k7867l9901o0501p5112p1125
3131B70408058m4517j068M6348Q4114J02005R5864O8225K7390j3485m0646m4155k3403
$$ plain form
3143 270664730 270675049 270712662 270752640 270761108 270712090 270600758 270448227 270294323 270182743 270144691 270188046
3154 270188046 270295925 270433636 270561390 270647297 270677013 270655956 270603771 270544415 270495796 270465488 270452690
3165 270452690 270454140 270467968 270490932 270512371 270510273 270457115 270334816 270149841 269937172 269746571 269617558
3176 269617558 269557686 269539490 269518433 269461327 269365406 269256382 269166660 269110107 269071732 269018764 268925858 268795528
3188 268795528 268660736 268567410 268548851 268608475 268719101 268838291 268927364 268964882 268949509 268893738 268815823
3199 268815823 268733292 268659191 268600903 268560429 268536282 268525410 268525543 268534927 268550930 268568611 268582039 268588066 268589439
3212 268589439 268594093 268608341 268628922 268639240 268615532 268540039 268414783 268265572 268132763 268052673 268039875
3223 268039875 268079796 268135948 268167496 268146706 268069859 267955589 267834759 267736073 267675076 267649784 267643929 267635593
$$ packed form
3143B70664730J0319L7613L9978Q468m9018j11332j52531j53904j11580l8052M3355
3154B70188046J07879J37711J27754Q5907K9716k1057n2185n9356m8619l0308j2798
3165B70452690J450J3828K2964K1439k098n3158j22299j84975k12669j90601j29013
3176B69617558n9872j8196k1057n7106r5921j09024q9722n6553l8375n2968r2906j30330
3188B68795528j34792r3326j8559N9624J10626J19190Q9073L7518j5373n5771p7915
3199B68815823q2531p4101n8288m0474k4147j0872J33R384J6003J7681J3428O027J373
3212B68589439M654J4248K0581J0318k3708p5493j25256j49211j32809q0090j2798
3223B68039875L9921N6152L1548k0790p6847j14270j20830r8686o0997k5292n855q336
$$ plain form
3235 267635593 267606392 267547798 267461071 267353268 267231960 267103729 266976185 266861782 266778393 266744270 266768799
3246 266768799 266844902 266948605 267046585 267108212 267114830 267062531 266957932 266812248 266638432 266451836 266271954
3257 266271954 266121330 266018295 265968418 265959492 265964546 265953884 265909023 265832691 265747566 265684738 265666637 265693150
3269 265693150 265739174 265765038 265736408 265643158 265507050 265372543 265284977 265266571 265304184 265356007 265372887
3280 265372887 265323772 265209312 265058804 264913082 264804554 264746399 264732933 264747944 264772606 264788914 264779186
3291 264779186 264727268 264623947 264474335 264301319 264139786 264023342 263969955 263975086 264015236 264060402 264085503
3302 264085503 264077473 264034653 263962631 263870277 263768520 263669395 263584118 263519287 263473053 263435173 263391685 263331566
3314 263331566 263252640 263162880 263076916 263010254 262973671 262969322 262989998 263020782 263043880 263045139 263020458 262977753
$$ packed form
3235B67635593k9201n8594q6727j07803j21308j28231j27544j14403q3389l4123K4529
3246B66768799P6103J03703R7980O1627O618n2299j04599j45684j73816j86596j79882
3257B66271954j50624j03035m9877q926N054j0662m4861p6332q5125o2828j8101K6513
3269B65693150M6024K5864k8630r3250j36108j34507q7566j8406L7613N1823J6880
3280B65372887m9115j14460j50508j45722j08528n8155j3466J5011K4662J6308r728
3291B64779186n1918j03321j49612j73016j61533j16444n3387N131M0150M5166K5101
3302B64085503q030m2820p2022r2354j01757r9125q5277o4831m6234l7880m3488o0119
3314B63331566p8926q9760q5964o6662l6583m349K0676L0784K3098J259k4681m2705
$$ plain form
3326 262977753 262932301 262896156 262867851 262829990 262758160 262638359 262481422 262323837 262211361 262173805 262205715
3337 262205715 262267227 262306232 262288876 262220478 262141800 262103844 262135334 262224541 262325726 262386360 262376423 262303257
3349 262303257 262203197 262118568 262075787 262077351 262109470 262156448 262209377 262264843 262316856 262351494 262350750 262302284
3361 262302284 262207508 262081242 261942101 261801910 261662159 261519947 261379089 261255455 261172409 261147480
3371 261147480 261180382 261250954 261328182 261384144 261404037 261386528 261336956 261260719 261162319 261049900 260938663
3382 260938663 260848255 260792847 260770683 260761852 260737400 260676212 260578861 260469074 260381355 260341702 260352974 260393677
3394 260393677 260431023 260439472 260414448 260373230 260342865 260342865 260371971 260407639 260417061 260375748 260282745 260165157 260068455
3407 260068455 260037270 260095043 260232792 260411472 260577335 260682011 260697174 260619831 260465355 260257797 260021458
$$ packed form
3326B62977753m5452l6145k8305l7861p1830j19801j56937j57585j12476l7556L1910
3337B62205715O1512L9005j7356o8398p8678l7956L1490Q9207J01185O0634r937p3166
3349B62303257j00060q4629m2781J564L2119M6978N2929N5466N2013L4638p44m8466
3361B62302284r4776j26266j39141j40191j39751j42212j40858j23634q3046k4929
3371B61147480L2902P0572P7228N5962J9893j7509m9572p6237r8400j12419j11237
3382B60938663r0408n5408k2164q831k4452o1188r7351j09787q7719l9653J1272M0703
3394B60393677L7346Q449k5024m1218l0365%K9106L5668R422m1313r3003j17588r6702
3407B60068455l1185N7773J37749J78680J65863J04676J5163p7343j54476k07558k36339
$$ plain form
3418 260021458 259779205 259554367 259371204 259249706 259197769 259204617 259243603 259283772 259304352 259303055 259292793
3429 259292793 259288578 259295616 259307957 259318829 259336071 259387455 259508762 259718704 259995041 260270939 260456867
3440 260456867 260479851 260317841 260010681 259640923 259296207 259035645 258875980 258802395 258791523 258829975 258917618
3451 258917618 259057045 259240608 259445171 259638653 259792099 259888000 259920044 259887409 259790421 259633617 259432869
3462 259432869 259219532 259034233 258911018 258860817 258866024 258891811 258908367 258909645 258916245 258958549 259051991 259179897
3474 259179897 259297485 259355030 259326210 259223347 259090061 258975754 258908882 258885212 258876133 258850174 258792419
3485 258792419 258708954 258618298 258537884 258477287 258442879 258446217 258506203 258639221 258840771 259073124 259270077
3496 259270077 259361515 259306335 259114742 258846722 258585320 258398418 258307896 258283482 258262405 258184643 258025913
$$ packed form
3418B60021458k42253k24838j83163j21498n1937O848L8986M0169K0580j297j0262
3429B59292793m215P038J2341J0872J7242N1384J21307K09942K76337K75898J85928
3440B60456867K2984j62010l07160l69758l44716k60562j59665p3585j0872L8452Q7643
3451B58917618J39427J83563K04563J93482J53446R5901L2044l2635r6988j56804k00748
3462B59432869k13337j85299j23215n0201N207K5787J6556J278O600M2304R3442J27906
3474B59179897J17588N7545k8820j02863j33286j14307o6872k3670r079k5959n7755
3485B58792419q3465r0656q0414o0597l4408L338N9986J33018K01550K32353J96953
3496B59270077R1438n5180j91593k68020k61402j86902r0522k4414k1077p7762j58730
$$ plain form
3507 258025913 257811604 257606792 257487011 257505627 257671375 257946529 258264351 258555527 258770638 258889694
3517 258889694 258915195 258858128 258724842 258514881 258229733 257886906 257529240 257221699 257033520 257012119
3527 257012119 257159119 257420883 257701759 257898865 257947025 257854061 257705975 257632198 257741451 258057537
3537 258057537 258491001 258868885 259014320 258836079 258377666 257795582 257274914 256932354 256765003 256674728
3547 256674728 256550770 256353798 256144657 256041756 256140652 256458378 256942539 257533512 258223362 259050846
3557 259050846 260022602 261014690 261739960 261835175 261041756 259379692 257202301 255080147 253566074
3566 253566074 252966099 253236485 254051399 254986076 255706234 256071587 256130676 256049423 256032314 256266537
3576 256266537 256877537 257877293 259113503 260264416 260924034 260770187 259740849 258109531 256394978
$$ packed form
3507B58025913k14309k04812j19781J8616J65748K75154L17822K91176K15111J19056
3517B58889694K5501n7067j33286k09961k85148l42827l57666l07541j88179k1401
3527B57012119J47000K61764K80876J97106M8160r2964j48086p3777J09253L16086
3537B58057537M33464L77884J45435j78241m58413n82084n20668l42560j67351r0275
3547B56674728j23958j96972k09141j02901R8896L17726M84161N90973O89850Q27484
3557B59050846R71756R92088P25270R5215p93419j662064k177391k122154j514073
3566B53566074n99975K70386Q14914R34677P20158L65353N9089q1253j7109K34223
3576B56266537O11000R99756J236210J150913O59618j53847j029338j631318j714553
$$ plain form
3585 256394978 255134850 254641571 254877491 255514145 256130848 256428070 256337128 255987129 255583897 255296974
3595 255296974 255219822 255397606 255862713 256626816 257627869 258684406 259515247 259838905 259505558 258584690
3605 258584690 257355804 256204090 255475922 255357761 255818920 256621284 257385807 257704411 257288456 256123447
3615 256123447 254561176 253269920 253001270 254234371 256858139 260080719 262671986 263467808 261905937
3624 261905937 258312435 253778152 249677753 247082729 246367550 247186031 248777657 250394325 251608028
3633 251608028 252380180 252937565 253592739 254621830 256209908 258401604 261012802 263550110 265252876
3642 265252876 265334930 263362865 259570045 254882812 250584297 247761154 246835365 247443867 248721619
3651 248721619 249799404 250217400 250042763 249689617 249620361 250132217 251317196 253129120 255436287
$$ packed form
3585B56394978j260128m93279K35920O36654O16703K97222r0942l49999m03232k86923
3595B55296974p7152J77784M65107P64103J001053J056537Q30841L23658l33347r20868
3605B58584690j228886j151714p28168j18161M61159Q02364P64523L18604m15955j165009
3615B56123447j562271j291256k68650J233101K623768L222580K591267P95822j561871
3624B61905937l593502m534283m100399k595024p15179Q18481J591626J616668J213703
3633B51608028P72152N57385O55174J029091J588078K191696K611198K537308J702766
3642B65252876Q2054j972065l792820m687233m298515k823143r25789O08502J277752
3651B48721619J077785M17996j74637l53146o9256N11856J184979J811924K307167
$$ plain form
3660 255436287 258002853 260454006 262329140 263253613 263136177 262234364 261002789 259798679 258646832
3669 258646832 257242508 255212059 252458115 249350758 246626129 245056458 245102425 246751003 249595146
3678 249595146 253047161 256516552 259466648 261394043 261852703 260588112 257725258 253860760 249942341
3687 249942341 246950150 245535297 245805683 247363052 249540272 251686020 253349648 254320278 254577446
3696 254577446 254244766 253585777 253000221 252946663 253764248 255460606 257597084 259381924 259971657 258856373
3706 258856373 256135082 252529716 249118481 246909580 246459789 247707214 250071602 252743454 255002785
3715 255002785 256427155 256930504 256673088 255931549 255005817 254181995 253723183 253844223 254652100 256072960
3725 256072960 257807922 259358482 260139370 259665108 257761784 254726810 251343727 248689880 247755032
$$ packed form
3660B55436287K566566K451153J875134R24473j17436r01813j231575j204110j151847
3669B58646832j404324k030449k753944l107357k724629j569671M5967J648578K844143
3678B49595146L452015L469391K950096J927395M58660j264591k862854l864498l918419
3687B49942341k992191j414853K70386J557369K177220K145748J663628R70630K57168
3696B54577446l32680o58989n85556n3558Q17585J696358K136478J784840N89733j115284
3706B58856373k721291l605366l411235k208901m49791J247425K364388K671852K259331
3715B55002785J424370N03349k57416p41539r25732q23822m58812J21040Q07877J420860
3725B56072960J734962J550560P80888m74262j903324l034974l383083k653847r34848
$$ plain form
3734 247755032 249006500 252109814 255990162 259263344 260852165 260468292 258680553 256517944 254838448
3743 254838448 253846951 253059406 251725655 249426022 246443787 243667717 242090530 242230949 243845501
3752 243845501 246094112 248030148 249093437 249320049 249187508 249245205 249780579 250701675 251650810 252229557
3762 252229557 252186413 251491833 250313244 248947525 247751560 247068653 247137871 247999401 249441395 251040916
3772 251040916 252307644 252874298 252643032 251809139 250750160 249841404 249296131 249110813 249132957 249199257
3782 249199257 249256153 249390755 249760571 250474358 251508541 252715378 253913765 254991474 255937214
3791 255937214 256774673 257451782 257783508 257516785 256493340 254797440 252769833 250852985 249360886
3800 249360886 248334579 247595673 246965485 246489258 246483841 247347336 249247189 251904106 254638615 256671371
$$ packed form
3734B47755032J251468L103314L880348L273182J588821l83873j787739k162609j679496
3743B54838448r91497p87545j333751k299633k982235k776070j577187J40419J614552
3752B43845501K248611J936036J063289K26612j32541N7697N35374R21096R49135N78747
3762B52229557m3144o94580j178589j365719j195965o82907O9218Q61530J441994J599521
3772B51040916J266728N66654k31266q33893j058979r08756n45273j85318K2144O6300
3782B49199257N6896J34602L69816P13787J034183J206837J198387J077709R45740
3791B55937214Q37459O77109L31726k66723j023445j695900k027607j916848j492099
3800B49360886j026307p38906o30188m76227n417Q63495J899853K656917K734509K032756
$$ plain form
3810 256671371 257492371 257066307 255756969 254045181 252249680 250437489 248557720 246667194 245053730
3819 245053730 244150238 244294052 245502415 247425194 249512920 251290321 252563210 253435574 254144077
3828 254144077 254828682 255389614 255516682 254867191 253282146 250915470 248202229 245688095 243818398
3837 243818398 242805901 242650185 243283882 244733162 247155399 250684090 255145512 259830093 263520145
3846 263520145 264857597 262933140 257809772 250678635 243507309 238307362 236359234 237762871 241514835
3855 241514835 246038609 249879494 252226772 253055363 252896423 252421265 252073441 251912308 251693897
3864 251693897 251099453 249970837 248434258 246865234 245724945 245355377 245835972 246966705 248376350
3873 248376350 249690590 250666370 251230679 251425514 251321545 250969181 250413208 249737854 249080620 248582954
$$ packed form
3810B56671371Q21000m26064j309338j711788j795501j812191j879769j890526j613464
3819B45053730r03492J43814J208363J922779K087726J777401J272889Q72364P08503
3828B54144077O84605N60932J27068o49491j585045k366676k713241k514134j869697
3837B43818398j012497j55716O33697J449280K422237L528691M461422M684581L690052
3846B63520145J337452j924457n123368p131137p171326n199947j948128J403637L751964
3855B41514835M523774L840885K347278Q28591j58940m75158l47824j61133k18411
3864B51693897n94444j128616j536579j569024j140289l69568M80595J130733J409645
3873B48376350J314240R75780N64309J94835j03969l52364n55973o75354o57234m97666
$$ plain form
3883 248582954 248307171 248190804 248090782 247902946 247677498 247638321 248073750 249153728 250783615 252586060
3893 252586060 254027271 254619675 254099426 252501755 250124531 247418804 244864006 242867050 241696205
3902 241696205 241450462 242060738 243323803 244961052 246684628 248247585 249466972 250227299 250480385
3911 250480385 250253315 249655628 248868504 248100357 247521667 247209282 247133179 247195683 247299480 247402611
3921 247402611 247525482 247707577 247944698 248153591 248193588 247940750 247371655 246604366 245865326 245391865
3931 245391865 245322113 245632000 246154079 246666737 246998749 247094326 247006302 246836338 246665707 246519871
3941 246519871 246377487 246206303 245994396 245759163 245537701 245372047 245299206 245344257 245511093 245773144
3951 245773144 246073227 246339760 246513214 246565247 246498680 246332169 246087189 245791721 245494652 245266724
$$ packed form
3883B48582954k75783j16367j00022j87836k25448l9177M35429J079978J629887J802445
3893B52586060J441211N92404n20249j597671k377224k705727k554798j996956j170845
3902B41696205k45743O10276J263065J637249J723576J562957J219387P60327K53086
3911B50480385k27070n97687p87124p68147n78690l12385p6103O2504J03797J03131
3921B47402611J22871J82095K37121K08893L9997k52838n69095p67289p39040m73461
3931B45391865o9752L09887N22079N12658L32012R5577q8024j69964j70631j45836
3941B46519871j42384j71184k11907k35233k21462j65654p2841M5051J66836K62051
3951B45773144L00083K66533J73454N2033o6567j66511k44980k95468k97069k27928
$$ plain form
3961 245266724 245175762 245244446 245426922 245629177 245764179 245800266 245762997 245690422 245587521 245425091 245188255
3972 245188255 244921970 244716167 244626217 244596958 244474125 244121475 243556747 242979698 242640152 242634220 242805290
3983 242805290 242856922 242606869 242158508 241808090 241726074 241691723 241174049 239790421 237791729 236064873
3993 236064873 235406265 235390110 233628120 226175842 209195213 181122017 144084501
4000 144084501
$$ packed form
3961B45266724r0962O8684J82476K02255J35002L6087l7269p2575j02901j62430k36836
3972B45188255k66285k05803q9950k9259j22833l52650n64728n77049l39546n932J71070
3983B42805290N1632k50053m48361l50418q2016l4351n17674j383628j998692j726856
3993B36064873o58608j6155j761990p452278j6980629k8073196l7037516
4000A44084501
##END=$$ End of the data block
