##TITLE=$$ Begin of the data block
##JCAMP-DX=5.00 $$ ACD/SpecManager v 10.08
##SPECTROMETER/DATA SYSTEM=16PC
##DATE=Mon Aug 05 12:01:54 2013
##DATA TYPE=INFRARED SPECTRUM
##DATA CLASS=XYDATA
##ORIGIN=
##OWNER=
##NPOINTS=3601
##FIRSTX=400.00000000
##LASTX=4000.00000000
##MAXX=4000.00000000
##MINX=400.00000000
##MAXY=404.76190186
##MINY=6.35085106
##XFACTOR=1.0000000000
##YFACTOR=0.000001000000000
##FIRSTY=79.45204163
##DELTAX=1.00000000
##XUNITS=1/CM
##YUNITS=TRANSMITTANCE
##XYDATA=(X++(Y..Y))
400G9452042J7884277J3542313k1437569j6292931L3269860L9313697P005875L614212
408A56351776L0655991J4794037o7464768m8810737J01551383R3130631p5136795j08505005
416I6566513n5896618j6367126O0849239P1744537M675904J0222412J00805633P6159821
424C48760315q6557892r5710297L8016251O5729721M3547089m107788j36270325j41223190
432C2183884k5833033K5649141P4202660O0160965m8500725o4016746k729988J2965461
440F4081619P459214N586814M67369n211303j5880726j6503002l0290365K0568132
448C0277752K04958652J69525498j20760773j72427078l7882423r64379l351494N507943
456G4883698J7396377J4632347o189537j3766388j5527939j3058204j808766J610543
$$ plain form
400 79452042 97336319 110878632 89441063 73148132 106417992 145731689 152737564 156351776
408 156351776 187007767 201801804 134337036 85526299 187077682 280208313 205071518 96566513
416 96566513 40669895 24302769 85152008 156896545 161572449 171794861 272600494 348760315
424 348760315 262202423 166492126 204508377 270238098 313785187 309677399 173407074 32183884
432 32183884 6350851 31999992 106202652 166363617 117862892 53846146 51116158 64081619
440 64081619 71540833 77127647 77595016 72383713 56502987 39999985 9709620 30277752
448 30277752 235236404 404761902 284001129 111574051 73691628 72727249 69375755 74883698
456 74883698 92280075 106912422 100722885 86956497 71428558 58370354 56561588 58172131
464E8172131l10757r21200k032902l049133n092407m269551J83651J316834l75176
473D3621490P8370K586387K542427j31157n17414J589180M49345n029270m737973J522301
483D1973686K846409R64878j39450k110195k356030j279735J38210L431774L445389
492D6914936j01948r30809L13469o7398j784157k295948k363491j484993J017098J930641
502D1147400K022430J437237o62422j071762K7847J56998l60108l40892K06638J31916
512D2695282n22659p76409j076817o14956J071907J323963L14736R895l4645q225L51811
523D2733883J83895o76682p09651J09554J62289n07401m57264K59663M13082J55258
533D1666626J07170J24287J63650L81161J96171n56683o35315j41430Q9669L50811
$$ plain form
464 58172131 57861374 56940174 54907272 51858139 46765732 42496181 42679832 43996666 43621490
473 43621490 43699860 46286247 48828674 48697517 48180103 49769283 50218628 45189358 40451385 41973686
483 41973686 44820095 45784973 45645523 43535328 41179298 39899563 40037773 43469547 46914936
492 46914936 46812988 45882179 46195648 46128250 44344093 42048145 39684654 38199661 39216759 41147400
502 41147400 43169830 44607067 43944645 42872883 42900730 43057728 42697620 42356728 42563366 42695282
512 42695282 42172623 41396214 40319397 39704441 40776348 42100311 42415047 42424942 42390297 42382072 42733883
523 42733883 42917778 42241096 41531445 41640999 41803288 41295887 40838623 41098286 41511368 41666626
533 41666626 41773796 41898083 42061733 42442894 42639065 42082382 41447067 41305637 41395306 41746117
543D1746117L06007n7098l53146r14692p97108J59695L70716O7520r1098l28209m10366
554C9698338l64041l16978k42279j20068J34632J61865k0504j24359k34508k99931
564C8272167k83767l84495o82068o58348l70503j08120M36493L21961o20602p74288
574C5148430l56175j15013K49363K84695J2161k00916o27422n43454J54404L28491
584C4334564K28214o462q26404n68413J046272J239182P0976P7248J132560J202942
594C7930679N16583J94713j98433m1080Q75523J094600Q53730O59084K95662J16993
604D2298054L2093N1307L67569J98628o15646o52646P5840J94336j19831k00821j95835
615D1433048j82152r3891j17561l15907k51552P7843K25257L59822K51770j85394l76202
$$ plain form
543 41746117 42052124 41995026 41641880 40727188 39930080 40089775 40460491 40528011 40436913 40108704 39698338
554 39698338 39334297 39017319 38775040 38654972 38789604 38951469 38930965 38806606 38572098 38272167
564 38272167 37988400 37603905 36921837 36263489 35892986 35784866 36221359 36543320 35922718 35148430
574 35148430 34792255 34677242 34926605 35211300 35223461 35022545 34395123 33851669 34006073 34334564
584 34334564 34562778 34556316 33729912 33161499 34207771 35446953 35517929 35595177 36727737 37930679
594 37930679 38447262 38641975 38443542 38402462 39277985 40372585 41226315 41885399 42181061 42298054
604 42298054 42330147 42381454 42749023 42947651 42332005 41679359 41755199 41949535 41829704 41628883 41433048
615 41433048 41250896 41157005 41039444 40723537 40471985 40549828 40775085 41134907 41386677 41201283 40825081
626D0825081n15820l99349J34537K35535q2898k4341K96188N42160R54178R06418K66579
637D3138268J89540O83213N61023k70584k51171O41346P57958K75322J35589J59790
647D6020294J21567P9990K4823j13610m6539L06511L34598N7553O748J41216R3220
658D7026371j49773j69872q655Q2302L22509Q5160r69838q55396M29390Q93784J027775
669D7713757Q61930J32180j35994j38233j17470Q9740P2262j85226k10285j14323P5653
680D8043991N88654N35514j47918l15903j81484l8361L38864L42178o5849j27701P2265
691D9044250J14037Q2706N7721k4292J0345J99772K17487J05927K1816j12652j42982
702D9574135p9941l5141L2425P0141J21784O4636j47674k07047j43669j44958j30700
$$ plain form
626 40825081 40309261 39909912 40044449 40279984 40197086 40172745 40468933 41011093 41965271 42871689 43138268
637 43138268 43327808 44011021 44572044 44301460 44050289 44691635 45449593 45724915 45860504 46020294
647 46020294 46141861 46221851 46246674 46133064 46086525 46393036 46727634 46785187 46791935 46933151 47026371
658 47026371 46876598 46706726 46698071 46780373 47102882 47188042 46218204 45362808 45792198 46685982 47713757
669 47713757 48575687 48707867 48571873 48433640 48316170 48405910 48478172 48292946 48082661 47968338 48043991
680 48043991 48632645 49168159 49020241 48704338 48522854 48484493 48823357 49165535 49099686 48971985 49044250
691 49044250 49158287 49240993 49298714 49274422 49284767 49484539 49702026 49807953 49829769 49717117 49574135
702 49574135 49494194 49459053 49491478 49561619 49683403 49748039 49600365 49393318 49249649 49104691 48973991
713D8973991k34630m85993o34166q12630p38358l60965j65272o8878Q3397K82528M09267
724D6248291N01251N26909N26711L70002n2856j72661q2352K0386K74635L21457J71902
735D8653675J40667K00439J45649l6598q9168l5523l9055l4477j19827l81493l76106
746D8028183j07407l814K6893M4037M1290j5518j66107k17674k56729j30371L30261
757D7573044K96684k61425l94367k26330k10308l00720k27188M7920J03451K597q6448
768D6316910k20181l41007n40688n09906k59922n5100K74063L13759N7507n5077j53255
779D4827103j59787n2143K121L8483Q2420J20140J81126L16143K92397N4741N6552
790D5759296K62047L60653M41601M58336M18567L38006J25553J29795L91220L99280
$$ plain form
713 48973991 48739361 48253368 47619202 46806572 46068214 45707249 45541977 45473099 45556496 45839024 46248291
724 46248291 46749542 47276451 47803162 48173164 48120308 47947647 47865295 47885681 48160316 48481773 48653675
735 48653675 48794342 48994781 49140430 49103832 49014664 48979141 48940086 48905609 48785782 48404289 48028183
746 48028183 47920776 47916962 47943855 47987892 48029182 48013664 47847557 47629883 47373154 47242783 47573044
757 47573044 47869728 47608303 47213936 46987606 46777298 46476578 46249390 46297310 46400761 46403358 46316910
768 46316910 46096729 45755722 45215034 44705128 44445206 44390106 44664169 44977928 45035435 44980358 44827103
779 44827103 44667316 44615173 44617294 44655777 44738197 44858337 45039463 45355606 45648003 45702744 45759296
790 45759296 46021343 46381996 46823597 47281933 47700500 48038506 48164059 48293854 48685074 49084354
800D9084354J64006J55594L41915L81065L16120L16406L82042L43178K01489J19995
810E1806164M5345K7874N3310J28270L75770K96807k33746k16434L28418M82559M04267
821E3498604L78609L55766K49817l342o1771M0577R7396J34228K54940N49317N53989
832E6048130K81216J45126j7357L1639L67855M50253L70048L03128J36779J45936L57555
843E8620308L88817L03768K28809N9819Q6811L41629M06574L89671K76257p0431q8928
854F0943104K24899K92992K19989J65104O1848J6762J6353P821j7216K7420J74236
865F2133312K06707J94336P5436k93827k76516J37684K70393K70844K20153M1153l8742
876F2940933q6571o1775P8678J21998J24001P4127r0839j07525L3855L0590q3732j41098
$$ plain form
800 49084354 49248360 49403954 49745869 50126934 50443054 50759460 51141502 51484680 51686169 51806164
810 51806164 51851509 51879383 51932693 52060963 52436733 52733540 52499794 52283360 52611778 53094337 53498604
821 53498604 53877213 54232979 54482796 54479454 54417683 54458260 54555656 54689884 54944824 55494141 56048130
832 56048130 56329346 56474472 56457115 56488754 56856609 57306862 57676910 57980038 58116817 58262753 58620308
843 58620308 59009125 59312893 59541702 59601521 59688332 60029961 60436535 60826206 61102463 61032032 60943104
854 60943104 61168003 61460995 61680984 61846088 61907936 61924698 61941051 61948872 61931656 61959076 62133312
865 62133312 62340019 62534355 62609791 62315964 62039448 62177132 62447525 62718369 62938522 62979675 62940933
876 62940933 62854362 62792587 62871265 62993263 63117264 63191391 63100552 62993027 63026882 63057472 62973740 62832642
888F2832642k07375j87138o1534j408O3061K3151j04114k78428o04938p03549o02176
899F0168194n69248m91833n53322p94529q69038q47480p94007o22726o13068p49733
909E3263210q14819q91731q64888p11273o38511n93113n81433o52359o04080m12681
919D6498322l75603m83418m76764m04385l30685k31647j39286m4129M7898J72683J92597
930D4425583P5554Q7311K06039K53128K53918K85625L30998L81801M72023M73736L76728
941D7622444L49709L86287L43205K36988J44432K338j3256Q1036J75621L28804M16851
952E0074459M76597M84135M04762M01115M56642M74835M90856M60411L89576K98309
962E4411697J49491P1453M8469J5019o840m0172r2961j10435q5736j01329j19137k09046
$$ plain form
888 62832642 62625267 62438129 62376595 62375187 62438248 62461399 62357285 62078857 61473919 60770370 60168194
899 60168194 59598946 59107113 58553791 57759262 56890224 56042744 55248737 54626011 54012943 53263210
909 53263210 52448391 51556660 50691772 49980499 49341988 48748875 48167442 47515083 46911003 46498322
919 46498322 46122719 45639301 45162537 44758152 44427467 44195820 44056534 44012405 44060303 44232986 44425583
930 44425583 44501137 44588448 44794487 45047615 45301533 45587158 45918156 46299957 46771980 47245716 47622444
941 47622444 47972153 48358440 48701645 48938633 49083065 49085403 49072147 49153183 49328804 49657608 50074459
952 50074459 50551056 51035191 51439953 51841068 52297710 52772545 53263401 53723812 54113388 54411697
962 54411697 54561188 54632641 54681110 54696129 54689289 54649117 54556156 54445721 54359985 54258656 54139519 53930473
974E3930473m68467m38095n6984k8420l12637l65616l12042j97289R2507J47152j2829
985E1977753n9677n7934p7271j02783j24741j62338j48727m9256o9618k35485k38468
996E0651455q1394o1489j42933j71948j57547k17510l28396m66301o96991p81559p31086
1007D6814301p40242p78489p73475o81210p50088j019931j083043j006839r29379q12816
1017C8238789o70769m73950l26088k34962o6017K12501L38795K99740M09317O44016
1027C8371372P83871Q99387R28284Q15392Q43570J033592J019478Q38188P07554N55230
1037D6795918M52827L88241L38150L25393K81621K00389J75476K34627J72783j9573
1047D9345852r9373j05762j25409r2815j83609m10126n47649o50429p26318p60197
$$ plain form
974 53930473 53462006 53023911 52966927 52938507 52625870 52260254 51948212 51750923 51843430 51990582 51977753
985 51977753 51918076 51860142 51782871 51680088 51555347 51393009 51244282 51195026 51125408 50889923 50651455
996 50651455 50570061 50508572 50365639 50193691 50036144 49818634 49490238 49023937 48326946 47545387 46814301
1007 46814301 46074059 45295570 44522095 43840885 43090797 42070866 40987823 39980984 39051605 38238789
1017 38238789 37568020 37094070 36767982 36533020 36467003 36679504 37018299 37318039 37727356 38371372
1027 38371372 39155243 40054630 40982914 41798306 42641876 43675468 44694946 45533134 46240688 46795918
1037 46795918 47248745 47636986 47975136 48300529 48582150 48782539 48958015 49192642 49365425 49345852
1047 49345852 49246479 49140717 49015308 48922493 48738884 48328758 47781109 47130680 46404362 45644165
1057D5644165q04901q30223r04488j078941j080631r32740q15799o87336n36774l38223
1067C7634109k06184j24237m3896n123J03188L08868L89385L85643L56484K56134K08496
1078C9262867J90353J70494J84704J20949m0436j08841q9927j51924k91893l53409
1088C8892937l86788l47351j79481j50563k60589k42211j20903o2202l910k9446j76620
1099C6932873k11048j67084j41811j22452o3061O9714R6534L0854k148l6835o1153
1110C6324383p6271q9741j25359q0398P7488J15944K6344P5436K80498L05439J67584
1121C7001347J33632J47488J66702K19967K34695K18419K13596K11906K04041J92428
1131C8944221J76407R2698J94976N41855O44898N57445N54394N71014N91042O28399
$$ plain form
1057 45644165 44839264 44009041 43104553 42025612 40944981 40012241 39196442 38509106 37972332 37634109
1067 37634109 37427925 37303688 37259792 37254669 37357857 37666725 38056110 38441753 38798237 39054371 39262867
1078 39262867 39453220 39623714 39808418 39929367 39888931 39780090 39690163 39538239 39246346 38892937
1088 38892937 38506149 38158798 37979317 37828754 37568165 37325954 37205051 37142849 37138939 37109493 36932873
1099 36932873 36721825 36554741 36412930 36290478 36227417 36297131 36393665 36424519 36422371 36385536 36324383
1110 36324383 36248112 36158371 36033012 35952614 36030102 36146046 36172390 36247826 36528324 36833763 37001347
1121 37001347 37134979 37282467 37449169 37669136 37903831 38122250 38335846 38547752 38751793 38944221
1131 38944221 39120628 39213326 39408302 39950157 40595055 41152500 41706894 42277908 42868950 43497349
1141D3497349O43421O32999O49212O88935P12467P35119P35256O99116P03239P83493
1151E0480606P19902M79912M13444M96170M75338L96775L29735K60971J74118O1298
1161E4288269k9709j17683j75617j82488k49622l78441m52282n03445n19516m56833
1171E1222633n02441o50620p37239q17894q34347p58598p61132q02944q69701r92585
1181D3495132j061248j117256j104973r65596r90032j196625j221202j086331j065994
1190C3685875j131058j124096j071596j025129r70314r13359q30816q10410q82959
1199B4926138q37446o59870o17241o88984o90436o74032o14763n04208m01281k58995
1209A8978882k06566k49481k36798j99890j64222j06739r4534j26196j40381j73496
$$ plain form
1141 43497349 44140770 44773769 45422981 46111916 46824383 47559502 48294758 48993874 49697113 50480606
1151 50480606 51200508 51680420 52093864 52590034 53065372 53462147 53791882 54052853 54226971 54288269
1161 54288269 54258560 54140877 53965260 53782772 53533150 53154709 52702427 52198982 51679466 51222633
1171 51222633 50720192 50069572 49332333 48514439 47680092 46921494 46160362 45357418 44487717 43495132
1181 43495132 42433884 41316628 40211655 39246059 38256027 37059402 35838200 34751869 33685875
1190 33685875 32554817 31430721 30359125 29333996 28363682 27450323 26619507 25809097 24926138
1199 24926138 24088692 23428822 22811581 22122597 21432161 20758129 20143366 19639158 19237877 18978882
1209 18978882 18772316 18522835 18286037 18086147 17921925 17815186 17720652 17594456 17454075 17280579
1219A7280579j41549l4954K3629O9976Q3352M9591M5751O1011O1393M3392N4764Q6571
1231A7683506J26600K23017J95265K123j1208J57597J54089J3853n0999j25099q2062
1242A8286682J29866J77263J01067P0690M8948J5163p3026k5583J98459K45190J22713
1253A9297432J52517L19029L62753K83909L41081N31220O07826O27564O09924N22398
1263B3655653M75502L99637M62532P08056P93005P46917P94863R25471R58824Q97644
1273C0818104R10784R64475J024601J143265J146126J032711R78969R26689R32431
1282C9878155J004764J052666J117470J124550J060081J053738J123451J067638Q43811
1291D9326324Q23357J004311J022819R31763Q83171Q57285P81009O16741N88013O96159
$$ plain form
1219 17280579 17139030 17104076 17127705 17197681 17281033 17330624 17376375 17437386 17498779 17542171 17596935 17683506
1231 17683506 17810106 18033123 18228388 18230511 18219303 18376900 18530989 18544842 18493843 18368744 18286682
1242 18286682 18416548 18593811 18694878 18765568 18814516 18829679 18756653 18731070 18929529 19174719 19297432
1253 19297432 19449949 19768978 20131731 20415640 20756721 21287941 21895767 22523331 23133255 23655653
1263 23655653 24131155 24530792 24993324 25701380 26494385 27241302 28036165 28961636 29920460 30818104
1273 30818104 31728888 32693363 33717964 34861229 36007355 37040066 38019035 38945724 39878155
1282 39878155 40882919 41935585 43053055 44177605 45237686 46291424 47414875 48482513 49326324
1291 49326324 50149681 51153992 52176811 53108574 53991745 54849030 55630039 56246780 56834793 57530952
1301E7530952P12227O63113O70078O91292P72453R77562J004891Q52203Q30032R39560
1311F5644363Q65311N87990N00297N71824N31196M04022L59108L89984L53569K77901
1321G0485565J93741N2765J7303Q5694J02257Q8859J13632J76041K10007K54028K19871
1332G1999763J01380J1223j09787j37833l2539p9300k20108m01734p20405q44574p95273
1343F8770813q20251q83393q81553q64480p36358m54018k86079j76167q1421l5308
1353F3551785N3096J91090K58205K44667L09853M59213N11505N35057M37569J58600
1363F6710640L2112l8788o94K25090K70370J95977J26747L2211r0622k32750m27437
1374F6802856q57254p58979j76743L02460J011040J206062R42299P43293L65258K59590
$$ plain form
1301 57530952 58243179 58906292 59576370 60267662 61040115 62017677 63022568 63874771 64704803 65644363
1311 65644363 66509674 67097664 67597961 68169785 68700981 69105003 69464111 69854095 70207664 70485565
1321 70485565 70679306 70732071 70749374 70835068 70937325 71026184 71139816 71315857 71525864 71779892 71999763
1332 71999763 72101143 72112366 72002579 71864746 71832207 71752907 71532799 71131065 70410660 69566086 68770813
1343 68770813 67950562 67067169 66185616 65321136 64584778 64130760 63844681 63668514 63587093 63551785
1353 63551785 63604881 63795971 64054176 64298843 64608696 65067909 65579414 66114471 66552040 66710640
1363 66710640 66742752 66703964 66703270 66928360 67198730 67394707 67521454 67553665 67463043 67230293 66802856
1374 66802856 65945602 65186623 65009880 65312340 66323380 67529442 68471741 69215034 69580292 69839882
1384F9839882M38713M01550K18651J08673l4073n790J95335L58055O61400O00380N7770
1395G2840546P270M18145M39331J97601L6743k47246j82411L30612M22196K20199Q2756
1406G4565742j51611j95450o4232J6282J64489J32225j13655j92688k29004j06598
1416G3825500K94617L78250K97928L5431o91490p35947k7061M432n12863o62872o00792
1427G1605133o21986o66878o78520o68877o47026o36742n33775k25395k66892o76368
1437F5982674q26073q67218q22907n87867n59998p07554p59865p83489p83088o79539
1447E8605076p84779j108764j299931j470402j523327j639316j192879J35872M41696
1456E0163246n9631l26298o74534q81622j054695r88220n65434m59194p47563m45438
$$ plain form
1384 69839882 70278595 70680145 70898796 71007469 70973396 70967606 71162941 71520996 72182396 72782776 72840546
1395 72840546 72847816 73265961 73705292 73902893 73939636 73692390 73509979 73840591 74262787 74482986 74565742
1406 74565742 74414131 74218681 74154449 74170731 74335220 74467445 74353790 74161102 73932098 73825500
1416 73825500 74120117 74498367 74796295 74831726 74140236 73404289 73377228 73381660 72868797 72205925 71605133
1427 71605133 70983147 70316269 69637749 68968872 68321846 67685104 67151329 66925934 66659042 65982674
1437 65982674 65156601 64289383 63466476 62878609 62318611 61611057 60851192 60067703 59284615 58605076
1447 58605076 57820297 56711533 55411602 53941200 52417873 50778557 49585678 49721550 50163246
1456 50163246 50103615 49777317 49102783 48221161 47166466 46178246 45612812 45153618 44406055 43960617
1466D3960617L20507J071644K008415K807640L995087L790878J944279J238110J193378
1475F2330555R42898O11664N66551Q31062R44138J062149J020431P53670O87714P71408
1485G0522240P83485P54715P83157R64737Q17421K62139R7183J77833K84531O27991
1495G6075432N84724J29822j3641Q4617j9691l54485l63899k46475K36030J635819
1505G7748253J505920k73514p76123m98390l80798p0480l8765l76252k49382M44580
1515G7035049M60907k24563k70653J86539L50166N09949L03627n30503n83625J77192
1525G7414085K11426l63014m77577l28018j99868J5930J68587M68804K24441r19861
1535G6214935q50753M18121Q27835Q99887O07277m36646o58607j40900j27746m95629
$$ plain form
1466 43960617 44281124 45352768 47361183 50168823 54163910 57954788 59899067 61137177 62330555
1475 62330555 63273453 63885117 64451668 65282730 66226868 67289017 68309448 69063118 69750832 70522240
1485 70522240 71305725 72060440 72843597 73808334 74625755 74887894 74985077 75162910 75447441 76075432
1495 76075432 76660156 76789978 76776337 76860954 76841263 76486778 76122879 75876404 76112434 77748253
1505 77748253 79254173 78980659 78204536 77706146 77325348 77254868 77216103 76839851 76590469 77035049
1515 77035049 77495956 77271393 77000740 77187279 77537445 78047394 78351021 77820518 77236893 77414085
1525 77414085 77625511 77262497 76784920 76456902 76257034 76272964 76441551 76910355 77134796 76214935
1535 76214935 75364182 75782303 76610138 77510025 78117302 77680656 77022049 76881149 76753403 76257774
1545G6257774m94644j83418p7484n7770q5350k41737k39869l0662r7557p39052k77878
1556G3732353J783798J777100j52657r18174j340439j222916j68518L7766m87564m25652
1566G2615097J20949K43645J51062q2970p21481p86301m13567l7216Q26767O76087
1576G2592072o98212r58016l53904k21711l04962k93823k54730k32170j98242k20276
1586F8856026l03818l59581m32663m32251l40553l19939l33572l66562m57245m67537
1596F5042305m02283l80302l59154l90030m77932n51964o76345o65425m76696m66106
1606F0196068o19915o37509n19561n64263p79129q35968q88920o49688J67987J30677
1616E4999779p67445j069950j166653r54746j29059j3328n29454o66404o54362n83839
$$ plain form
1545 76257774 75763130 75579712 75502228 75444458 75359108 75117371 74877502 74846840 74749283 74010231 73732353
1556 73732353 75516151 77293251 77140594 76222420 74881981 73659065 73490547 73528313 73040749 72615097
1566 72615097 72736046 72979691 73130753 73047783 72326302 71540001 71126434 71089218 71915985 72592072
1576 72592072 71893860 70935844 70581940 70360229 70055267 69761444 69506714 69274544 69076302 68856026
1586 68856026 68552208 68192627 67759964 67327713 66987160 66667221 66333649 65967087 65509842 65042305
1596 65042305 64640022 64259720 63900566 63510536 63032604 62480640 61804295 61138870 60662174 60196068
1606 60196068 59576153 58938644 58419083 57854820 57075691 56239723 55350803 54701115 54869102 54999779
1616 54999779 54232334 53162384 51995731 51040985 50911926 50898598 50369144 49702740 49048378 48464539
1626D8464539l23990l07915n10838n98835p81154n54848K12765M88041N87440K78473
1636D6953678q21018r50005j47411j8551l70094l70339k51007Q2802J001026R28952
1646D6038033j55449n89611j081658m61983J979565K232601N82669j02353o20388o47781
1656D7173645J2898K48287K06279M08509R48215R30496L55698J17066j26458R5890
1666E0370525J039791J211621Q35632N08236k55344j12393J167488J320008N69938
1675E6655502K82170R0431R4795L88550M98390L00434P63294K422097K167724k56180
1685F3407207p15328L22579N93948O50597N48767L746R7938Q74787J078056R92683
1695F7854980P34948j75881O6780J882119J786499k53106o21299K42736M80347N32288
$$ plain form
1626 48464539 48140549 47832634 47321796 46722961 45941807 45386959 45599724 46087765 46675205 46953678
1636 46953678 46132660 45182655 45035244 45016693 44646599 44276260 44025253 44108055 45109081 46038033
1646 46038033 45882584 45292973 44211315 43749332 45728897 47961498 48544167 48441814 47821426 47173645
1656 47173645 47186543 47434830 47641109 48049618 48997833 49928329 50284027 50401093 50274635 50370525
1666 50370525 51410316 52621937 53457569 53965805 53710461 53598068 54765556 56085564 56655502
1675 56655502 56937672 57028103 57122898 57511448 58009838 58310272 59073566 61495663 63663387 63407207
1685 63407207 62691879 63014458 63608406 64259003 64807770 64811516 64909454 65784241 66862297 67854980
1695 67854980 68589928 68414047 68480827 70362946 72149445 71896339 71275040 71517776 71998123 72530411
1705G2530411M93980K54036J62293J35131J56929K54128L36319M20616N28786P13638
1715G5986267P41913P20093M55185k66312l97560j2734J37665K60185K78954J44455
1725G8048111J30508K14554K12792J10099J50635K59064M92401J221420R05754p83012
1735H0962326r90890R0217L73932K85439K10281n6717q0444J31561J74065R4940J07742
1746H1302452J82701K25350K95860K47757P1556m8309k47284j68137L16597L39554
1756H2518097j02234j29555J69853K67502L37509K11617k64427l05344Q3016J38595
1766H2924629n9891o5589O271J69495O42990N37223k47596m22814j53801o7833m1481
1777H3221603N8724L10631K69081j50086j65222K22756K35839n6976j53900j89690
$$ plain form
1705 72530411 73024391 73278427 73440720 73575851 73732780 73986908 74323227 74743843 75272629 75986267
1715 75986267 76728180 77448273 77903458 77637146 77239586 77226852 77364517 77624702 77903656 78048111
1725 78048111 78178619 78393173 78605965 78716064 78866699 79125763 79618164 80839584 81745338 80962326
1735 80962326 79971436 80061653 80435585 80721024 80931305 80874588 80794144 80925705 81099770 81194710 81302452
1746 81302452 81485153 81710503 82006363 82254120 82325676 82277367 82030083 81861946 82178543 82518097
1756 82518097 82415863 82286308 82456161 82723663 83061172 83272789 83008362 82703018 82786034 82924629
1766 82924629 82864738 82799149 82805420 82974915 83617905 84155128 83907532 83484718 83330917 83263084 83221603
1777 83221603 83280327 83590958 83860039 83709953 83544731 83767487 84003326 83946350 83792450 83602760
1787H3602760j27411P8225K09076M08355L21015j42266k69508j84059j04691P3715
1797H3865211J49178J93077J21712j49231j98746o5918j5526J4382M0741N8487P0831
1808H4084198Q5716O8184J671j2688K0676J8402j2535j6693l693R461L3073M2984K6871
1821H4345627N8029J91307J33949j88141j86157J28792K12219K10312Q2466l18908
1831H4669495l62801p4509J6144J3611K9640N0141J9615j07575r3597L6758J44722
1842H4341644L59276L03192q4900j82533n1857o6971k03247j85348j2253L6568L532
1853H4257103j793j1368o912K258L5004J31538J11931k5100r4483j69426j42166J358
1865H4087944R6993K38632K14599J5541j09718k75543k73651p8774l35L3996M4083
$$ plain form
1787 83602760 83475349 83553574 83762650 84171005 84492020 84349754 84080246 83896187 83791496 83865211
1797 83865211 84014389 84207466 84329178 84179947 83981201 83915283 83899757 83914139 83954880 84013367 84084198
1808 84084198 84169914 84238098 84239769 84227081 84247757 84266159 84253624 84236931 84233238 84242699 84275772 84318756 84345627
1821 84345627 84403656 84594963 84728912 84540771 84354614 84483406 84695625 84905937 84988403 84669495
1831 84669495 84306694 84232185 84248329 84261940 84291580 84341721 84361336 84253761 84160164 84196922 84341644
1842 84341644 84700920 85004112 84919212 84736679 84684822 84617851 84414604 84229256 84217003 84253571 84257103
1853 84257103 84255310 84243942 84237030 84239288 84274292 84405830 84517761 84492661 84398178 84228752 84086586 84087944
1865 84087944 84184937 84423569 84638168 84653709 84543991 84268448 83994797 83916023 83915688 83949684 83993767
1876H3993767M58Q08M3556L7339j9745k8916J5542q248j40808r8328J61889J85035
1888H4142349Q39n4840n5503m3084K2416K2811l4401o1271r1294p8628l197Q537l2661
1901H3742073m3632m1794m0795n3238j5190J16898J04668n2384j14082j34422j37879
1912H3330223j29890o4255J10489J42074O4011n531j51207j52825R636L5881m6257
1923H3142349m7775J0422K2743J7166j2802j04050j02661k220J7548r156l9459j11290
1935H2780815j15799o1226k3514L0114M4326L5500o821j29005j35422j4091q606j10939
1947H2285332j09719j6716L457k0859l8529q1894p3028K571Q896n7671m6997N1453
1959H1906296M5135o8191q7120m8592o241R4177Q8974j8547p8132j56235j37238r76
$$ plain form
1876 83993767 83994225 83995033 84038589 84075928 84056183 84027267 84042809 84034561 83893753 83795425 83957314 84142349
1888 84142349 84143188 84088348 84032845 83989761 84012177 84034988 84000587 83939316 83848022 83769394 83766197 83774734 83742073
1901 83742073 83698441 83656647 83615852 83562614 83547424 83664322 83768990 83716606 83602524 83468102 83330223
1912 83330223 83200333 83136078 83246567 83388641 83452652 83447121 83295914 83143089 83152725 83188606 83142349
1923 83142349 83094574 83104996 83127739 83144905 83132103 83028053 82925392 82923172 82940720 82931564 82892105 82780815
1935 82780815 82665016 82603790 82580276 82610390 82654716 82690216 82683395 82554390 82418968 82404877 82396271 82285332
1947 82285332 82175613 82158897 82162354 82141495 82102966 82021072 81948044 81950615 81959511 81901840 81854843 81906296
1959 81906296 81951431 81883240 81796120 81747528 81741287 81835464 81924438 81905891 81827759 81671524 81534286 81533310
1971H1533310N6221Q0254Q3564N4833K6924j7983m1580n5168n2139j2039k3369r2293
1983H1540535j05949r1217n3650L6743O5445O3919K0675j16188j27952k1439J1521
1994H1222443J0749Q606k1644n753R1103N5168j47797j67198k3178J4114j831j5045
2006H1019737m7737o7276p7392r6253j44432j21452k6772L7026J36993J07483r4154
2017H0625771j31798l2303k4605q8074p6606k930L7674Q7929P2097k5489o6544r0309
2029H0284813p8178q088J3092J3115j2443r2652j06979p7698l6461N8915P1220R819
2041H0038475k5871q7380o8283O5499P0930m3465o8878l6217l0921l3783l6408m5639
2053G9698059m2602k5246k0981j7166l7171j02615j03996n9395o172R9037J19736P4386
$$ plain form
1971 81533310 81589531 81669785 81753349 81808182 81835106 81817123 81775543 81720375 81668236 81656197 81632828 81540535
1983 81540535 81434586 81343369 81289719 81326462 81391907 81455826 81476501 81360313 81232361 81210922 81222443
1994 81222443 81233192 81241798 81220154 81214401 81305504 81360672 81212875 81045677 81022499 81036613 81034782 81019737
2006 81019737 80972000 80904724 80827332 80731079 80586647 80465195 80438423 80475449 80612442 80719925 80625771
2017 80625771 80493973 80461670 80437065 80348991 80272385 80269455 80307129 80395058 80467155 80441666 80375122 80284813
2029 80284813 80206635 80198547 80211639 80224754 80212311 80119659 80012680 79934982 79898521 79957436 80028656 80038475
2041 80038475 80012604 79925224 79856941 79922440 79993370 79949905 79881027 79844810 79813889 79780106 79743698 79698059
2053 79698059 79655457 79630211 79609230 79592064 79554893 79452278 79348282 79288887 79282715 79381752 79501488 79575874
2065G9575874K5246q0254r4101j2710J167l4714k8846K2415J2703o7017p4455k2911
2077G9222397j526J2276J7120K8801j4809j57287j62483n0187K2538J38755J22879
2088G9178474n9272r5459k6512j458K5772J9959l0304m4273k2271m4082j44219j05140
2100G8651215J13082J32844k6917o4636l8101j7785L1449L9482J2085l906k7726k9663
2112G8771423M28p889p3883n0186Q6280R5581k0072k9900M7470N5527J9172m821m5632
2125G8843498m3442J0209K1453R705q820o6398n0476N1285P6988O4628K4063r1102
2137G8841591j05568k7519J45J3733J0727m0482j1063J12870J46766J50780O8756j84631
2149G8976105k11998m5609M6082J68564J68129K0439k3728o508j0299k1813j2092J8791
$$ plain form
2065 79575874 79601120 79520866 79426765 79414055 79415222 79380508 79351662 79374077 79386780 79319763 79245308 79222397
2077 79222397 79220871 79233147 79250267 79279068 79264259 79106972 78944489 78894302 78916840 79055595 79178474
2088 79178474 79119202 79023743 78997231 78995773 79021545 79041504 79011200 78966927 78944656 78900574 78756355 78651215
2100 78651215 78764297 78897141 78870224 78805588 78767487 78749702 78781151 78820633 78832718 78828812 78801086 78771423
2112 78771423 78771851 78763962 78690079 78639893 78726173 78821754 78801682 78771782 78819252 78874779 78893951 78889130 78843498
2125 78843498 78800056 78810265 78831718 78841423 78832603 78766205 78715729 78767014 78844002 78908630 78932693 78841591
2137 78841591 78736023 78708504 78708649 78722382 78733109 78692627 78681564 78794434 78941200 79091980 79160736 78976105
2149 78976105 78764107 78718498 78764580 78933144 79101273 79121712 79097984 79091476 79081177 79059364 79047272 79066063
2161G9066063M2076Q6380O5735m6227n8105O508N0613J38405J10031o6780j03073l0899
2173G9260727j1086k0477R110R5222R9205K2820k480M27q583k0958l0830n3543l3714
2186G9305840L9886O6711P0145N6862L647l288L2180L9032K8710K6291K4154K7802
2198G9717972M1626M2534L1212K7793M3633J2924r7465q9478M5128P5012L3737J8235
2210G9902863%m075R224R987O966m982m9851k6611P9727J08101Q2634O7589O4491K770
2224H0248833j68251j75408l2570M2397J35017J20926k9259p3905n9250m2054Q507
2235G9974983K5513J4114K0432N1430L2829n6290n8006L3806L6354l1304o2584j05354
2247G9875923p5058O0822Q7501K1836J0971K8923L2135L3806K4627n264p271J4473
$$ plain form
2161 79066063 79108139 79194519 79260254 79214027 79155922 79162430 79213043 79351448 79461479 79394699 79291626 79260727
2173 79260727 79249641 79229164 79238274 79333496 79432701 79455521 79453041 79453468 79444885 79423927 79393097 79339554 79305840
2186 79305840 79345726 79412437 79482582 79539444 79543091 79539803 79571983 79611015 79639725 79666016 79690170 79717972
2198 79717972 79759598 79802132 79833344 79861137 79904770 79917694 79820229 79730751 79775879 79850891 79884628 79902863
2210 79902863 79902863 79898788 79908012 79917999 79924965 79919983 79870132 79843521 79923248 80031349 80113983 80181572 80246063 80248833
2224 80248833 80080582 79905174 79872604 79915001 80050018 80170944 80141685 80067780 80008530 79966476 79974983
2235 79974983 80000496 80014610 80035042 80086472 80119301 80063011 80005005 80038811 80075165 80043861 79981277 79875923
2247 79875923 79800865 79861687 79949188 79971024 79981995 80010918 80043053 80076859 80101486 80096222 80088951 80103424
2259H0103424K7847N1926M2557j862l0945o5590p2647n8555l0777K4772N8938J00158
2271H0149246Q3664p278m1008m3267m2869k7565j7616q301J602K0813J3061l3851l5072
2284H0011559K029K2003M0337N0598O5803M0078n7412n7556M7303N7106n539l1372
2296H0184937n9823m2579M6898N3856j1368l5454n2193l9810L1799K0340j04019q0040
2308G9912544J09078J34704L1372j0391n8006l2356R4009J31966J39091P3914j50322
2319H0375603j45462R9441J52329J13441J3588k74917k72347P103J40213K49771K67861
2330H0726624J70707J21376Q7647L5309o8406n8288O8138J35544K26517J85707q3687
2341H1547188l9337L74199L92486J52367j29242o99883p86537m47563k22656J10718
$$ plain form
2259 80103424 80131271 80183197 80225754 80223892 80192947 80127357 80054710 79996155 79965378 79990150 80049088 80149246
2271 80149246 80232910 80225632 80184624 80141357 80098488 80070923 80053307 80045006 80046608 80067421 80080482 80046631 80011559
2284 80011559 80013588 80035591 80075928 80126526 80192329 80232407 80174995 80117439 80164742 80221848 80216309 80184937
2296 80184937 80125114 80082535 80129433 80183289 80171921 80136467 80084274 80044464 80076263 80096603 79992584 79912544
2308 79912544 80021622 80156326 80187698 80177307 80119301 80086945 80180954 80312920 80452011 80525925 80375603
2319 80375603 80230141 80329582 80481911 80595352 80608940 80334023 80061676 80068779 80208992 80458763 80726624
2330 80726624 80897331 81018707 81106354 81141663 81073257 81014969 81083107 81218651 81445168 81630875 81547188
2341 81547188 81507851 81882050 82274536 82426903 82297661 81597778 80811241 80363678 80141022 80251740
2351H0251740K02041J9524M0672K29385K52221J61125Q1558r1667o3347K07901K61230
2362H1552383J50040J21285P6576J62506M84848M73648J45287M081p8087r3406J114
2373H3000275K5444J4091Q965q919n867L6453J1017j11175j07216K1843N6953L0350
2385H2972214L2020M2702M9118O7062M6402k1820n1857p3188n3788L8933M2648m0840
2397H3049606n6381k5680j7334k2294q270K5055M3968P4715M5967o6467r4704p1304
2409H2876877l3981N7510P9796M2106L0777L0259J6143j9264k0958J4923J7670r659
2421H3082199q629M959L5500J20758J04950j7189o8901r6970r1331k9045j2375m6700
2433H2977226q278J37215J28578m5158p9109j2658O821K2240R178o7207m3396R5970
$$ plain form
2351 80251740 80453781 80473305 80513977 80743362 80995583 81156708 81238266 81146599 81083252 81291153 81552383
2362 81552383 81702423 81823708 81900284 82062790 82547638 83021286 83166573 83170654 83092567 82999161 83000275
2373 83000275 83025719 83039810 83048775 83039856 83033989 83070442 83081459 82970284 82863068 82884911 82941864 82972214
2385 82972214 83004234 83046936 83096054 83163116 83209518 83187698 83135841 83062653 83008865 83047798 83090446 83049606
2397 83049606 82993225 82967545 82950211 82927917 82919647 82944702 82988670 83063385 83109352 83042885 82948181 82876877
2409 82876877 82842896 82900406 82980202 83022308 83053085 83083344 83099487 83080223 83059265 83074188 83091858 83082199
2421 83082199 83073570 83078529 83114029 83234787 83339737 83322548 83253647 83156677 83065346 83036301 83023926 82977226
2433 82977226 82968948 83106163 83234741 83189583 83110474 83097816 83104637 83126877 83136055 83068848 83025452 83121422
2445H3121422J26022Q4976M4678l4264o6131o7734n7915k6199M074O0822N5763k1767
2457H3223747m1130q606k9922j20186j13220j5068L2020P8583O4560m8683m6707O6085
2469H3041473R2698Q1970L5476r9487j13678j3763J7692J0132K8282R1408N7671r3933
2481H3135941j37734j17165q4228J526K9968J6472R613j6380p325N6244M2321o6826
2493H2862427o8573L1471N3024J5618K1385P1815N8670j9332m9019o8901l8147Q3297
2505H2953735R4422J0345k8656p3059o1439K4223N0163N2551K0218p4005j10267j31035
2517H2727196q6525O1775J09985R3216P4578K1843M73J1184j4641r4314r0050j076
2529H2813644L1403L7765L7667K6443K999n7740n4527K1858L3219l647j8097m0581
$$ plain form
2445 83121422 83247444 83332420 83377098 83342834 83276703 83208969 83151054 83124855 83128929 83189751 83245514 83223747
2457 83223747 83182617 83174011 83144089 83023903 82910683 82895615 82927635 83006218 83070778 83022095 82975388 83041473
2469 83041473 83134171 83216141 83251617 83152130 83038452 83024689 83042381 83052513 83080795 83172203 83229874 83135941
2481 83135941 82998207 82881042 82796814 82798340 82828308 82844780 82854393 82838013 82830688 82886932 82929253 82862427
2493 82862427 82793854 82825325 82878349 82893967 82915352 82987167 83045837 83026505 82977486 82908585 82870438 82953735
2505 82953735 83048157 83058502 83029846 82956787 82895348 82919571 82969734 83022285 83042503 82968498 82858231 82727196
2517 82727196 82640671 82702446 82812431 82905647 82980225 83002068 83002541 83013725 82999084 82904770 82814720 82813644
2529 82813644 82845047 82882812 82920479 82946922 82949921 82892181 82837654 82859512 82892731 82889084 82870987 82830406
2541H2830406k0126P0526P1243j3786m1481m4922l5286J0231J1253m0031l1975M3846
2553H2809898M1848k0600o7428j46057j43021n5794q247M7966M3083m7562n5862j0391
2565H2387833L5064J39046J21193l3142q5236p9437p7202n4504m6272m7188m3770l4050
2577H2182335l9765p5225o1745L212L0594M7966L3691k0836n9890j15853j15181o0890
2589H1748413j4587O8451P0709j7121m0405j9050k8206p3120n7984M2725L1013j04950
2601H1605888j19949l4142j2084k8138k0576M005J0186J3443j2902j09360q7379O5468
2613H1274460J10649J00899O3804l3836q7112j31920j29677o6925l6286p125r705p1693
2625H0975533n2140O0532P8964K6108k838l8552n3573n3833m3106m128k525m1893m2320
$$ plain form
2541 82830406 82810280 82880806 82952049 82938263 82896782 82851860 82816574 82826805 82838058 82798027 82766052 82809898
2553 82809898 82851746 82831146 82763718 82617661 82474640 82418846 82410599 82458565 82501648 82454086 82398224 82387833
2565 82387833 82422897 82561943 82683136 82649994 82564758 82485321 82408119 82353615 82307343 82260155 82216385 82182335
2577 82182335 82142570 82067345 82005600 82008812 82039406 82087372 82121063 82100227 82040337 81924484 81809303 81748413
2589 81748413 81733826 81802277 81872986 81855865 81815460 81796410 81768204 81695084 81637100 81679825 81710838 81605888
2601 81605888 81485939 81451797 81439713 81411575 81390999 81395004 81405190 81418633 81405731 81296371 81208992 81274460
2613 81274460 81385109 81486008 81549812 81515976 81428864 81296944 81167267 81100342 81064056 81056931 81047226 80975533
2625 80975533 80923393 80983925 81062889 81088997 81086159 81047607 80994034 80940201 80897095 80892967 80890442 80848549 80806229
2638H0806229o958l128j5610l8010j00799q8524J9645K4773p7919p0427N2620N1636
2650H0553528o5537r0721m8942m8378q1536p0388j5992P912K6489J2802n0521o7063
2662H0061653l5980n7289j38169j50009j07315q0940m2084l5476o0677p4722r7107
2673G9181885r2842o9428l1921M5898O3919L2753R896k5505m7928p7629n9174L3669
2685G8963593M0458l3043m9431m2411j4832P9208N8960r3940j25435o5918m7920m6761
2697G8622528k8793J3298J6380q751m2534j05018j35712j63818j33057j0254J5495
2708G8039764l6926n3955o9672o1508k3582k289L3096N867j13655j30012m1413n0781
2720G7494934j52115j66748j18950r0408m7249m3304p5150j02730j61079j50391p2265
$$ plain form
2638 80806229 80799271 80796143 80780533 80742523 80641724 80553200 80572845 80597618 80519699 80449272 80501892 80553528
2650 80553528 80487991 80397270 80348328 80299950 80218414 80148026 80132034 80139946 80166435 80179237 80128716 80061653
2662 80061653 80025673 79968384 79830215 79680206 79572891 79491951 79449867 79414391 79353714 79278992 79181885
2673 79181885 79089043 79019615 78987694 79033592 79097511 79130264 79140160 79114655 79066727 78989098 78929924 78963593
2685 78963593 79004051 78971008 78921577 78879166 78864334 78943542 79002502 78908562 78783127 78717209 78669289 78622528
2697 78622528 78593735 78607033 78623413 78614662 78572128 78467110 78331398 78167580 78034523 78024269 78039764
2708 78039764 78002838 77948883 77879211 77817703 77794121 77791832 77824928 77830795 77717140 77587128 77545715 77494934
2720 77494934 77342819 77176071 77057121 76966713 76919464 76876160 76801010 76698280 76537201 76386810 76314545
2731G6314545k0363N3505N0087n6359o3560K6436J9409o9786j06430j28006j19499
2742G5899979p0282l7957J91J0971M624k6947j27312j14105K7939N5122k762k1339
2754G5598122k1431m4136j07026r8922l189K403p2952q8219o8878n4238k5421j8783
2766G4997330k6085m4319q8623j01471q5831q7547r1576j12579j55114j86447k27569
2777G3790169k27188j80367j58424j41007j38450j39878j78833k92091k99027j98341
2787G1836563j75972j97555k14768k52388k59781k36320k35489k51602k53937k39754
2797F9518997k50725k86743l06679l16192l33763l71453l62732k85049k95288m01825
2807F6308548m14444l61824l19717k34414k45002l58200m08173m36829m42482m13250
$$ plain form
2731 76314545 76294182 76347687 76397774 76341415 76277855 76304291 76323700 76253914 76147484 76019478 75899979
2742 75899979 75829697 75791740 75791931 75802902 75807526 75780579 75653267 75539162 75567101 75622223 75619461 75598122
2754 75598122 75576691 75532555 75425529 75326607 75323418 75325821 75252869 75164650 75095772 75041534 75016113 74997330
2766 74997330 74971245 74926926 74838303 74736832 74651001 74563454 74471878 74359299 74204185 74017738 73790169
2777 73790169 73562981 73382614 73224190 73083183 72944733 72804855 72626022 72333931 72034904 71836563
2787 71836563 71660591 71463036 71248268 70995880 70736099 70499779 70264290 70012688 69758751 69518997
2797 69518997 69268272 68981529 68674850 68358658 68024895 67653442 67290710 67005661 66710373 66308548
2807 66308548 65894104 65532280 65212563 64978149 64733147 64374947 63966774 63529945 63087463 62674213
2817F2674213l98326l79418l80543l85639m35165n55348o00910n72681o12904p08671
2827E7644608p69593p78175q94737j132870j278256j376129j460125j461673j621651
2836D6871399j961304k154968k268745k364205k429413k450752k458477k345396k126694
2845B6311445j848863j470400j111006p29443l71097j8837L04127O32692Q50153R68170
2855B3516941J056648J066136J124286J268555J221155R78445Q32535P14779O07277
2864C2386757N38849M11987J88850J18020J51729K32433M31107N21278N83722N21755
2874C6086487K80525J76144J62124J08193O4563l9482k36534l25561l23273l64181
2884C5589005m23241m66156n17204n13600m32037m28631m99130n04587m53568m50777
$$ plain form
2817 62674213 62275887 61896469 61515926 61130287 60695122 60139774 59538864 58966183 58353279 57644608
2827 57644608 56875015 56096840 55202103 54069233 52790977 51414848 49954723 48493050 46871399
2836 46871399 44910095 42755127 40486382 38122177 35692764 33242012 30783535 28438139 26311445
2845 26311445 24462582 22992182 21881176 21151733 20780636 20761799 21065926 21698618 22548771 23516941
2855 23516941 24573589 25639725 26764011 28032566 29253721 30232166 31064701 31779480 32386757
2864 32386757 32925606 33337593 33526443 33644463 33796192 34028625 34459732 34981010 35564732 36086487
2874 36086487 36367012 36543156 36705280 36813473 36878036 36838554 36602020 36276459 35953186 35589005
2884 35589005 35165764 34699608 34182404 33668804 33236767 32808136 32309006 31804419 31350851 30900074
2894C0900074m85970m95576n00203m81248m10653m19401m97602n54135o22604o60015
2904B5772667o59514o91604p41648p98035q78406r23992r55200r49263r10091q45099
2914A7419815p55714o29069m37665l04460k21849r7608N5241J96505L63922M46677
2924A6035795M40455M73022N04637N66172O56414P49206Q76236R36867R32407R57918
2934B3129129R97115J020002J034426J038982J051115J002169R01556P80010O22892
2943C1577396M57764K50485J09813K9255p4196k24495k43021j52158m1127J44719K75852
2954C2110287L55720M99867P02358Q71036J026227J178577J346634J445461J484226
2963D1020393J510979J507092J498935J479149J450562J413322J363732J307441J225472
$$ plain form
2894 30900074 30414104 29918528 29418325 28937077 28526424 28107023 27609421 27055286 26432682 25772667
2904 25772667 25113153 24421549 23679901 22881866 22003460 21079468 20124268 19175005 18264914 17419815
2914 17419815 16664101 16035032 15597367 15292907 15071058 14973450 15028691 15225196 15589118 16035795
2924 16035795 16476250 16949272 17453909 18020081 18676495 19425701 20301937 21238804 22171211 23129129
2934 23129129 24126244 25146246 26180672 27219654 28270769 29272938 30174494 30954504 31577396
2943 31577396 32035160 32285645 32395458 32424713 32350517 32126022 31883001 31730843 31689716 31834435 32110287
2954 32110287 32466007 32965874 33668232 34539268 35565495 36744072 38090706 39536167 41020393
2963 41020393 42531372 44038464 45537399 47016548 48467110 49880432 51244164 52551605 53777077
2972E3777077J109073J012230Q93212Q64814R56822R37248Q37563P63775O80923O22749
2982F2455486N89253N46669N06759M56192L89786L41416K82028K93876M08982M16855
2992F6687302L47732K91008J98227J73515K18132K22878K15836J93550J41906J20636
3002F8810722J15258J24000J79268J52939K2079O417R4032J12724R7893P9895L7125
3013F9832352K5604M3388M1962L8338J2878n3047o5498k7703k0767l1830l1418l5766
3025F9728493r583P1861P4074J2635m0268j47316j30249M6897O2012o6353r0408m6448
3037F9465347l7285l3569n0209j16997j00013K7442K4529j14059j26358l6004j0536
3048F8892288p561k9441j09101j12556k4223m0604j67229j85676j26007q6762k5154
$$ plain form
2972 53777077 54886150 55898380 56791592 57656406 58613228 59550476 60388039 61151814 61832737 62455486
2982 62455486 63044739 63591408 64098167 64554359 64944145 65285561 65567589 65861465 66270447 66687302
2992 66687302 67035034 67326042 67524269 67697784 67915916 68138794 68354630 68548180 68690086 68810722
3002 68810722 68925980 69049980 69229248 69382187 69404266 69410683 69504715 69617439 69715332 69795227 69832352
3013 69832352 69857956 69901344 69943306 69981644 69994522 69941475 69875977 69848274 69827507 69795677 69764259 69728493
3025 69728493 69718910 69790771 69864845 69877480 69837212 69689896 69559647 69606544 69668556 69602203 69511795 69465347
3037 69465347 69428062 69394493 69344284 69227287 69127274 69154716 69179245 69065186 68938828 68902824 68892288
3048 68892288 68884727 68855286 68746185 68633629 68609406 68568802 68401573 68215897 68089890 68003128 67977974
3059F7977974j4015m3778q0032j53832j75453j70707j26290q346L4217L6499O966p9613
3071F7203590j30958j87897j79626r0554n4100k4742n1475j71234j87584j08529r8732
3082F5918159j50177j30302k2026k6344j46462j68510j24268j00876n9127o8947j44196
3093F4776924j59508j31958j18881j10763q8433k8732m3388j46416j70136j36207j25908
3104F3516594j17733j16539j24931j27911j26884j31539j42097j48011j67774j38019
3114F2175156l1140k0981r3315j31466j73591j83823j63410j43410j03760r3673r7729
3125F0938858j28601k21706k22992j32969j03974r5867j17206j97747k09877j62746
3135E9345173j47461j60671j24741K40k3223k22111k51103j39736j15440j27411j51611
$$ plain form
3059 67977974 67963959 67920181 67840149 67686317 67510864 67340157 67213867 67205521 67239738 67276237 67283203 67203590
3071 67203590 67072632 66884735 66705109 66614555 66560455 66535713 66484238 66313004 66125420 66016891 65918159
3082 65918159 65767982 65637680 65615654 65589310 65442848 65274338 65150070 65049194 64990067 64921120 64776924
3093 64776924 64617416 64485458 64366577 64255814 64167381 64138649 64095261 63948845 63778709 63642502 63516594
3104 63516594 63398861 63282322 63157391 63029480 62902596 62771057 62628960 62480949 62313175 62175156
3114 62175156 62144016 62123035 62029720 61898254 61724663 61540840 61377430 61234020 61130260 61036587 60938858
3125 60938858 60810257 60588551 60365559 60232590 60128616 60032749 59915543 59717796 59507919 59345173
3135 59345173 59197712 59037041 58912300 58912540 58889317 58667206 58416103 58276367 58160927 58033516 57881905
3146E7881905k36489k12288m9709l5976j51089j87992j90781j90498j88973j47865
3156E6290245j7021l5645k19848k66075k27021j95621j16135j18587k15603k26879
3166E4651810j80317j44936q6212p3406r9613j23429j76811j73569j00399r6679j43265
3177E3253174j77529k39418k31720j41284j18020j49036j35967p7656p7484j23810
3187E1781250j60172k27523k18819j26244q8310n4455q8764k20821k68246k74395k48241
3198D9805260j54328j25599j43459j49628j78527j51162l7311l7003j39831j87542
3208D8500870k18651k37587k59590k19273q3233n0613r3224j25026j88969j99558j64151
3219D6660995j38950r3864r3365j51135j48319r1171p3647p5439q4042j15276j18565
$$ plain form
3146 57881905 57645416 57433128 57383419 57347443 57196354 57008362 56817581 56627083 56438110 56290245
3156 56290245 56273224 56237579 56017731 55751656 55524635 55329014 55212879 55094292 54878689 54651810
3166 54651810 54471493 54326557 54240345 54166939 54067326 53943897 53767086 53593517 53493118 53396439 53253174
3177 53253174 53075645 52836227 52604507 52463223 52345203 52196167 52060200 51982544 51905060 51781250
3187 51781250 51621078 51393555 51174736 51048492 50960182 50905727 50816963 50596142 50327896 50053501 49805260
3198 49805260 49650932 49525333 49381874 49232246 49053719 48902557 48865246 48828243 48688412 48500870
3208 48500870 48282219 48044632 47785042 47565769 47482536 47431923 47338699 47213673 47024704 46825146 46660995
3219 46660995 46522045 46428181 46334816 46183681 46035362 45944191 45870544 45795105 45711063 45595787 45477222
3230D5477222q2134j03832k03800k03728j09577p5863o5399p2766j03523j41166k24209
3241D4091225k15172j03474o9286p9537q6448j14464j13823p6389q4473j43505j49605
3252D2855049j17706r2316m2393m7779j24527j28746p1643n2380m0939n8293j23188
3263D1955139j39908j19159j13797j12465j07929j10603q6453j4778j2565p4482j05023
3274D0957977j42578j29246m6802k6154m5871o0940r9396r4295m0936k5059j9668m7352
3286D0179680j44169j43482k5727l5758j87233j81031k5081J3210k9877l2425J1780
3297C9399887m4060k57827k51198r964L0468q5068j00780n7957m7329m7684n3333o6448
3309C8408707q4183j15944j27029j31298j08220l1444k7180j00185j05332m4895n5027
$$ plain form
3230 45477222 45395088 45291256 45087456 44883728 44774151 44698288 44632889 44560123 44456600 44315434 44091225
3241 44091225 43876053 43772579 43703293 43623756 43537308 43422844 43309021 43232632 43148159 43004654 42855049
3252 42855049 42737343 42645027 42602634 42554855 42430328 42301582 42229939 42177559 42136620 42078327 41955139
3263 41955139 41815231 41696072 41582275 41469810 41361881 41251278 41164825 41150047 41137482 41063000 40957977
3274 40957977 40815399 40686153 40639351 40613197 40567326 40506386 40406990 40312695 40271759 40246700 40227032 40179680
3286 40179680 40035511 39892029 39866302 39830544 39643311 39462280 39437199 39450409 39420532 39388107 39399887
3297 39399887 39355827 39098000 38846802 38836838 38867306 38782238 38681458 38623501 38576172 38528488 38475155 38408707
3309 38408707 38324524 38208580 38081551 37950253 37842033 37810589 37783409 37683224 37577892 37532997 37477970
3320C7477970j55617j31225L9959N5004m3820j22833k61761k75470j69777j06884m1744
3331C6263802P530O7451M9923o0535j14060j50081j61007j27671j34349j86562j78242
3342C5276199j10889q4545q0082p4173o5685q2611j31272j58432j87157j78550j24958
3353C3997845r6226p2456o3561o6780q3256j32633j35467r5418p7678n8075o8333j17542
3365C2930420j37661j55426j32107l8433l0422j01494j22238j23119j12034o1512p3599
3376C1842375j66083j66034p6103n8724r0980j02089j13274j10554q7642q3901r9373
3387C0687618r4677n7625p6602j71757j74452j07168m8662P3553M8301j61861j96003
3398B9720665j00494n1022J5949K1649k8847p7297j61980j88114j82222j33133J5569
$$ plain form
3320 37477970 37322353 37191128 37231087 37286091 37242271 37119438 36857677 36582207 36412430 36305546 36263802
3331 36263802 36271332 36338783 36388706 36328171 36214111 36064030 35903023 35775352 35641003 35454441 35276199
3342 35276199 35165310 35080765 35000683 34926510 34860825 34778214 34646942 34488510 34301353 34122803 33997845
3353 33997845 33901619 33829163 33765602 33698822 33615566 33482933 33347466 33252048 33174370 33116295 33047962 32930420
3365 32930420 32792759 32637333 32505226 32466793 32436371 32334877 32212639 32089520 31977486 31915974 31842375
3376 31842375 31676292 31510258 31434155 31375431 31284451 31182362 31069088 30958534 30870892 30786991 30687618
3387 30687618 30592941 30535316 30458714 30286957 30112505 30005337 29956675 30030228 30078529 29916668 29720665
3398 29720665 29620171 29569149 29585098 29606747 29577900 29500603 29338623 29150509 28968287 28835154 28850723
3409B8850723K6749j00826j25195q3898o8785n9103m5992k2339k5440n1403p8558j50013
3421B8065920j15179O9618P8915p4482j16419j03092q3948k0836j7025p2670q3851
3432B7526951o7402o0009n3097m4536k5582l3331p7104q2827n9461m5443k1864k6201
3444B6930094p9943n9891N3002N9080l7098n4289j3493j2207m4014l7263J7522J0491
3456B6731991p1310o6542K8896L7144l5118l6739K5104K7634k3199k8610J2613l410
3468B6598454q4734r5416n0115k6322J0682p16r6489p1357R1028J19734M9400J2325
3480B6456474m0149m5918o725K2270P3933P1764O818q726J192J9814Q5997O1059p4220
3493B6623583j04548p2384k3365R4128J19164P3217L1090n3931p0072l3615Q511R7202
$$ plain form
3409 28850723 28877472 28776646 28651451 28567553 28498768 28439665 28393673 28371334 28345894 28294491 28215933 28065920
3421 28065920 27950741 28020359 28099274 28024792 27908373 27805281 27721333 27700497 27683472 27610802 27526951
3432 27526951 27459549 27399540 27346443 27301907 27276325 27242994 27165890 27083063 27023602 26978159 26956295 26930094
3444 26930094 26850151 26790260 26843262 26902342 26865244 26810955 26797462 26785255 26741241 26703978 26721500 26731991
3456 26731991 26660681 26594139 26623035 26660179 26625061 26588322 26613426 26641060 26617861 26589251 26601864 26598454
3468 26598454 26513720 26418304 26368189 26341867 26352549 26351833 26255344 26183987 26275015 26394749 26444149 26456474
3480 26456474 26416325 26370407 26363682 26385952 26459885 26531649 26538467 26529741 26530933 26550747 26636744 26697803 26623583
3493 26623583 26519035 26446651 26423286 26517414 26636578 26709795 26740885 26686954 26616882 26583267 26591778 26688980
3505B6688980J15730P0237N2620M5753K6154k0981j3066O1490P3694L7264K6275J6735
3517B7180885L0327Q5976Q6139L1949J6235M173M2080J82774J68585j6928n0282L5500
3529B7797413M8923P153L2949J35041J55592J26911P7270m0363o6401k3485J9289R2913
3541B8363205J42288K06612J83868L5979J7261J11509J29078J10722Q2851J3972L408
3552B9400753N5100N3764k552Q987J10771R0146q5663p3147P2334K28573N40566N50319
3564C0949951K72535J06287r4366j44838m7613K2364J42955J77336J38617J11007M3942
3575C1678177N5431J76335J64867J2852n249M0367J56067M37618M95434L91674K67078
3586C3870651o44o3302L4070J23428L14621L36048J85966J42956J41075J65295K63714
$$ plain form
3505 26688980 26804710 26874947 26927567 26973320 26999474 26978493 26965427 27026917 27100611 27137875 27164150 27180885
3517 27180885 27211212 27297188 27383327 27415276 27431511 27435684 27477764 27660538 27829123 27812195 27761913 27797413
3529 27797413 27846336 27853489 27886438 28021479 28177071 28303982 28381252 28340889 28274488 28251003 28270292 28363205
3541 28363205 28505493 28712105 28895973 28931952 28949213 29060722 29189800 29300522 29383373 29397345 29400753
3552 29400753 29455853 29509617 29507065 29516052 29626823 29716969 29631306 29558159 29630493 29859066 30399632 30949951
3564 30949951 31222486 31328773 31234407 31089569 31041956 31064320 31207275 31384611 31523228 31634235 31678177
3575 31678177 31733608 31909943 32074810 32087662 32082413 32122780 32278847 32716465 33211899 33603573 33870651
3586 33870651 33870007 33806705 33840775 33964203 34278824 34614872 34800838 34943794 35084869 35250164 35513878
3597C5513878K58922J54927J12865P0595J15513K71633L55194M29298M25148L19123
3607C8027096K74418K63527K33268J86516J64650Q4877K36965P50637Q17227N43499
3617D1582680L10852r4868j98650m8806P2598J89972M87736J184150J221489O38035
3627D5345188L38268J5091p534L53123M42101L67614L51456L16048L49640N02273M85420
3638D8858688K98264K32387J88492K72206M68063P32086J248383J324203J064583P42031
3648E5429386P7057q5186J44409L64018Q47484R01009N40993L95488K96379K87724
3658E9198761M29176M38050L38672L16189K65526M21692Q98697J005218Q45528O93779
3668F4851288L48495L41202O88934P91665Q35372O76224J82778K4337Q2329J61644
$$ plain form
3597 35513878 35772800 35927727 36040592 36111187 36226700 36498333 36853527 37282825 37707973 38027096
3607 38027096 38301514 38565041 38798309 38984825 39149475 39234352 39471317 40221954 41039181 41582680
3617 41582680 41893532 41798664 41600014 41551208 41623806 41813778 42301514 43485664 44707153 45345188
3627 45345188 45683456 45698547 45691013 46044136 46486237 46853851 47205307 47521355 47870995 48373268 48858688
3638 48858688 49156952 49389339 49577831 49850037 50318100 51050186 52298569 53622772 54687355 55429386
3648 55429386 55506443 55421257 55565666 55929684 56777168 57678177 58219170 58614658 58911037 59198761
3658 59198761 59627937 60065987 60404659 60720848 60986374 61408066 62306763 63311981 64157509 64851288
3668 64851288 65199783 65540985 66229919 67021584 67856956 68533180 68715958 68740295 68822624 68984268
3678F8984268M16207M25247J46888J69327M18137O02600Q90945R00772O59707M39407
3688G4053505P4455m5372M7371R2774J70135K21825K64503K88864K76116L10661M54804
3699G6209641L74893L2806q5716j12267o439L33000M60717M75456M27459K58706J51062
3710G8519318N5984j4374p8178p5081M265O2157J49063J60644P1694Q7143K26615K06566
3722G9375816K6009k7771P149m532p3097k2271J44982K64267M48990M09675J26602
3733H0675819l1929j54396k55470m02420l11691Q1970K33963K43210K58377K56485
3743H0593918J80458q6975j9905M94148M79073l6759j90903j30439j29418j44737p4722
3754H0933739J50634J49651q3656j43868r6054q5449r3346m9370O5705J04378Q6334
$$ plain form
3678 68984268 69400475 69825722 69972610 70141937 70560074 71162674 72053619 72954391 73614098 74053505
3688 74053505 74127960 74082588 74129959 74222733 74392868 74614693 74879196 75168060 75444176 75754837 76209641
3699 76209641 76584534 76617340 76531624 76419357 76412918 76745918 77206635 77682091 78109550 78368256 78519318
3710 78519318 78575302 78560928 78482750 78407669 78411934 78474091 78623154 78783798 78855492 78942635 79169250 79375816
3722 79375816 79401825 79374054 79381203 79376671 79303574 79281303 79426285 79690552 80139542 80549217 80675819
3733 80675819 80643890 80489494 80234024 79831604 79519913 79601883 79835846 80079056 80337433 80593918
3743 80593918 80774376 80687401 80667496 81161644 81640717 81603958 81413055 81282616 81153198 81008461 80933739
3754 80933739 81084373 81234024 81150368 81006500 80910446 80824997 80731651 80682281 80747986 80852364 80938698
3765H0938698Q0108P7393M2603l0617q1391j57692j28654J3733J06460K33674K21633
3776H1315948L9696j6067k388J1375O2584P1098O9519P485j80931j81725J8479N2238
3788H1267311m1893n0949o577M792j3451J1253N9723J35781L07754K98233J09223J0200
3800H2091400p3860j12625j30943n9845K14553J67374k44217l24219j77459q0849N6671
3811H1325981J47583K26120K42615J99264J36834j4954j5877J77048J51352n9395j77185
3822H2339386l15956k98309q5999r750j7289J2925O1897Q3755P4768R5482J46485J64772
3834H2252167J88064J28441l4691j31393k23686k33696j27671j18667j72539k13074
3844H1313255l40538k30407J28463L66928O50666O85951N04188K73415j32706l76793
$$ plain form
3765 80938698 81018806 81096199 81138802 81108185 81026794 80869102 80740448 80754181 80860641 81094315 81315948
3776 81315948 81355644 81339577 81337189 81348564 81411148 81482246 81551765 81559250 81378319 81196594 81215073 81267311
3788 81267311 81225418 81174469 81167892 81172684 81159233 81170486 81230209 81365990 81673744 81971977 82081200 82091400
3800 82091400 82017540 81904915 81773972 81714127 81928680 82096054 81851837 81527618 81350159 81269310 81325981
3811 81325981 81473564 81699684 81942299 82141563 82278397 82263443 82247566 82424614 82575966 82516571 82339386
3822 82339386 82023430 81725121 81639122 81629372 81612083 81625008 81686905 81770660 81845428 81940910 82087395 82252167
3834 82252167 82440231 82568672 82533981 82402588 82178902 81945206 81817535 81698868 81526329 81313255
3844 81313255 80972717 80742310 80870773 81237701 81888367 82574318 83078506 83351921 83219215 82842422
3854H2842422o24061n51056m0077J14273N9273L58k40043j57402L39843L80585L0663
3865H2154778j02120j90948j51154J28387J18348j90377k32170p4341j3542J9242M4609
3876H1510712N2330O2370R3079N0781j11145j12824O4545O5895q9355j23978j09177
3887H1353233l7643J97914J60858j78024k65221k13341j25503Q0063J79176K32048
3897H1383560K21924J18729N9227J3710l5958q9073j30417j85798j67275n7525j3810
3908H1117294O272r705j00395r8869k4964L3592J51444J17584j08284j54045q2588
3919H0847336j4542J40808J40999k3483p2197o3965m4228K2561L9550K7939m04n6549
3931H0943825j08223k16576j69327P4891J38114Q6167L3684r1790j15226m5082k2797
$$ plain form
3854 82842422 82218361 81667305 81627228 81741501 81800774 81801132 81561089 81403687 81743530 82124115 82154778
3865 82154778 82052658 81861710 81710556 81838943 81957291 81766914 81534744 81460403 81446861 81466103 81510712
3876 81510712 81563042 81625412 81718491 81769272 81658127 81545303 81609848 81675743 81586388 81462410 81353233
3887 81353233 81315590 81513504 81674362 81496338 81231117 81017776 80892273 80972336 81151512 81383560
3897 81383560 81605484 81724213 81783440 81797150 81761192 81672119 81541702 81355904 81188629 81131104 81117294
3908 81117294 81123566 81113861 81013466 80914597 80889633 80923225 81074669 81192253 81083969 80929924 80847336
3919 80847336 80832794 80973602 81114601 81091118 81018921 80954956 80910728 80933289 80972839 81000778 81000374 80943825
3931 80943825 80835602 80619026 80449699 80524590 80662704 80748871 80782555 80690765 80575539 80530457 80507660
3942H0507660j4069j4709o3133r964K03277J93161l6690j17469j44532j05262N6915
3953H0455185J02783P7507L9696p1144p1739M3777O8451M2122J2398m3625q2306j20354
3965H0452751j34559j36857j02829j3259L0357N2422N6678L5141J5618k1767k5681
3976H0208015R964R446j4138l7506p7888q9958r4651n3528P1976Q8883n906p324O2180
3989H0069565Q7143J14128P2052q2871j04545K502J0010n9937o7474l6812j1230
4000G9992531
$$ plain form
3942 80507660 80493591 80478882 80415749 80405785 80609062 80802223 80765533 80648064 80503532 80398270 80455185
3953 80455185 80557968 80635475 80675171 80604027 80532288 80576065 80644516 80686638 80699036 80655411 80573105 80452751
3965 80452751 80318192 80181335 80078506 80065247 80095604 80148026 80204704 80239845 80255463 80233696 80208015
3976 80208015 80217979 80227425 80213287 80175781 80097893 80007935 79913284 79859756 79931732 80020615 80014709 80007385 80069565
3989 80069565 80156708 80270836 80342888 80260017 80155472 80157974 80167984 80108047 80040573 80003761 79992531
4000 79992531
##END=$$ End of the data block
