##TITLE=$$ Begin of the data block
##JCAMP-DX=5.00 $$ ACD/SpecManager v 10.08
##SPECTROMETER/DATA SYSTEM=16PC
##DATE=15 Jul 2013 14:08:08
##DATA TYPE=INFRARED SPECTRUM
##DATA CLASS=XYDATA
##ORIGIN=
##OWNER=
##NPOINTS=3601
##FIRSTX=400.00000000
##LASTX=4000.00000000
##MAXX=4000.00000000
##MINX=400.00000000
##MAXY=510.28036499
##MINY=12.09971809
##XFACTOR=1.0000000000
##YFACTOR=0.000001000000000
##FIRSTY=410.12655640
##DELTAX=1.00000000
##XUNITS=1/CM
##YUNITS=TRANSMITTANCE
##XYDATA=(X++(Y..Y))
400D10126556j23466186j65141403m5300675K5527336J51090737J26925506q0337555
407B99424316j32757660q6761482n4583309J2491081L1838772J3784577l48092n9375164
415B3713039r356618J99390954K14193787O4296204j4605805r6424438j21207123j08755463
423A51244537l9815963J74998764J58885131j26838562j50641754M1949677J01508484
430C11290314J33037780O5952271j79572815k13653305o2803410j0850406K588630
437D5989059J9808960L9392258K4716263m7945885m7064831K9362919M1793869N577133
445A11629745j140258P560898R856582J5719696P082535k1881241k9798843k4977928
453G4051186j5560646O111282J7546661K7643082K3301071j078293r999824j1921807
$$ plain form
400 410126556 286660370 121518967 76218292 101745628 252836365 379761871 299424316
407 299424316 166666656 79905174 25321865 37812946 69651718 83436295 83088203 23713039
415 23713039 14356421 213747375 427941162 492237366 477631561 381207123 260000000 151244537
423 151244537 111428574 286427338 445312469 318473907 167832153 209781830 311290314
430 311290314 444328094 510280365 330707550 117054245 54250835 43400429 45989059
437 45989059 65798019 105190277 129906540 81960655 34895824 64258743 106052612 111629745
445 111629745 110489487 118050385 127906967 143626663 150709198 128827957 99029114 74051186
453 74051186 58490540 64601822 82148483 109791565 133092636 132014343 122014519 110092712
461A10092712q506439P243035R001655k128242m231209n67749j1658q08380j102478
470A08981247k798027j34255J0377594R021790n214005q565040m871681k537606J400353
479A05660370L493088N805282L527306o124138p206299p20878J395843J946541J656822
488A09433937n82313j060868o33407M08004L259064L428696J292518j61033k111458
497A13273140k829285k575760k035736r19487K98859K471474K663520P99889J15517
506A11262131k24854j15295R57702Q33939n09788q20824n00160j96717N53345N43259
516A11782738l04817m73000j69273p9850j39709P7339P31400P55783K22587q9996n84992
527A11728210m28772P42989O39298q68660r74938J60744L71094N317j66107m83467
$$ plain form
461 110092712 101586273 108829308 117830963 115702721 111471512 110903763 110892105 110083725 108981247
470 108981247 106183220 106048965 116426559 125448349 120234344 111669304 106797623 104260017 105660370
479 105660370 109153458 114958740 118486046 112361908 105155609 104434731 105830574 107777115 109433937
488 109433937 108851624 107790756 107157349 107565353 110824417 114253113 115545631 115384598 113273140
497 113273140 110443855 107868095 105832359 104912872 105211731 107683205 110346725 111146614 111262131
506 111262131 111037277 110921982 111879684 112713623 112203835 111383011 110882851 110686134 111239479 111782738
516 111782738 111477921 111004921 110835648 110755798 110616089 110693428 111424828 112180611 112403198 112313202 111728210
527 111728210 111299438 112042427 112681725 111813065 110838127 110998871 111369965 111375282 111209175 110725708
537A10725708l56148K77115N80429R05899O80687l35937o08277l44207k48192j15654
547A11161423o0677n2666j00189k42965l13714n15769k03255Q59764J083397P36137
557A12351486L33618m66987q10265r71580p05078K86506N67940M47273J27266q71345
567A10288834q34465K43476O26015Q28240N26069p90474p57530P42272Q75564r7633
577A11650368l84117m77738j96388R16557Q52295m78126p10389j27365L7888J72829
587A11255814l9414q82622r05014j64871J19209K62482K22420k31629j34468N72968
597A10074875O89033M45702J16562o94420o76727K70317M33258P1503j39527n07095
607A10083481m77715n7655K24571O78398N94277j87111l19046O5559J51352J14891
$$ plain form
537 110725708 110369560 110646675 111227104 112133003 112813690 112477753 111869476 111525269 111277077 111161423
547 111161423 111100746 111048080 110947891 110704926 110391212 109875443 109672188 110531952 111615349 112351486
557 112351486 112685104 112218117 111407852 110436272 109731194 110017700 110585640 111032913 111160179 110288834
567 110288834 109454369 109697845 110323860 111152100 111678169 110887695 110130165 110872437 111748001 111650368
577 111650368 111266251 110788513 110592125 111508682 112360977 111882851 111172462 111045097 111082985 111255814
587 111255814 111216400 110333778 109428764 109263893 109383102 109645584 109868004 109636375 109501907 110074875
597 110074875 110763908 111209610 111326172 110631752 109955025 110225342 110658600 110730103 110590576 110083481
607 110083481 109605766 109548111 109772682 110451080 111045357 110858246 110539200 110604759 110756111 110871002
617A10871002O5186r5513q5594Q8265J71020K34696K45933J85349J63505J97457J08482
628A12149788q7456k75513o47567n51110K18087J90300p10343p10769K2529L82088
638A09980034P47703P07367J29456m7752O1462k4315k84935l19954k00874m2343L76106
649A11081955K87201l01956o52649j248886q93517P14302J173996Q83316O51695J69159
659A11864616j33873m52613m36882n9433K20489O99112O50696O7039k93564p94006
669A11331581p41341k6222K21016K42012K00417P606j45790l84308m00543k33269l4790
680A10036369M01047M01970p0709j90262p8224p5150j35826j00685R9945K7802m32442
691A09883835l81302K35603L01125j25412j64505J26831R6893k44903k84790p4288
$$ plain form
617 110871002 110936188 110840675 110755081 110843346 111014366 111249062 111494995 111680344 111843849 112041306 112149788
628 112149788 112062332 111786819 111139252 110588142 110806229 110996529 110286186 109575417 109597946 109980034
638 109980034 110727737 111435104 111564560 111516808 111578270 111553955 111269020 110949066 110748192 110705849 111081955
649 111081955 111369156 111067200 110414551 109165665 108272148 108986450 110160446 111043762 111695457 111864616
659 111864616 111730743 111278130 110841248 110781815 111002304 111701416 112352112 112419151 112125587 111331581
669 111331581 110590240 110564018 110785034 111027046 111227463 111235069 111089279 110704971 110304428 110071159 110036369
680 110036369 110437416 110839386 110768677 110578415 110500191 110425041 110289215 110188530 110288475 110316277 109883835
691 109883835 109502533 109738136 110039261 109913849 109749344 109876175 109973068 109728165 109443375 109369087
701A09369087k1362j1253r5131l68645l98201j50353j92779n13916n92682m50752n22927
712A06051086q36708q47503m64058n96237j273323j468346j483513j137093j79718
721I7764587K09168J72325L18024N42740O51954P19429O44638K94060L02124O74439
731A02293488P53997P30278N02251j22635k73331m7248P4264K21848L54362N75516
741A05062790N11627J06308m1504o8596k7015J56616K40829K72469L05580L32947L29162
752A07181213L68760J78817m52331m05258M22691N01251o7070j62239P2739Q9668k6939
763A07701302o7284j05209n5436K09351R4345n53680n27359J64131L49830K10358J94191
774A07614540J94954J89377K32696J26862k27593k34939J26053J74591m1886l2501
$$ plain form
701 109369087 109347725 109336472 109241341 108872696 108474495 108324142 108131363 107617447 107024765 106574013 106051086
712 106051086 105214378 104366875 103902817 103306580 102033257 100564911 99081398 97944305 97764587
721 97764587 97973755 98146080 98464104 99006844 99658798 100378227 101022865 101316925 101619049 102293488
731 102293488 103047485 103777763 104280014 104157379 103884048 103836800 103911064 104132912 104487274 105062790
741 105062790 105574417 105680725 105639221 105570625 105543610 105700226 105941055 106213524 106519104 106852051 107181213
752 107181213 107549973 107728790 107276459 106871201 107293892 107795143 107728073 107565834 107638573 107728241 107701302
763 107701302 107634018 107528809 107473373 107682724 107777069 107223389 106696030 106860161 107209991 107420349 107614540
774 107614540 107809494 107998871 108231567 108358429 108130836 107895897 108021950 108196541 108154655 108122154
784A08122154J46843K28958L29399K52861l7597j99082l60939l48663k20680Q2184
794A07995438P94601R18625N81650K72011k98432m65393k66289k16034k58178j03615
804A08954384L51951M02192Q8996m9255j88972j63102J18897J27556q4069j98913m23019
815A08936646k49650O23559M80270q93448r25827K22298O22154P30995O48468L30193
825A10525658j46103j224976j206131o538L41301J85158J66290J39145M4464j78337
835A08639931k27616j91932j8738M77768N01755Q2298j01372k49176k40875R872L7102
846A08719017j44653j27861O0150J20880J12106J01113N7693L5362L6927k594j28678
857A08839462r4558J21025J85943J94809J01067k30812k12288K22420K21397j32370
$$ plain form
784 108122154 108268997 108497955 108827354 109080215 109042618 108843536 108482597 108133934 107913254 107995438
794 107995438 108790039 109708664 110290314 110562325 110263893 109798500 109532211 109316177 109057999 108954384
804 108954384 109306335 109708527 109797523 109748268 109559296 109396194 109515091 109642647 109558578 109359665 108936646
815 108936646 108686996 109310555 109790825 108897377 107971550 108193848 108816002 109546997 110195465 110525658
825 110525658 110379555 109154579 107948448 107941910 108283211 108468369 108634659 108773804 108818268 108639931
835 108639931 108412315 108220383 108201645 108679413 109181168 109263466 109162094 108912918 108672043 108681915 108719017
846 108719017 108574364 108446503 108506653 108627533 108739639 108840752 108898445 108933807 108970734 108968140 108839462
857 108839462 108744904 108865929 109051872 109246681 109347748 109116936 108904648 109127068 109348465 109216095
867A09216095l19153n80307m70230J38641K90154J01494N9982L2570O4087K27073J86539
878A08946945p4577j53191j23352r2224L1021j0017k43874l00216k44332j85394r0172
889A07460617J7380K17987K12692j9501r5794j04813p4890L5507Q8288J20994J21285
900A07979752R7793K7924j33492j83555j72974j01997P7751J73042K70294K16744j0247
911A08241035j67564m04358l67401j4305J32103J99844J99486M9446O5163L08586K16293
922A08458328k99576l24440J66512J59172l09898l73078j48964l0830P9704J82198
932A07559128L64929K75108j69105k87796j90308j19400L7743P2357j8425j4664N0904
943A07560471Q9042J54663J17066o2058r8854q011j4564j00807j12557q3778l3165
$$ plain form
867 109216095 108896942 108316635 107846405 107985046 108275200 108376694 108436676 108469246 108533333 108760406 108946945
878 108946945 108872368 108719177 108595825 108503601 108534622 108524605 108280731 107980515 107736183 107550789 107460617
889 107460617 107477997 107695984 107908676 107889175 107793381 107688568 107613678 107649185 107737473 107858467 107979752
900 107979752 108077545 108105469 107971977 107788422 107615448 107513451 107591202 107764244 108034538 108251282 108241035
911 108241035 108073471 107669113 107301712 107287407 107419510 107619354 107818840 107868286 107933449 108242035 108458328
922 108458328 108158752 107834312 108000824 108159996 107850098 107477020 107328056 107297226 107376930 107559128
932 107559128 107924057 108199165 108030060 107742264 107551956 107432556 107470299 107542656 107524231 107509567 107560471
943 107560471 107649513 107804176 107921242 107859184 107760330 107752319 107737755 107636948 107524391 107440613 107407448
954A07407448Q0375J11176R8084L1257j56425j86974q3519l1608K1980M9805N4359
965A07395958N2834O2728l288k12578k08687J5923P4608k243N0377K19490K91969L49945
977A08087036K77924K6512r1309j81152j33896J32156J80962L0014M5059K31697K01485
988A08806488n2521j14082n0407q889O9619R5870J02135M8401j07429j57242j59165
999A08472778q8882J50467J47125j20239j54801p293K7984K0554j3542j56258r5795
1010A08182098K32666K57691L5690q7883k52533k45834n5649N6915K05468J96266n364
1021A08519531o7093o7833k4292J52520J23024j65894j62460J34254J68732j4999l7766
1032A08557724P3120M7547j30463j27220L3683J12580J79703J93473J57547R8870l6186
$$ plain form
954 107407448 107487823 107598999 107697083 107728340 107571915 107384941 107301422 107269814 107291794 107341599 107395958
965 107395958 107448792 107511520 107508232 107295654 107086967 107102890 107177498 107175255 107225632 107445122 107737091 108087036
977 108087036 108364960 108391472 108300163 108119011 107985115 108117271 108298233 108328247 108373306 108605003 108806488
988 108806488 108753967 108639885 108589478 108580589 108650208 108746078 108848213 108896614 108789185 108631943 108472778
999 108472778 108383896 108534363 108681488 108561249 108406448 108399155 108427139 108447693 108434151 108277893 108182098
1010 108182098 108414764 108672455 108708145 108620262 108367729 108121895 108066246 108123161 108328629 108524895 108519531
1021 108519531 108452438 108384605 108360313 108512833 108635857 108469963 108307503 108441757 108610489 108595490 108557724
1032 108557724 108630844 108678391 108547928 108420708 108454391 108566971 108746674 108940147 109097694 109196564 109160378
1043A09160378o0112N6434Q515k06116k73560k80784j94046P6507J37421J739J0659
1054A08437035J54594J30577n1063j28655j82602j52855n096O3270J30539Q0986j47148
1065A08329582j91047q3992n5718p5272l7025O2630J03477J14105J00258O7757j2489
1076A08322266k29721j98006J57646J51009k34505k46407N1972J61438K12265J82197
1086A08330154J5519m2748n0712k1317J15967R1965j23551j40907L8910L0090j69685
1097A08073685j65436o722J09383K85744L08014J82632R7847Q32q5427k36198j73714
1108A08390640J84059K31125M174l7842L4218M4700M3320O798r7397j16013o2988l6125
1120A08588669O485n074q7578j04400q7448m6021O8787P0694l5553q2947j34941j04790
$$ plain form
1043 109160378 109100266 109156700 109165215 108959099 108685539 108404755 108210709 108287216 108424637 108426376 108437035
1054 108437035 108591629 108722206 108671143 108542488 108359886 108207031 108201935 108265205 108395744 108476730 108329582
1065 108329582 108138535 108054543 107998825 107923553 107886528 107949158 108052635 108166740 108266998 108334755 108322266
1076 108322266 108092545 107894539 108052185 108203194 107968689 107722282 107774254 107935692 108147957 108330154
1086 108330154 108345673 108302925 108252213 108230896 108346863 108438828 108315277 108174370 108213280 108243370 108073685
1097 108073685 107908249 107901527 108010910 108296654 108604668 108787300 108885147 108885979 108800552 108564354 108390640
1108 108390640 108574699 108805824 108809998 108772156 108806374 108851074 108894394 108901192 108803795 108687782 108624794 108588669
1120 108588669 108595154 108590080 108502502 108398102 108310654 108264633 108333420 108404114 108368561 108285614 108150673 108045883
1132A08045883M0032Q2496P9415K0317j56807j93764j08147q8005q3229j06384j92589
1143A07339218j88972r4559o6116o2272r2079j98242k00821j02333p2616j00090o1440
1154A06099678N4115Q0063Q850L6881J68869J89522J35994P4836l4874r5970j47629
1165A06570335j30508l1708L7529J26435J49269R0835R7420J50040J78314J97983K16362
1176A07652306K73704K01439n1308j12533k3461Q538J4755P7133K46071K37747N2117
1187A08576508k6841p7415p0618L3951M5532N966o1370k53128k06116J20643J99814
1198A08286926J27175M7020j51734j69227J2848K1125j02493j52451k19818j45866
1208A07553505J28410K08069J79749R1736j60691k06848p9040j9051M1344P0808R2415
$$ plain form
1132 108045883 108085915 108168411 108247826 108268143 108111336 107917572 107809425 107721420 107638191 107531807 107339218
1143 107339218 107150246 107055687 106989571 106927299 106835220 106636978 106436157 106333824 106261208 106161118 106099678
1154 106099678 106153793 106233856 106242706 106279587 106448456 106637978 106773972 106848808 106813934 106717964 106570335
1165 106570335 106439827 106408119 106445648 106572083 106721352 106812187 106909607 107059647 107237961 107435944 107652306
1176 107652306 107926010 108127449 108076141 107963608 107940147 107948685 107963440 108040573 108286644 108524391 108576508
1187 108576508 108549667 108472252 108401634 108435585 108481117 108487083 108425713 108172585 107966469 108087112 108286926
1198 108286926 108414101 108461121 108309387 108140160 108153008 108174133 108071640 107919189 107699371 107553505
1208 107553505 107681915 107889984 108069733 108161469 108000778 107793930 107714890 107695839 107737183 107807991 107900406
1219A07900406M5227j23406j42173l6858K4300J17988J05431n1689o1516O1233Q3634
1230A07922577O2607L387j50108j78864r4124p0266q2230n6122P439L6667O1111L4043
1242A07496117p8102r4559k6398j0200Q491n1933k31911k88338k93403k01798O5758
1253A06293724J46553Q9195O2035L4195l9482k13745k24472p5196j6235L9101n608
1264A06090065k16240k32963p5051k5421k8770k3629k8091l1204l3402m4273q3565
1275A05267456o2973K3750O3279J08856O0562j30676j69014p7874n9768p5577p9323
1286A04868698p9704q7998q9668j31729k45071k59446j96197j40213k3010l3806k22969
1297A03358887k00081N9128O6925j68541j92261o3873m6O1394Q8386P5363P6432O7329
$$ plain form
1219 107900406 107945633 107822227 107680054 107643196 107667496 107785484 107890915 107839226 107777710 107838943 107922577
1230 107922577 107985184 107988571 107838463 107659599 107565475 107495209 107412979 107356857 107364296 107400963 107462074 107496117
1242 107496117 107418015 107323456 107297058 107286858 107295349 107243416 107011505 106723167 106429764 106227966 106293724
1253 106293724 106440277 106529472 106591507 106625702 106586220 106372475 106148003 106072807 106056572 106095673 106090065
1264 106090065 105873825 105640862 105565811 105540390 105511620 105487991 105459900 105428696 105395294 105351021 105267456
1275 105267456 105204483 105228233 105291512 105400368 105460930 105330254 105161240 105083366 105023598 104948021 104868698
1286 104868698 104788994 104700996 104611328 104479599 104234528 103975082 103778885 103638672 103615662 103581856 103358887
1297 103358887 103158806 103217934 103284859 103116318 102924057 102860184 102860138 102921532 103009918 103085281 103161713 103229042
1309A03229042R0958J59385J81343J76545J57142J04164Q0971P8079P0023P1121M9423
1320A04448196J8982m4441j99722j87424K4750M7966n4192j47224l28873l42987j41952
1331A03093079j72547m19830m97009n04944m27223j73974j21093k55158k53967j71181
1341A00096153j14677m1535j5686j6502o2820j90354k37724k19780k38823l08037k72583
1352I8377632q9905q5090k39380l02689k58781m23149p66083j091126j539611j742623
1362I1839195j858497j623032r08974m89784R445j37596r40582j634621k521278l159401
1372G8574875l917938l762390k864289j572365N47814K107216L694603M343841M027199
1381H1178566L821686L312088L082176L154259K855156K262405J738876J079087P41913
$$ plain form
1309 103229042 103320000 103479385 103660728 103837273 103994415 104098579 104179550 104257629 104327652 104398773 104448196
1320 104448196 104467178 104422737 104223015 104035591 104060341 104108307 104054115 103906891 103578018 103235031 103093079
1331 103093079 102920532 102500702 102003693 101498749 101071526 100897552 100776459 100521301 100267334 100096153
1341 100096153 99981476 99939941 99924255 99907753 99844933 99654579 99416855 99197075 98958252 98650215 98377632
1352 98377632 98287727 98202637 97963257 97660568 97401787 96978638 96212555 95121429 93581818 91839195
1362 91839195 89980698 88357666 87448692 86958908 86968353 86830757 85890175 84255554 81734276 78574875
1372 78574875 74656937 70894547 68030258 66457893 67005707 69112923 72807526 77151367 81178566
1381 81178566 85000252 88312340 91394516 94548775 97403931 99666336 101405212 102484299 103226212
1390A03226212P14584N89157M84009L33404O5308L3310K92229K69073l792q2962p4150
1401A05846382J999K69440K52769n7480j48323j01829j02898r9068j15585j64581j72661
1412A05408165j43478j36017j39069j38527j35223j39977j46225j69326j88179k72179
1422A03799965m29421n58425p17637p75077o34598q12935j328919j590637j732589
1431I5219727j808617j746201j781845j893066j933334j924210j926300j894211j949242
1440G8362701k114364k176552k212593k128342j856346j760559j789566j785255j712944
1449F0826180j869511k352116k475357k486923k081726j018238n67723n28621m36188
1458D7009777m45366m01234m45606j66176M96769Q91972R01459J648044L117897M243256
$$ plain form
1390 103226212 103940796 104529953 105013962 105347366 105412674 105445984 105738213 106007286 106003494 105920532 105846382
1401 105846382 105848381 106117821 106370590 106313110 106164787 106062958 105960060 105860992 105745407 105580826 105408165
1412 105408165 105264687 105128670 104989601 104851074 104715851 104575874 104429649 104260323 104072144 103799965
1422 103799965 103370544 102812119 102094482 101319405 100684807 99871872 98542953 96952316 95219727
1431 95219727 93411110 91664909 89883064 87989998 86056664 84132454 82206154 80311943 78362701
1440 78362701 76248337 74071785 71859192 69730850 67874504 66113945 64324379 62539124 60826180
1449 60826180 58956669 56604553 54129196 51642273 49560547 48542309 47974586 47445965 47009777
1458 47009777 46564411 46163177 45717571 45551395 46048164 46940136 47841595 49489639 52607536 56850792
1468E6850792N422783O129288O776023O236840M108093L130486K840682K351143J836296
1477I5682426J485779J292305J095360R23660Q22594Q39157P39792N28717M22501L70262
1487A04202553L58940M52591M07913K16843J54663J70227J92619K74849K75757K05086
1497A06912041J64909J29227R9731O6681O7307P9155J54594L99467L37792r8274j61621
1508A08151009R8274J32080j427J1658J50062J85036J57120J32843P2815O7856J34437
1519A09291763J15616K5528l5858j24428j16752N050M5975M0527M5464K9114O1416
1530A09383415J81458J62887J2665p1030j94709j30417J81717K74162K52129J61880
1540A10214157j03134j63155n0712j5663j2970K6825J35353J16317n6457q2016N417
$$ plain form
1468 56850792 62273575 68402863 75178886 81415726 85523819 88654305 91494987 93846130 95682426
1477 95682426 97168205 98460510 99555870 100479530 101302124 102141281 102881073 103409790 103832291 104202553
1487 104202553 104561493 105014084 105421997 105638840 105793503 105963730 106156349 106431198 106706955 106912041
1497 106912041 107076950 107206177 107305908 107372589 107439896 107519051 107673645 108073112 108410904 108312630 108151009
1508 108151009 108249283 108381363 108379936 108391594 108541656 108726692 108883812 109016655 109089470 109157326 109291763
1519 109291763 109407379 109432907 109397049 109272621 109155869 109160919 109206894 109247421 109292885 109321999 109383415
1530 109383415 109564873 109727760 109740425 109669395 109474686 109344269 109525986 109800148 110052277 110214157
1540 110214157 110111023 109947868 109897156 109881493 109868523 109895348 110030701 110147018 110090561 110008545 110013962
1551A10013962M1435O3324Q6212R8992J30798K23038J80748j763j07055k29355k09282
1562A10291054J2039L9619j34918q3229K33002K32010r5635j30531P7988J07719K7535
1573A10576653j6068o0104j03356j84395j50131L9887P0526n6343l3112J52802J43242
1584A10379601o6613r9617K129K9610J2352M1244J23619J38947J11938O4018l4408
1595A10702820q6594j34750j06857J6571Q5395J73760J34971p3936j34491j04401p1502
1606A10400986R247M5539P3983M0130j20361r5932J37489J71738O4323p057j07529
1617A10612556j54609j86638j32965O3850J03043J0208j6525l5286j1948R4727Q5594
1628A10432007n1880o8596o004N2330J69517J76430Q3351J7998n9532j17447j91261
$$ plain form
1551 110013962 110055397 110118721 110204933 110303925 110434723 110657761 110838509 110836746 110729691 110500336 110291054
1562 110291054 110303093 110342712 110207794 110124565 110357567 110589577 110493942 110363411 110441399 110549118 110576653
1573 110576653 110560585 110500481 110397125 110212730 110062599 110102486 110173012 110116669 110083557 110236359 110379601
1584 110379601 110312988 110213371 110215500 110245110 110257462 110298706 110422325 110561272 110673210 110737228 110702820
1595 110702820 110616226 110481476 110374619 110391190 110476585 110650345 110785316 110711380 110576889 110472488 110400986
1606 110400986 110410233 110455772 110529755 110569885 110449524 110353592 110491081 110662819 110727142 110720085 110612556
1617 110612556 110457947 110271309 110138344 110202194 110305237 110315445 110298920 110263634 110251686 110346413 110432007
1628 110432007 110380127 110311531 110305527 110357857 110527374 110703804 110787155 110805153 110745621 110628174 110436913
1639A10436913j70777m1031K7848Q6448J02379R4292J9645j98150k10304o8642Q5182
1650A10163803M30039L91983o3965k24182k38205k21566j18682l6477P7294J20376
1660A10280418J09978P9277j4160l3951j838L2470J14853J11336J6403j3924n363j1131
1672A10664368j6884k7153m9118m9637k5726k2644n4459j9859J05331J22833O0540
1683A10687592N149r4726j20400r8014m2031R7511J35064Q8096P1999P3509L0205j03996
1695A10729958q2375J09314J67061J77475R8137j58737j99822n1979j259K5604K1294
1706A10834671l2188n5794q6090n6168N4192R7038R2720J07735J68045J03088j19972
1717A11107277j99249k12670j50680N0331J26388J32302J12793L0204r536k5505m7425
$$ plain form
1639 110436913 110266136 110225105 110252953 110339401 110441780 110536072 110555717 110357567 110147263 110078621 110163803
1650 110163803 110593842 110985825 110921860 110697678 110459473 110237907 110119225 110082748 110160042 110280418
1660 110280418 110390396 110469673 110455513 110421562 110419724 110452194 110567047 110678383 110694786 110680862 110675499 110664368
1672 110664368 110647484 110620331 110571213 110521576 110495850 110473206 110418747 110398888 110504219 110627052 110687592
1683 110687592 110692741 110598015 110477615 110379601 110337570 110435081 110570145 110658241 110730240 110803749 110833954 110729958
1695 110729958 110647583 110756897 110923958 111101433 111199570 111040833 110841011 110789032 110787773 110813377 110834671
1706 110834671 110802483 110746689 110660599 110604431 110658623 110755661 110848381 110956116 111124161 111227249 111107277
1717 111107277 110908028 110695358 110544678 110595009 110721397 110853699 110966492 110996696 110987160 110961655 110914230
1728A10914230j36970j7761M51088M29390p4296k54081l04673k53250j526Q4305O5522
1739A10901978O3056L9078K3842O485J22J8166o249r4055r4963r582J3992K769l265
1752A10861374k9137j4877O0081N3170n1667m7729O2370Q2253M3533J5999l2044m3891
1764A10959435p988k7535j21384j11030K884M4349N2475M6494J1253j2138m6135m2221
1776A10748459L670K6634L8360N6954R0652Q8097N9746J5022r2293q6838L9437P8819
1788A11066719P0030O5636M4228L8932O0196L2761n7503p9208m3625l7224l8719m6921
1800A11075302q4274o2325K1813O8138J23459J00372k4918p0091p5844o1821k3223
1811A10986588M0100J93191J75575q583j15661k58515k29500Q271R9495J23382J18157
$$ plain form
1728 110914230 110777260 110759499 111210587 111639977 111565681 111311600 111006927 110753677 110752151 110836456 110901978
1739 110901978 110965034 111004112 111027954 111034439 111034561 111052727 111046478 110952423 110857460 110847878 110861870 110864639 110861374
1752 110861374 110832237 110817360 110877441 110930611 110878944 110831215 110893585 110975838 111019371 111035370 111003326 110959435
1764 110959435 110951447 110923912 110802528 110691498 110694382 110738731 110791206 110837700 110848953 110836815 110790680 110748459
1776 110748459 110752129 110778763 110817123 110874077 110964729 111052826 111112572 111127594 111035301 110948463 110987900 111066719
1788 111066719 111136749 111202385 111246613 111285545 111345741 111378502 111320999 111241791 111198166 111160942 111122223 111075302
1800 111075302 110991028 110928703 110950516 111018654 111142113 111242485 111217567 111147476 111071632 111009811 110986588
1811 110986588 111026688 111219879 111395454 111386871 111271210 111012695 110783195 110791466 110890961 111014343 111132500
1822A11132500N6289R613o8023o4156M1504N5008k647k1866k8824k8488r728j2184
1834A11058998m4899l2257K5993N3002O3202P5508J01257P5813k0813m4105N669j5114
1846A11302254j12053j19400m0894k7366q1948m1557J34064J20620r8259j32911l0709
1857A10871841P981M6325L1739n8007q1733p3365l8383N1643Q8166J01928P8530r583
1869A11017082l7956k2842k3743l7407j7502O4423M8088q3374j02501l5500n096K9251
1881A10792923K7771k5963k6558L4737J7433j03500q7479P4677J05476M6348Q896m8782
1893A10815979p0786o4018n7029m9447j4404Q7097P1953q4686j00517o440L8697Q1085
1905A10647484R4772Q7761N3841l8056n7647j8197K961L3477L9979K8419Q324m4846
$$ plain form
1822 111132500 111188789 111198402 111130379 111066223 111107727 111162735 111160088 111138222 111109398 111080910 111071182 111058998
1834 111058998 111014099 110981842 111007835 111060837 111124039 111199547 111300804 111376617 111355804 111311699 111317368 111302254
1846 111302254 111190201 111070801 111029907 111002541 110920593 110879036 111013100 111133720 111035461 110902550 110871841
1857 110871841 110879822 110926147 110957886 110899879 110818146 110744781 110706398 110758041 110846207 110948135 111026665 111017082
1869 111017082 110979126 110956284 110932541 110895134 110877632 110942055 110990143 110906769 110804268 110768768 110763672 110792923
1881 110792923 110820694 110794731 110768173 110802910 110820343 110716843 110629364 110704041 110809517 110855865 110864761 110815979
1893 110815979 110745193 110681175 110624146 110574699 110560295 110647392 110719345 110634659 110534142 110527702 110566399 110647484
1905 110647484 110742256 110830017 110883858 110845802 110788155 110769958 110772919 110806396 110846375 110874794 110883118 110838272
1917A10838272m2587J0803M3846R6771Q0109k0813n7938o3484n6869l4592Q606J10077
1929A10912201J14944L1784j9004q5808r5459m2015k2431k1484l502L7766M1366J7189
1941A10865547j3374r5703p0023R4360J14563J0560j4779J1155n242p3555o1867L7262
1953A10798904O1776L4599K5886K9564m27q4328r5321n7152j640J16111J48224J22971
1965A11099167P4966n0285o9740K5726J6449q9378j05141o2447k1530N9746P2723J8265
1977A10968521J526R155j0757o8375p1335l0494N172O8734P6889K9785J0132J3946
1989A11002899k5513j50802j25000P5127J19468N3742K5222O49l4386r8991j02539
2000A10739876m4541j7875m12J1947J2299K3849N6809M6951j838m1008r9564j10077
$$ plain form
1917 110838272 110795685 110806488 110850334 110947105 111027214 111006401 110948463 110884979 110828110 110793518 110802124 110912201
1929 110912201 111027145 111058929 111039925 110954117 110858658 110816643 110794212 110772728 110769226 110806992 110848358 110865547
1941 110865547 110852173 110756470 110686447 110780807 110895370 110905930 110891151 110902306 110897064 110823509 110761642 110798904
1953 110798904 110860680 110895279 110921165 110950729 110950302 110865974 110770653 110713501 110711861 110827972 110976196 111099167
1965 111099167 111174133 111123848 111054108 111079834 111096283 111006905 110901764 110839317 110817787 110877533 110950256 110968521
1977 110968521 110970047 110979202 110968445 110900070 110828735 110798241 110803413 110872147 110949036 110978821 110988953 111002899
1989 111002899 110977386 110826584 110701584 110776711 110896179 110949921 110975143 110975792 110941406 110842415 110739876
2000 110739876 110695335 110677460 110677048 110688995 110701294 110725143 110781952 110828903 110827065 110786057 110686493 110576416
2012A10576416p0168n7128n7000m8545m9996r582J00204J17279M6608L0258N7076K9495
2024A10664917m4540r9320j82251j69609l9368l479m0313k4605K5894N6885R9869Q3068
2036A10327148k7801k4124J08909J03135k2835p5562j20567q9188M8920J03645J20423
2047A10452103J07216K6657J9928R7679P5943m8500p8888l4188l5553p4073o4186K311
2059A10446449O775p3913k8870J79222J89896J6861l4165j1856k7534o2035q0948j01394
2071A10418488q9409k4842k2392j03401o7993R6275J39641R4932Q0422P4196M5273
2082A10641190q248m8111j07460r1957J8120M9164L6285J2398m3625q0467j50376r5817
2094A10131096J33896J78077P2716L4378J4687r438k5558o0562j44646j30394q583
$$ plain form
2012 110576416 110506248 110449120 110392120 110343575 110293579 110283997 110384201 110501480 110548088 110578346 110635422 110664917
2024 110664917 110620377 110521057 110338806 110169197 110129829 110126350 110086037 110061432 110087326 110144211 110244080 110327148
2036 110327148 110299347 110275223 110384132 110487267 110464432 110388870 110268303 110179115 110228035 110331680 110452103
2047 110452103 110559319 110585976 110605904 110703583 110779526 110731026 110652138 110617950 110582397 110508324 110444138 110446449
2059 110446449 110453224 110379311 110350441 110529663 110719559 110736420 110702255 110690399 110662865 110600830 110519882 110418488
2071 110418488 110329079 110304237 110281845 110178444 110110451 110206726 110346367 110441299 110521721 110595917 110641190
2082 110641190 110632942 110584831 110477371 110385414 110403534 110452698 110488983 110501381 110457756 110377289 110226913 110131096
2094 110131096 110264992 110443069 110515785 110550163 110564850 110555412 110529854 110469292 110324646 110194252 110185669
2105A10185669L6407L5218M9514O4995P6989J06216P4242n1522o2446M1435N1453j2566
2117A10595604k1523M166J6716N2162J3787j39550j46721j3397K1668k930l075M937
2129A10381844J907k0790r728M4510N0499K6436r392j01448r0553K5917P7965J28250
2141A10505417R6008n3123j00846q7242p0549j5091n645n7824k4673J13228J31080
2152A10430740O1867j808j34186j31225L6003M7729p9368r2270l5500J5976J18736
2163A10236694J21422J5999j4328j022j625J4450j7762j47605j12748J30272J45005
2174A10368752m7020r5772p1953m2892M5280M4128n5595o8527j5854J602J0078N204
2186A10077431j9577l3882n7412m2007K8496M1198R201p156l3043k8419J5495K3247
$$ plain form
2105 110185669 110222076 110257294 110306808 110371803 110448792 110555008 110629250 110577728 110515282 110556717 110608170 110595604
2117 110595604 110574081 110578247 110594963 110647125 110660912 110521362 110374641 110361244 110382912 110379982 110376907 110381844
2129 110381844 110383751 110362961 110353233 110397743 110448242 110474678 110465286 110363838 110273285 110299202 110377167 110505417
2141 110505417 110601425 110548302 110447456 110360214 110289665 110274574 110268929 110211105 110186432 110299660 110430740
2152 110430740 110492607 110490799 110356613 110225388 110261391 110309120 110229752 110137482 110101982 110117958 110236694
2163 110236694 110358116 110374115 110359787 110358765 110357140 110371590 110353828 110206223 110093475 110223747 110368752
2174 110368752 110321732 110225960 110154007 110111115 110156395 110200523 110144928 110076401 110060547 110062149 110072227 110077431
2186 110077431 110057854 110023972 109966560 109924553 109953049 109994247 110003448 109996292 109963249 109934830 109950325 109973572
2198A09973572K670k380L265m936m1153k4437N2620P9414Q0590O8161K7420N195k029
2211A10217972k7031q9668p8133K3125L9817j3206k1126j7143J6571J13274J21948
2222A10286400N7838J0948p3173o7093N5344O2080m1557m5059L8787N0476J9165j2321
2234A10341835q4854p7988L1853K9922q8790q9829J5091L8147K5528j9905j58951j51611
2246A09810448P415N6672M2770M0504L3165J2566m3510l8170L4927N3528M8828J7975
2258A10077118p4219q4236k098j1200j24672j06644M9019Q1513L1494l098p8941o7452
2270A09686584M1726P8323R7801M8447j20140j54953r7748l4782J03424J24954K7679
2281A09801315J1994O4682L8147n8243j14632j81770j66489m4464o248k6368j6143
$$ plain form
2198 109973572 109976242 109973862 109977127 109972191 109931038 109906601 109959221 110038635 110119225 110187386 110214806 110220001 110217972
2211 110217972 110190941 110101273 110023140 110046265 110086082 110072876 110051750 110034607 110051178 110164452 110286400
2222 110286400 110344238 110355186 110282013 110214920 110270264 110332344 110290787 110245728 110284515 110334991 110354156 110341835
2234 110341835 110256981 110178993 110210846 110240768 110151978 110062149 110077240 110115387 110140915 110121010 109962059 109810448
2246 109810448 109817863 109874535 109917305 109957809 109990974 110003540 109960030 109921860 109956787 110010315 110059143 110077118
2258 110077118 110002899 109918663 109916565 109905365 109780693 109674049 109723068 109804581 109836075 109832977 109754036 109686584
2270 109686584 109728310 109806633 109904434 109952881 109832741 109677788 109580040 109545258 109648682 109773636 109801315
2281 109801315 109813309 109877991 109916138 109857895 109743263 109561493 109395004 109350540 109344292 109317924 109301781
2292A09301781o64L1441J21551R2674p0503j29936j36307j25053m6539o4087k00982
2303A08773376k01034p1053m0290p1595q4472j16562r7878r605K983l6316p7461j53733
2315A07816360j82243j76407j65558j46774j02638R346J648j39069j71997j12221j40434
2326A06490013l16711k20162K58042K61451k20298k89627p3319L7979J81961J98250
2336A06307579P0900K3849j9599K3193J87378K49740K59400K42851J97510J07025j4809
2347A07635017k07061o09497o24131k48237r1034N8319l4241m65652o14167o35673
2357A04163643n28549k29241O058L19862L98041J84151K17773M70330N16365M17282
2367A05935715L52623K45498K23664L15757K79404R0935Q7189K65716K99286K35298
$$ plain form
2292 109301781 109301117 109332558 109454109 109546783 109476280 109346344 109210037 109084984 109038445 108974358 108773376
2303 108773376 108572342 108501289 108460999 108389404 108304932 108188370 108090492 108080887 108083870 108047554 107970093 107816360
2315 107816360 107634117 107457710 107292152 107145378 107042740 107052086 107053734 106914665 106742668 106630447 106490013
2326 106490013 106173302 105953140 106211182 106472633 106252335 105962708 105889389 105927368 106109329 106307579
2336 106307579 106378479 106402328 106382729 106405922 106593300 106843040 107102440 107345291 107542801 107649826 107635017
2347 107635017 107427956 106818459 106194328 105946091 105855057 105913376 105879135 105413483 104799316 104163643
2357 104163643 103635094 103405853 103411911 103731773 104129814 104313965 104531738 105002068 105518433 105935715
2367 105935715 106288338 106533836 106757500 107073257 107352661 107443596 107530785 107796501 108095787 108331085
2377A08331085K11289J89323J83342K16347J82007M7706N0286K21939J96937r994r2362
2388A09727905j31653j08764K2026N8678M1557J0986p5477q8433k0149l1013j25649
2399A09280014j25435m0886q896j2321J6876R3796Q9958K884k9282l1089m2489o7108
2411A09126022n0644J7762M0435M1367K1935m4251n3284k6893J7685J33110J25740
2422A09348984k1332m7020K7153K5917m4441l4142N9754P5645K6230K2125N3665M8905
2434A09541443J1444j289R178q606n4459p7843j27960n8838K11907K08496p8537j35704
2446A09439232m5067Q087J04477J06232Q941l1799p0785m4518Q9882R7183j1657m5495
2458A09604713o2324k1454J41052J28556o3523j20544j10459p6431L5065N2956p988
$$ plain form
2377 108331085 108542374 108731697 108915039 109131386 109313393 109361099 109411385 109633324 109830261 109820267 109727905
2388 109727905 109596252 109487488 109509514 109568192 109609749 109620735 109545258 109456825 109436676 109405663 109280014
2399 109280014 109154579 109113693 109104797 109092476 109109352 109203148 109293106 109295990 109266708 109235619 109193130 109126022
2411 109126022 109075378 109093140 109133575 109174942 109196877 109152626 109099342 109072449 109090134 109223244 109348984
2422 109348984 109327652 109280632 109307785 109333702 109289261 109255119 109314873 109390518 109416748 109438873 109492538 109541443
2434 109541443 109552887 109551598 109560776 109552170 109497711 109419868 109291908 109233070 109444977 109653473 109574936 109439232
2446 109439232 109394165 109402252 109506729 109612961 109621902 109590103 109519318 109474800 109564682 109661865 109650208 109604713
2458 109604713 109542389 109520935 109661987 109790543 109727020 109606476 109496017 109419586 109454651 109507607 109499619
2469A09499619l5950q0353n5641O0699R2797P3974M6730j8043m6753n7579n1384j4137
2481A09413979j404J785q919m1740n9586q8119o1722K2888Q6708K08473J52138j50917
2493A09473564j90521r300N3047Q9477O7788n6557p3433J5930O127j01258j07315l0228
2505A09137321L716L7720K5222n3306p3242n2811m3892m0344j5137M6082N8822L7171
2517A09067322Q888m7844p3746q6906p4287j8578k235j9196j1589K2125J7784m2434
2529A08739304k3339J07308Q5167j01258j41792p9079n2765k5886o653J9356K601r4749
2541A08428215p1907R1339J13365K1530j2184j2657n2620j62819j47697P126M8332
2552A08250023K5009o103r7588r6054J953K9015K2483K14o3179q4114o1302q3733j70158
$$ plain form
2469 109499619 109463669 109383316 109327675 109388374 109481171 109555145 109601875 109583832 109537079 109479500 109428116 109413979
2481 109413979 109412575 109414360 109405441 109363701 109304115 109215996 109154274 109177162 109263870 109472343 109624481 109473564
2493 109473564 109283043 109273743 109326790 109416267 109484055 109427498 109354065 109369995 109376122 109274864 109167549 109137321
2505 109137321 109141037 109178757 109203979 109150673 109077431 109024620 108980728 108940384 108925247 108971329 109030151 109067322
2517 109067322 109076210 109028366 108954620 108867714 108793427 108774849 108772614 108753418 108741829 108763954 108781738 108739304
2529 108739304 108715965 108823273 108908440 108807182 108665390 108586311 108533546 108507660 108501007 108520363 108522964 108428215
2541 108428215 108356308 108447647 108561012 108582542 108570358 108557701 108505081 108342262 108194565 108201691 108250023
2552 108250023 108275032 108268929 108171341 108075287 108077240 108106255 108128738 108128952 108065773 107981659 107920357 107836624 107666466
2565A07666466j56952l4401n196l6766n6694j15394q3947O3439R4650M9187J007r2224
2577A07293175j35254j50704j43745j07765o4179J8998L5148j0872l2287n5146o2080
2588A06585289m7569n1255o8046p8987r6916q9745m5372m4273r8992p8941K4917M5540
2600A05955650J2917k6009j22574j18537N104J4038q8906q1039K9137N2955K0691l58
2612A05653069m5990m0528K3194M0580K9328K2865K1263r392q2084j10985j24504r5108
2624A05281708M04M1367N4168N3841L6690K312o9550r7748r9205q7593m9286k5299
2636A05041809n142J0177K3484K4536K121J1108P3715M6189p8682j28433j46843j31516
2648A04742523p0572j4206J03714O8497j72333j94236j9341J6266l4378m7569m4342
$$ plain form
2565 107666466 107509514 107475113 107469917 107433151 107376457 107261063 107177116 107240555 107335205 107384392 107385399 107293175
2577 107293175 107157921 107007217 106863472 106755707 106691528 106710526 106745674 106734802 106702515 106647369 106585289
2588 106585289 106537720 106486465 106418419 106339432 106242516 106152771 106107399 106063126 105964134 105885193 105910110 105955650
2600 105955650 105968567 105942558 105819984 105701447 105706551 105720589 105631683 105550644 105579781 105632736 105653427 105653069
2612 105653069 105607079 105566551 105589745 105630325 105659653 105682518 105703781 105694389 105612305 105501320 105376816 105281708
2624 105281708 105282112 105323479 105377647 105431488 105468178 105470490 105400940 105303192 105203987 105116394 105067108 105041809
2636 105041809 105036667 105046844 105070328 105094864 105096985 105108093 105181808 105227997 105149315 105020882 104874039 104742523
2648 104742523 104671951 104657745 104761459 104829956 104657623 104463387 104444046 104460312 104425934 104378365 104334023
2659A04334023o4232j18424j22925q7738n7037p248J1475j938O843M5586K8610o3919
2671A03903076o7093O989M1557Q5190O0196o7780q3664m051K2194K8397K9854J1657
2683A03966522J7929O2081M5967m7875n1712K2721N4435P5173P8674P0625L4356o2180
2695A04266716p4341j0681J8410N1117M4937p698l4073o4369n0598M6852K1461j35094
2707A04072639j83273j69350j47888o2584q4449k35917k56248j93024j16798N0827
2717A02673935O6711o3827j19278j80481j45699K0813P4120M1008N9181J01990J38260
2728A02666733J95389J94900J44341R1888j7784j1826J30722J52848R7328M9919n9814
2739A03634644l6118J44310J92169J61194J25359L4523J4923P6507N3192o8565o8619
$$ plain form
2659 104334023 104269791 104151367 104028442 103940704 103883667 103876419 103887894 103885956 103892799 103938385 103966995 103903076
2671 103903076 103835983 103842972 103884529 103969719 104029915 103962135 103878471 103874420 103896614 103925011 103954865 103966522
2683 103966522 103984451 104046532 104092499 104044624 103992912 104015633 104070068 104145241 104223915 104294540 104328896 104266716
2695 104266716 104192375 104181694 104200104 104251221 104296158 104288460 104254387 104190018 104139420 104186272 104207733 104072639
2707 104072639 103889366 103720016 103572128 103509544 103425095 103189178 102932930 102739906 102623108 102673935
2717 102673935 102740646 102676819 102557541 102377060 102231361 102252174 102326294 102367302 102426483 102528473 102666733
2728 102666733 102862122 103057022 103201363 103293251 103275467 103263641 103394363 103547211 103644539 103694458 103634644
2739 103634644 103598526 103742836 103935005 104096199 104221558 104256081 104271004 104347511 104400703 104332138 104263519
2750A04263519O6613O2538o9352j00616o9260n1811j3138j7448o9214q6616j08315
2761A03806900o1775J07933J08314n8250j09100p7217j13587k37991k20581l0304k1599
2772A03092743j67633k21375k54989k26876p8773q5526k45163k90985k59903k71324
2782A00990196l13064l14545k81052k61970k31842k43279l22410l12477j99387j96220
2792I8313950k80526l29155l83567m01192l69187l81523m58618m24843k59658k21039
2802I4804642k56775l17787m61319n07714m63791m82009n59929n55161m31061m76593
2812I0292503p11303p68326o76819o87172p70645p91954p20642q14171j100189j210900
2822H2040382j148414j272202j546837j754829j939491k145218k371720k576042k754562
$$ plain form
2750 104263519 104330132 104392670 104323318 104222702 104153442 104101631 104088493 104071045 104001831 103915215 103806900
2761 103806900 103745125 103853058 103961372 103903122 103794022 103716805 103603218 103365227 103144646 103114342 103092743
2772 103092743 102925110 102703735 102448746 102221870 102143097 102057571 101812408 101521423 101261520 100990196
2782 100990196 100677132 100362587 100081535 99819565 99587723 99344444 99022034 98709557 98510170 98313950
2792 98313950 98033424 97704269 97320702 96919510 96550323 96168800 95710182 95285339 95025681 94804642
2802 94804642 94547867 94230080 93768761 93261047 92797256 92315247 91755318 91200157 90769096 90292503
2812 90292503 89581200 88812874 88136055 87448883 86678238 85886284 85165642 84351471 83251282 82040382
2822 82040382 80891968 79619766 78072929 76318100 74378609 72233391 69861671 67285629 64531067
2831F4531067k964977l244259l387043l414753l447243l493668l397941l149155k947044
2840C5084984k746247k528715k301788k054380j770474j525307j322628j072311p81702
2849A8981432n11551k50530J6523L24104N18729O01125P21787Q61050R46785J029609
2859B3239063R78947P85278O17005L93177K68911K32290J75692P5365J33776L48638
2869B7248142N26383P28820R02154J122520J139023R56989Q05901O46949M05571M4587
2879C4527039k12861m17732n89611p13966q29436r35865r95468j013352j007030r62212
2889B6849506r18697q67701q04925p16376o62517o32096o09970o11305n90731n48458
2899A9886730n29144n40306n07496m25602l89576l75580l84022m35615m47129m28129
$$ plain form
2831 64531067 61566090 58321831 54934788 51520035 48072792 44579124 41181183 38032028 35084984
2840 35084984 32338737 29810022 27508234 25453854 23683380 22158073 20835445 19763134 18981432
2849 18981432 18469881 18219351 18235874 18559978 19078707 19679832 20401619 21262669 22209454 23239063
2859 23239063 24218010 25003288 25620293 26013470 26282381 26514671 26690363 26765728 26899504 27248142
2869 27248142 27774525 28503345 29405499 30528019 31667042 32624031 33429932 34076881 34482452 34527039
2879 34527039 34314178 33896446 33306835 32592869 31763433 30827568 29832100 28818748 27811718 26849506
2889 26849506 25930809 25063108 24258183 23541807 22879290 22247194 21637224 21025919 20435188 19886730
2899 19886730 19357586 18817280 18309784 17884182 17494606 17119026 16735004 16299389 15852260 15424131
2909A5424131m23669m33541m13799l61967l31950l18003k89440k62952k02632q1468
2919A2304710m3439j02139n9414P4315J42574J59288K25019L47877L94773L61634L97753
2930A4202951M83013N48577O07037O76584P87378Q00394P15090O72436O77705N68795
2940B0739960L45945J69970m723j56616l05344l93913m30466m39787m26317l47805
2950A8750904j79027o3157J8286J34373K75755M10438N48910O80853P62963R78447
2960B2318745J341438J612137J822639K084278K385666K661011K949692L159786L320240
2969D3655632L406929L424789L378060L231930L121158L043965K872684K579498K403229
2978G1117874K323342K182991K020065J839477J598854J462365J425598J341728J251770
$$ plain form
2909 15424131 15000462 14566921 14153122 13791155 13459205 13141202 12851762 12588810 12386178 12304710
2919 12304710 12261271 12159132 12099718 12174033 12316607 12475895 12700914 13048791 13443564 13805198 14202951
2930 14202951 14685964 15234541 15841578 16518162 17305540 18105934 18821024 19493460 20171165 20739960
2940 20739960 21085905 21255875 21251152 21094536 20789192 20395279 19964813 19525026 19098709 18750904
2950 18750904 18571877 18508720 18527006 18661379 18937134 19347572 19896482 20577335 21340298 22318745
2960 22318745 23660183 25272320 27094959 29179237 31564903 34225914 37175606 40335392 43655632
2969 43655632 47062561 50487350 53865410 57097340 60218498 63262463 66135147 68714645 71117874
2978 71117874 73441216 75624207 77644272 79483749 81082603 82544968 83970566 85312294 86564064
2987H6564064J138451R77729Q83027Q33442P98920Q06923P77321P35664O59775N18036
2997I4693352M59121M78074M45938L69529L50235L69622L99757M87137M73450L68240
3007I8894455K91656J98746J48888J09413J51588L14164L70742L79372L34168J79382
3017A01372574J43722K19315K08572J22879J14205J71661J86752J73256J84494K35321
3027A03132751K12830J05721P1853R1294Q5853O5636O8359J13701Q5068m7043m8065
3038A03937958O0821J29410K17056K36489K02728J42837m386k1408Q7905J21285J11885
3049A05222580J29036J87111J59141K1149m097P3784P0190M418j6503l2592R132J34872
3061A05958221J86753K15172J76315K6344j5686J8402L6835P8445P9461M9926J3253
$$ plain form
2987 86564064 87702515 88680244 89563271 90396713 91195633 92002556 92779877 93515541 94175316 94693352
2997 94693352 95152473 95630547 96076485 96446014 96796249 97165871 97565628 98052765 98526215 98894455
3007 98894455 99186111 99384857 99533745 99643158 99794746 100108910 100479652 100859024 101193192 101372574
3017 101372574 101516296 101735611 101944183 102067062 102181267 102352928 102539680 102712936 102897430 103132751
3027 103132751 103345581 103451302 103523155 103614449 103700302 103765938 103834297 103947998 104033066 103986023 103937958
3038 103937958 103998779 104128189 104345245 104581734 104784462 104927299 104922913 104901505 104989410 105110695 105222580
3049 105222580 105351616 105538727 105697868 105719017 105714920 105788704 105858894 105863312 105846809 105814217 105823349 105958221
3061 105958221 106144974 106360146 106536461 106562805 106547119 106565521 106602356 106680801 106760262 106810188 106823441
3072A06823441p1907o3843M0741Q6784J31134J01372l1876p8819j05164l8009K04040
3083A06997894K22443N2124m8042j99967j75018N1231J52283K41325J91994o4819j26534
3094A07294914n5954m318R9350J22360R6367K7207j61629j69991j5808P2357J96411
3105A07501266J77048k4223p4333l1189L692Q7960R2216K1103j4496n5099m9691J4359
3117A07648613L5454M6585J7120r5848r0126L5767P3692P0976M6448m4678m2465P0427
3129A07771965O4423n5649p9559l7171j9379Q32O249j1422k166L1181M9690P2907O1271
3142A07853172M700j6953j0276k9084r1507p1220L2143R0812J73546J32820o9427j33705
3154A07865021j22834q5113L1807O6780M0672L1212K3865j358m8973q1063j37092r7389
$$ plain form
3072 106823441 106751534 106687691 106728432 106815216 106946350 107047722 107015846 106937027 106831863 106793854 106997894
3083 106997894 107220337 107272461 107224419 107024452 106849434 106900665 107052948 107294273 107486267 107421448 107294914
3094 107294914 107238960 107234642 107333992 107456352 107552719 107579926 107418297 107248306 107232498 107304855 107501266
3105 107501266 107678314 107654091 107579758 107548569 107552261 107640221 107732437 107753540 107739044 107683945 107634254 107648613
3117 107648613 107684067 107730652 107747772 107651924 107561798 107597565 107671257 107742233 107788681 107744003 107701538 107771965
3129 107771965 107836388 107780739 107701180 107664009 107644630 107645462 107651711 107640289 107638123 107669304 107718994 107791901 107853172
3142 107853172 107857872 107840919 107830643 107801559 107710052 107638832 107670975 107761787 107935333 108068153 107998726 107865021
3154 107865021 107742187 107657074 107688881 107755661 107796333 107827545 107851410 107850052 107801079 107720016 107582924 107485535
3166A07485535P4501J12770L8315L3218P4333P2098N0903K358j13007j29082p9727
3177A07622215M364K01821K28523J04622L3424m9324r0080j15273p2883R1697J07857
3188A08066963j2443m6563o3972r438J72707K04186J27311N0835j20903j14273J05591
3199A08360001J25389l1258m5776L4782P9750J58959J23642p8034r0240Q0726J04187
3210A08822128L3310j4137j04240r0767L1211R5604J67160J52894L1402j8883n0186
3221A09055496l2188P3311Q2855J6762k2820r1171o9283O9924R8877M7279K3766q843
3233A09243965j0750K2477L3241L1418L4858N2811L0205n3833o0936O073J9935j0200
3245A09339264O195Q3755P3197l5812n2765j0842L2112J47293J07766j29242j65726
$$ plain form
3166 107485535 107560036 107672806 107711121 107744339 107818672 107890770 107941673 107944031 107831024 107701942 107622215
3177 107622215 107626579 107828400 108056923 108161545 108194969 108145645 108055565 107940292 107867409 107959106 108066963
3188 108066963 108054520 108007957 107943985 107934547 108107254 108311440 108438751 108489586 108368683 108254410 108360001
3199 108360001 108485390 108454132 108408356 108443138 108522888 108681847 108805489 108727455 108637215 108717941 108822128
3210 108822128 108855438 108841301 108737061 108646294 108677505 108773109 108940269 109093163 109124565 109105682 109055496
3221 109055496 109023308 109096619 109179474 109196236 109173416 109082245 109012962 109082886 109181763 109229042 109252808 109243965
3233 109243965 109233215 109255692 109288933 109320351 109355209 109408020 109438225 109384392 109323456 109329529 109349464 109339264
3245 109339264 109345459 109429214 109502411 109466599 109413834 109402992 109435104 109582397 109690163 109560921 109395195
3256A09395195m0962L937L8856K5230p6225o9931L8056P6126R5344O2920n4169r1194
3268A09403183o6711p1526j10458p3433M9545J08093J50040J34277L8338o889m3320
3279A09511139l4546M3770N7724L7880m151j10382j24382o6879j1703R6054J10221
3290A09504745K2126J2497O3728O5208L0777J5328k907P919P7843N4497o9733j12030
3302A09669998j25915q0155Q4786R9296l3355n6862j0849O675L7743J1993j05903j04355
3314A09393097J3542M8370L9696K8664j5259j1421K5459P3433J89667J67198j4351
3325A09938095o6444l0136l0091k7443n3283j37665j29440k2957P774j2184r300K624
3337A09429550M959N646q743n5725n2185k579K7634P8063N5497o9397q5976o462P248
$$ plain form
3256 109395195 109354233 109358170 109397026 109422256 109346031 109276100 109314156 109390282 109485626 109548546 109494377 109403183
3268 109403183 109336472 109264946 109154488 109081055 109130600 109238693 109388733 109523010 109561348 109554459 109511139
3279 109511139 109476593 109520363 109578087 109615967 109611816 109501434 109377052 109310173 109298470 109394524 109504745
3290 109504745 109526871 109539368 109603096 109668304 109699081 109714409 109711502 109719421 109797264 109851761 109782028 109669998
3302 109669998 109544083 109463928 109548714 109648010 109614655 109557793 109546944 109553619 109591362 109603355 109497452 109393097
3314 109393097 109406639 109455009 109494705 109523369 109508110 109496689 109522148 109595581 109785248 109952446 109938095
3325 109938095 109871651 109841515 109811424 109783981 109730698 109593033 109463593 109440636 109448410 109436226 109426926 109429550
3337 109429550 109434509 109440155 109431412 109375687 109323502 109320923 109348557 109426620 109482117 109412720 109326744 109320282 109327530
3350A09327530j6693k9274n6557m3487M745N3696J66679J24573j33301j45172Q0254
3361A09332993J15844P630j572N0568P1762J10481O4804j24237j19186R8587J17088
3372A09724762l6072n9631K3224L906j08643j41624j59691p7248J88256K20726N3070
3383A09631035l0464j47156j12557J27907J71120P6004R804j10062j20659j7189J7853
3394A09495636K1194K8229L3432K3247M73l2639j10458r7946m265P2144K13287J89430
3406A09831764l2646r0736l2830k9617p0190k7466J44958J34140p4081j10504k9282
3417A09613510J6739R8564Q4923m4754p6889o0867j2803J36040J26625n3474r5818
3428A09731796m7043k9068j0032M310J9387J9195L960j1261n6618k6611J00685J31821
$$ plain form
3350 109327530 109310837 109281563 109225006 109181519 109186264 109239960 109406639 109531212 109397911 109252739 109332993
3361 109332993 109448837 109456467 109454895 109505463 109577225 109687706 109752510 109628273 109509087 109607674 109724762
3372 109724762 109688690 109629059 109652283 109656189 109547546 109405922 109246231 109168983 109357239 109577965 109631035
3383 109631035 109600571 109453415 109340858 109468765 109639885 109715889 109725693 109615631 109494972 109477783 109495636
3394 109495636 109516830 109545059 109578491 109601738 109602211 109569572 109459114 109361168 109356903 109429047 109642334 109831764
3406 109831764 109799118 109708382 109675552 109645935 109575745 109548279 109693237 109827377 109753296 109642792 109613510
3417 109613510 109630249 109728813 109813736 109768982 109692093 109631226 109618423 109754463 109881088 109827614 109731796
3428 109731796 109684753 109655685 109645653 109649963 109669350 109688545 109692505 109681244 109624626 109598015 109698700 109830521
3440A09830521J11007N4695r6511j21857m3205N867J01928P2144j21597j54160p3074
3451A09565758j3420Q2565J18729J28677P3952j11336j25267K2575O8642Q4190M7463
3462A09942528p6126j26648j71044j01753J54160J97219O5377O149o2752n9745M3914
3473A09811279N1476k1172m1031l5308k8466j3191N562L1158N4909R8061Q4137J0154
3485A10007568l5522j15250o8191J73019J77887n1712r2842r682L1449J02188Q1970
3496A10200882o4728p5584L2280O4850Q1802L8414j16325j33805j9333k59m6570n1117
3508A09910507l7475j8692L3424J8860q7502q5205J8830N1597M4777M4556K3178M5463
3520A09962318J49224J18309o4064j14968q3328n6526K3224J2131j24573j04096Q2810
$$ plain form
3440 109830521 109941528 109996223 109899712 109777855 109734650 109740517 109842445 109914589 109792992 109638832 109565758
3451 109565758 109552338 109634903 109753632 109882309 109956261 109844925 109719658 109742233 109810875 109895065 109942528
3462 109942528 109866402 109739754 109568710 109466957 109621117 109818336 109883713 109889862 109827110 109767365 109811279
3473 109811279 109862755 109841583 109800552 109765244 109736778 109723587 109729149 109760307 109815216 109913277 109997414 110007568
3485 110007568 109972046 109856796 109788605 109961624 110139511 110087799 109994957 109985275 110016724 110118912 110200882
3496 110200882 110136154 110060570 110092850 110157700 110239502 110277916 110161591 110027786 110008453 110008194 109961624 109910507
3508 109910507 109873032 109854340 109887764 109906624 109819122 109733917 109752747 109804344 109849121 109893677 109916855 109962318
3520 109962318 110111542 110229851 110165787 110050819 109967491 109910965 109934189 109946320 109821747 109717651 109800461
3531A09800461J16127L3523M265k2789j2306O0417O1012k2361q034J24260J11603j7189
3543A10228989j14746k84531k60262k3933Q5976J87492J46652j07506j57524q0322
3553A09620285J4114K38251K52083P2952k8587j66939j55327M9156Q8097J6670k7801
3564A09972954j17134j01425M9758O4469o6040l5073J90163J71639r7756j51634o0341
3575A09819580r018P1365Q9737O5064J2451j36520j23696R0912Q9195j05957j68037
3586A09695076k00295j16539J81389K14341j5450l7788J07925J09009J6090o1058k06825
3597A09685875j93741J3542M6227n7244q1970r2071m6135J11076J16974m6280m5158
3608A09411095J21025J15844n6312p6752K3224M9973N2765K8083m9469p4798m3671
$$ plain form
3531 109800461 109916588 109950111 109954376 109931587 109919281 109979698 110040710 110018349 110010315 110134575 110246178 110228989
3543 110228989 110114243 109829712 109569450 109545517 109631493 109818985 109965637 109858131 109700607 109620285
3553 109620285 109634399 109872650 110124733 110197685 110169098 110002159 109846832 109895988 109984085 110000755 109972954
3564 109972954 109855820 109754395 109804153 109868622 109802582 109767509 109957672 110129311 110031555 109879921 109819580
3575 109819580 109810562 109881927 109971664 110036728 110049179 109912659 109788963 109879875 109969070 109863113 109695076
3586 109695076 109494781 109378242 109559631 109773972 109758522 109720734 109828659 109937668 109953758 109892700 109685875
3597 109685875 109492134 109505676 109551903 109494659 109412689 109320618 109274483 109385559 109502533 109456253 109411095
3608 109411095 109532120 109647964 109591652 109514900 109538124 109588097 109640862 109668945 109619476 109544678 109501007
3619A09501007p8178k41043j59501K54006K76161r3460j30028R2072J45508J40121
3629A09706665O3705j65107k08878j12510l3928J17950J36726R972o462M0245Q2870
3640A09631248J71090J73454Q4755N7243R5200K9014j85844k01798k0004J6426m2030
3651A09808754n4504o7467l6057Q3329P1243p2769j27602j63673j20781L3828J08887
3662A09463188J53687J62025J43891O5376j33133j79436p8323q2825j81053j67633
3672A09165764p2548J8784K02133J79718q3733j49322q8669n4215q293N0850J76430
3683A09336899J53732n0209q9027P370J2184n9731m1244J01303O5826j78528k06375
3694A09052200m2099j3733r4535o3584P3097J18569J06071R9251R4414M2557j01563
$$ plain form
3619 109501007 109422829 109181786 109022285 109276291 109552452 109458992 109328964 109421036 109566544 109706665
3629 109706665 109770370 109605263 109396385 109283875 109249947 109367897 109504623 109514595 109508133 109548378 109631248
3640 109631248 109802338 109975792 110060547 110117790 110212990 110242004 110056160 109854362 109834358 109850784 109808754
3651 109808754 109754250 109686783 109650726 109734055 109805298 109732529 109604927 109441254 109320473 109354301 109463188
3662 109463188 109616875 109778900 109922791 109988167 109855034 109675598 109597275 109514450 109333397 109165764
3672 109165764 109093216 109112000 109314133 109493851 109410118 109260796 109172127 109117912 109109619 109160469 109336899
3683 109336899 109490631 109440422 109351395 109358765 109370949 109311218 109269974 109371277 109437103 109258575 109052200
3694 109052200 109010101 108996368 108901833 108838249 108911346 109029915 109135986 109235237 109329651 109372208 109270645
3705A09270645j08223K3110O0340N3406L4401k4818m3892l0708l4310m3846n3978q7692
3717A09014435n8548M9469Q5541Q6952N5099n0995o9099o935L960k3056j0132L7094
3729A09113785O2996Q6471Q7258P4035L2090o7353r4581q4572k7413J60241J34681
3740A09477638j36230j80413p2357J3802J65581K06779J97342P3647l00003l17406
3750A09128380J5808J15868J06597P6439l6857p2838p0595l4546O8665J09863J29814
3761A09536598R4391k8130p7056r2369p4959J4686J9173n6503p5150p8659l6980R1912
3773A09236954J09627L2707o676o8138m5563J03668J02684m5677p6126j8341j8906
3784A09306213n6167p0191r3200n6267P7103R1934j0872k0073M9042M6280j1567m1839
$$ plain form
3705 109270645 109162422 109185532 109245872 109299278 109333679 109308861 109264969 109234261 109199951 109156105 109102127 109014435
3717 109014435 108955887 109005356 109090897 109177849 109232948 109181953 109112854 109105919 109109879 109086823 109076691 109113785
3729 109113785 109176781 109263252 109350510 109424545 109456635 109389282 109294701 109210129 109182716 109342957 109477638
3740 109477638 109341408 109160995 109088638 109102440 109268021 109474800 109672142 109745789 109445786 109128380
3750 109128380 109144188 109260056 109366653 109443092 109406235 109333397 109262802 109228256 109296921 109406784 109536598
3761 109536598 109630989 109602859 109525803 109433434 109358475 109373161 109392334 109335831 109260681 109182022 109145042 109236954
3773 109236954 109346581 109379288 109372612 109304474 109258911 109362579 109465263 109419586 109343460 109325119 109306213
3784 109306213 109250046 109179855 109086655 109030388 109107491 109199425 109188553 109168480 109217522 109263802 109252235 109210396
3796A09210396n3528r3437k00913j71920j2642R7519K63855K44308P63p2548l5477
3807A09176376m3037j06529k5887K77870K88590K3193p0190q6663r4154l7529o9565
3818A09232475k24449k12936m7707L2448R5230J08574N2711L8628L1754N9318J66535
3829A09332581J45103j0681o9786q7494p3700J4854J4763r0339p1671R2171Q6502p4341
3841A09207962j33034j56402j34880l6522J243j9272L0068K01538J57806j38206k01134
3852A08779167r2193n2048k2247L837L555O0532K37320K00035r7343j37238M7951P0282
3864A09001610k7130k8733M4373O0722N0644K4269o0203m5960J05377Q3252j29432
3875A09078789j53778m5800L9643K20108J79939j33781j93924p3792p652J09047R2293
$$ plain form
3796 109210396 109156868 109063431 108862518 108690598 108677956 108775475 109039330 109283638 109284401 109211853 109176376
3807 109176376 109133339 109026810 109000923 109278793 109567383 109590576 109520386 109433723 109339569 109302040 109232475
3818 109232475 109008026 108795090 108747383 108779831 108875061 108983635 109036346 109074974 109106728 109166046 109332581
3829 109332581 109477684 109467003 109397217 109309723 109236023 109250877 109265640 109175301 109103630 109195801 109282303 109207962
3841 109207962 109074928 108918526 108783646 108747124 108748367 108729095 108759163 108960701 109118507 108980301 108779167
3852 108779167 108686974 108634926 108612679 108616516 108620071 108680603 108917923 109117958 109020615 108883377 108931328 109001610
3864 109001610 108974480 108945747 108990120 109050842 109101486 109125755 109065552 109019592 109124969 109208221 109078789
3875 109078789 108925011 108879211 108918854 109138962 109318901 109185120 108991196 108917404 108909752 109018799 109111092
3886A09111092r0241j25595o9572j2085J21589J22406k3651n1765k289K1362N1331
3897A09052582O2210P4501L1471j13464j17302K5345M9804O752m1984j56883j58120
3908A08714912o0440J5046J53183J35421p0190j17562n9585l1059J7906K2285l4401
3919A08685516k1454O4225P9422L7857K7443J8478M1725J32653J18324k1431l3142
3930A09129616R1171O5903j14868j42006n9220r76J25404Q3687j90018k04017O576
3941A08791252R0408J72425J03859k02156k49695r6199p897J40290J14082j52779j60911
3952A08542679O6452J22833Q1635N5526m913j4809L7552K0195p3578q5159j9455j5854
3964A08713104o2446o7543p7416J030K48909K48383m242p6485n0262l0709M3656L1784
$$ plain form
3886 109111092 109020851 108895256 108825684 108813599 108935188 109057594 109033943 108982178 108979889 109001251 109052582
3897 109052582 109114792 109189293 109220764 109107300 108989998 109015343 109065147 109071899 109029915 108873032 108714912
3908 108714912 108654472 108669518 108822701 108958122 108887932 108770370 108710785 108679726 108697632 108719917 108685516
3919 108685516 108664062 108728287 108807709 108845566 108873009 108891487 108933212 109065865 109184189 109162758 109129616
3930 109129616 109220787 109286690 109171822 109029816 108970596 108969620 109095024 109178711 108988693 108784676 108791252
3941 108791252 108881660 109054085 109157944 108955788 108706093 108609894 108601997 108742287 108856369 108703590 108542679
3952 108542679 108609131 108731964 108813599 108869125 108864212 108849403 108886955 108907150 108833572 108748413 108728958 108713104
3964 108713104 108650658 108583115 108505699 108506729 108755638 109004021 108999779 108923294 108873032 108842323 108885979 108917763
3976A08917763r6779p9247Q6853J28724J20330L8338j92360k48070j78009j09359K8823
3987A08417007P9705P9872L9673q3588j29822j39190j11245j6525K6398M9736M2984
3998A08255005k2583k1546
4000A08210876
$$ plain form
3976 108917763 108820984 108741737 108828590 108957314 109077644 109115982 108923622 108675552 108497543 108388184 108417007
3987 108417007 108496712 108576584 108616257 108532669 108402847 108263657 108152412 108135887 108162285 108212021 108255005
3998 108255005 108232422 108210876
4000 108210876
##END=$$ End of the data block
