##TITLE=$$ Begin of the data block
##JCAMP-DX=5.00 $$ ACD/SpecManager v 10.08
##SPECTROMETER/DATA SYSTEM=Alpha
##DATE=26 Dec 2014 10:25:20
##DATA TYPE=INFRARED SPECTRUM
##DATA CLASS=XYDATA
##ORIGIN=
##OWNER=
##NPOINTS=1765
##FIRSTX=399.76428223
##LASTX=3997.64306641
##MAXX=3997.64306641
##MINX=399.76428223
##MAXY=0.83585894
##MINY=0.19464707
##XFACTOR=1.0000000000
##YFACTOR=1.000000000000000e-9
##FIRSTY=0.52850580
##DELTAX=2.03961372
##XUNITS=1/CM
##YUNITS=ARBITRARY UNITS
##XYDATA=(X++(Y..Y))
399.8E28505802m884183m325032k807737o30736R35972J551806J351595P32601K11358
418.1E20641446o33716j622200k336443k822876k853930k662897k818108l411948k927482
436.5D98551846l33012K671302M483282M699648M085243L562211L033460K117872O59883
454.8E23531735p83324j452625j237452j303852k317548l734350m249811l732622l185331
473.2E01534820k864033k681256k263337j392394l24667M56035L16084n03868j175821
491.5D91101563j297236j205593j540214k284258k842576k810508k407908k466202
507.9D74247068l549903m806191n032093m614830m472464m551470m304975l406704
524.2D39508438j938164l68804P07716J228601J817047L410608N655438O694138N624949
$$ plain form
399.8 528505802 523621619 519296587 516488850 515858114 516794086 518345892 519697487 520430088 520641446
418.1 520641446 520007730 518385530 516049087 513226211 510372281 507709384 504891276 501479328 498551846
436.5 498551846 498218834 500890136 505373418 510073066 514158309 517720520 520753980 522871852 523531735
454.8 523531735 522748411 521295786 520058334 518754482 516436934 512702584 508452773 504720151 501534820
473.2 501534820 498670787 495989531 493726194 492333800 492009133 492465168 492781252 492277384 491101563
491.5 491101563 489804327 488598734 487058520 484774262 481931686 479121178 476713270 474247068
507.9 474247068 470697165 465890974 460858881 456244051 451771587 447220117 442915142 439508438
524.2 439508438 437570274 437201470 437909186 439137787 440954834 444365442 450020880 456715018 462339967
542.5D62339967L479958J535118L08394m08292j320064k683222l838629m375428m753232
560.9D50284570n457103o588548p826537q150637o784469m142076j237124J280725
577.2D11378801L514498N702377P520139Q268118P567108N723387L639221K057105
593.5D55370754J184434N67525j51455o08981n16653j12176L96520R68993J351178
611.9D58450139J639455K314747L380656M279852M578530M382343M086107L981024
628.2D87092853L851026L348291K519429J780539J490176J572251J603127J456916
644.5E04714608J181007Q50021Q70646J305699J590431J366198R48429P44939Q47160
662.9E14419138J176358J875341K139866J140773J120687J783490K146304K009272
$$ plain form
542.5 462339967 465819925 467355043 467663437 467255145 465935081 463251859 459413230 455037802 450284570
560.9 450284570 444827467 438238919 430412382 422261745 415477276 411335200 410098076 411378801
577.2 411378801 414893299 420595676 428115815 436383933 443951041 449674428 453313649 455370754
593.5 455370754 456555188 457122713 456971258 456362277 455845624 455733448 456129968 457098961 458450139
611.9 458450139 460089594 462404341 465784997 470064849 474643379 479025722 483111829 487092853
628.2 487092853 490943879 494292170 496811599 498592138 500082314 501654565 503257692 504714608
644.5 504714608 505895615 506745636 507616282 508921981 510512412 511878610 512827039 513571978 514419138
662.9 514419138 515595496 517470837 519610703 520751476 521872163 523655653 525801957 527811229
679.2E27811229J598418J282036J213908J174033Q95202J87636r83775k038300k559841
697.5E28580546k930104l391803l556311l013670j677811J23083J820564L107787M075825
715.9E23138106N014062O050706O800592P022321O783366O176770N595922N149782
732.2E71731627M525423L553093K351701J251995L57747o03616j968443l601194m954576
750.6E72643757n587518n603850n375922n100667m610599l413140j319111J350522
766.9E42983472M034877O227315P865131R191215J0124445J0207891R233356P601499
783.2F07469201O076992N192458M865706M626334M266798M067004M375935M935562
799.5F45875990N139172M664898L646315K609670K025008J946509J872122J345396
$$ plain form
679.2 527811229 529409647 530691683 531905591 533079624 533974826 534162462 533178687 531140387 528580546
697.5 528580546 525650442 522258639 518702328 515688658 514010847 514133930 515954494 519062281 523138106
715.9 523138106 528152168 534202874 541003466 548025787 554809153 560985923 566581845 571731627
732.2 571731627 576257050 579810143 582161844 583413839 583771586 583167970 581199527 577598333 572643757
750.6 572643757 567056239 561452389 556076467 550975800 546365201 542952061 541632950 542983472
766.9 542983472 547018349 553245664 561110795 570302010 580426455 590634346 599867702 607469201
783.2 607469201 613546193 618738651 623604357 628230691 632497489 636564493 640940428 645875990
799.5 645875990 651015162 655680060 659326375 661936045 663961053 665907562 667779684 669125080
815.8F69125080M10855m41790q64863j294136k294719l748775n138576n994320o172299
834.2F43586457o052435o011963o009757n703509m906237l958285l489733l721714
850.5F03732824m278600m731834m848659m189789j880527K236009O780147J0380626
866.8F03200197J2711168J3488888J2323320R579540O240248L015816m7624l023505
883.2F57488048n581975p187545p624984p248342o652474o210030n933284n681813
899.5F05367601n545974n836665o751657q086503r353935j0298312j0935485j1202217
915.8E37356853j0849773r574473p334531m652023k316713p54714K81393J358688K654851
934.1E06169558L963232N076289N792916N731940M255533J026929l338397p759929
$$ plain form
815.8 669125080 669535935 669094145 668229282 666935146 664640427 660891652 655753076 649758756 643586457
834.2 643586457 637534022 631522059 625512302 619808793 614902556 610944271 607454538 603732824
850.5 603732824 599454224 594722390 589873731 585683942 583803415 586039424 592819571 603200197
866.8 603200197 615911365 629400253 641723573 651303113 657543361 660559177 660511553 657488048
883.2 657488048 651906073 644718528 637093544 629845202 623192728 616982698 611049414 605367601
899.5 605367601 599821627 593984962 587233305 579146802 569792867 559494555 548559070 537356853
915.8 537356853 526507080 516932607 509598076 504946053 502629340 501874626 502156019 503514707 506169558
934.1 506169558 510132790 515209079 521001995 526733935 530989468 532016397 528678000 520918071
950.5E20918071j1500835j4225274j5953213j7084092j8055201j9029707j9937724
964.7D05132025k0663827k1196932k1562189k1695703k1458745k0651787j9088507
979B58814335j6770437j3996915j1117011q327097n838170l795892k187967r36836
995.3A95844010l0160N02675P12708O63862L07187k72870q05572j063555q80629l30582
1015.7A94647074L84629J160368J963824K729058L373236L792956L917605L810152
1032B15778902L437832K751678J922802J251980R42156J013845J343712J916141K872795
1050.4B33231843M243418N786747P185265Q428991R722710J1007905J1347890R090095
1066.7C00044864L209055m753292j0779142j1896908q920938m712016j093626J575113
$$ plain form
950.5 520918071 509417236 495191962 479238749 462154657 444099456 425069749 405132025
964.7 405132025 384468198 363271266 341709077 320013374 298554629 277902842 258814335
979 258814335 242043898 228046983 216929972 208602875 202764705 198968813 196780846 195844010
995.3 195844010 195813850 196316525 197029233 197693095 198000282 197727412 196921840 195858285 194977656 194647074
1015.7 194647074 195031703 196192071 198155895 200884953 204258189 208051145 211968750 215778902
1032 215778902 219216734 221968412 223891214 225143194 226085350 227099195 228442907 230359048 233231843
1050.4 233231843 237475261 243262008 250447273 258876264 268598974 279606879 290954769 300044864
1066.7 300044864 303253919 298500627 287721485 275824577 266903639 262191623 261097997 262673110
1083B62673110L487229M859746N902201O701350P048666O662011N491913L841251K199620
1101.4C08867097J162022J178354K169162L508807M519760M893005M672080M041076
1117.7C35011363L204346K454906K142221K536804L550231M621923M897982L759623
1134C62179399J216381k173245n523055q007318r213060r259761q475810p092983n304962
1152.4C08345586l373235j502693K87264K097697M079639O306321Q697778J1020094
1168.7C35958451J3021559J4558136J5577525J6067892J6107500J5781879J5123070
1183D42196012J4131605J2715757J0776669Q438736O124854M234314K909362K104700
1199.3E03632009J757443J824081K285302L117621M123687M996240N496443N502820
$$ plain form
1083 262673110 266160339 271020085 276922286 283623636 290672302 297334313 302826226 306667477 308867097
1101.4 308867097 310029119 311207473 313376635 316885442 321405202 326298207 330970287 335011363
1117.7 335011363 338215709 340670615 342812836 345349640 348899871 353521794 358419776 362179399
1134 362179399 363395780 361222535 355699480 347692162 338479102 329219341 320743531 313650548 308345586
1152.4 308345586 304972351 303469658 303756922 305854619 309934258 316240579 324938357 335958451
1168.7 335958451 348980010 363538146 379115671 395183563 411291063 427072942 442196012
1183 442196012 456327617 469043374 479820043 488258779 494383633 498617947 501527309 503632009
1199.3 503632009 505389452 507213533 509498835 512616456 516740143 521736383 527232826 532735646
1215.6E32735646N018532M107833K818942J279771k04861j269519j783133j943290
1231.9E40759921k000153j998425j808345j332819o29008J62065R08375J510024J989960
1250.3E37561595K360106K440453K100944J515806J076519J060367J463592J988828
1266.6E51568210K232194K085924J670957J082837M15206k69949q49783j096011j030624
1285E55808961r29296j008570j356363j829744k128601k182126k161443k195597k280294
1303.3E39736927k330125k195835j831472j519859j506805j661241j765847j794756
1319.6E25130987k092063l062606m493117n694032o131113n769163m960001l993332
1336D88935560k895594j594305k96354N06908O75678L52561j45047m62533o11335q18043
$$ plain form
1215.6 532735646 537754178 541862011 544680953 545960724 545755863 544486344 542703211 540759921
1231.9 540759921 538759768 536761343 534952998 533620179 532991171 533153236 534061611 535571635 537561595
1250.3 537561595 539921701 542362154 544463098 545978904 547055423 548115790 549579382 551568210
1266.6 551568210 553800404 555886328 557557285 558640122 559055328 558785379 557935596 556839585 555808961
1285 555808961 554879665 553871095 552514732 550684988 548556387 546374261 544212818 542017221 539736927
1303.3 539736927 537406802 535210967 533379495 531859636 530352831 528691590 526925743 525130987
1319.6 525130987 523038924 519976318 515483201 509789169 503658056 497888893 492928892 488935560
1336 488935560 486039966 484445661 484149307 484656215 485331893 485684454 485539407 485076874 484465539 483647496
1356.4D83647496j163841j542359j710326j293361p26283m59581j88649K33054P76172
1374.7D77572322J162946J262218J274526J539439K452850L947437M551351L507406
1391D97270495K090782P18176l34889r20564j205265j559943k135903k324760k130806
1409.4D89467323j905471j601607j300961j183480q30024M3571P68781J120597J237183
1427.7D85815912J447827J772404K018750K504199K791494K246648J965851J827300
1444.1E02390385J431465O93679k33472r49502j309991j742720j476944J35660J322806
1462.4E00261366K795279M526914N547642P206619J0582864J1583388R946406Q992970
1478.7E61443448Q665025Q287430P216275O548941O753266O664097N273163M471541
$$ plain form
1356.4 483647496 482483655 480941296 479230970 477937609 477211326 476751745 476563096 476796150 477572322
1374.7 477572322 478735268 479997486 481272012 482811451 485264301 489211738 493763089 497270495
1391 497270495 499361277 500079453 499744564 498824000 497618735 496058792 493922889 491598129 489467323
1409.4 489467323 487561852 485960245 484659284 483475804 482645780 482689351 483458132 484578729 485815912
1427.7 485815912 487263739 489036143 491054893 493559092 496350586 498597234 500563085 502390385
1444.1 502390385 503821850 504515529 504282057 503332555 502022564 500279844 498802900 498938560 500261366
1462.4 500261366 503056645 507583559 513131201 520337820 530920684 542504072 552450478 561443448
1478.7 561443448 570108473 578395903 585612178 592161119 598914385 605578482 610851645 615323186
1495F15323186M626989M292429L593504L006458K909661L431082K877116K188742K085805
1513.4F44334972K077520K129614J876295J707554J658201J560569J552164J221895
1529.7F58118784P84100N47230N98848N34415K50101j47760k37226j96696k11537l08632
1550.1F59731627m82739p22587r22501j452863j561165o80983p93040j090765j220762
1568.5F50804222j131595o40034o86825j221478j058518o69837o31273p23005j009285
1586.8F43032372j339674j529872j537860j584411j815438k218544k679587k925276
1603.2F27401710k963841l124178l587305l883124l813624m183471m703701l645837
1619.5E97496629l281653m060626l889740l404319l117383k476394k282858k672433
$$ plain form
1495 615323186 619950175 624242604 627836108 630842566 633752227 637183309 640060425 642249167 644334972
1513.4 644334972 646412492 648542106 650418401 652125955 653784156 655344725 656896889 658118784
1529.7 658118784 658902884 659450114 660048962 660583377 660833478 660685718 660448492 660251796 660040259 659731627
1550.1 659731627 659248888 658526301 657603800 656150937 654589772 653908789 653115749 652024984 650804222
1568.5 650804222 649672627 649032593 648345768 647124290 646065772 645395935 644764662 644041657 643032372
1586.8 643032372 641692698 640162826 638624966 637040555 635225117 633006573 630326986 627401710
1603.2 627401710 624437869 621313691 617726386 613843262 610029638 605846167 601142466 597496629
1619.5 597496629 594214976 590154350 586264610 582860291 579742908 577266514 574983656 572311223
1635.8E72311223j779378n77509j18614R9898M05252J094401J426518K084970L653169
1654.1E78599930L243208K861202L412961M375279M799962M230500M549324N545140
1670.5F11617506N235672N488038O033420N260766M657209N271613P240236O393790
1686.8F57198250N002380N015969M474878M592419M988492M640519M835010L844559
1703.1F94592476L247321L541588L226638K765298K397835K137602K140045J741528
1719.4G15790331J124978J093626J575590J907050J999438J868963K008200K187073
1735.7G29555249J846373J909495K133548K173901K230227K396881K890647L310263
1752G48446584K983331K698899K586722K331197K324820K153397J780808J561701J419246
$$ plain form
1635.8 572311223 570531845 569954336 569835722 569935620 570340872 571435273 572861791 574946761 578599930
1654.1 578599930 581843138 584704340 588117301 592492580 597292542 601523042 606072366 611617506
1670.5 611617506 616853178 622341216 628374636 633635402 638292611 643564224 650804460 657198250
1686.8 657198250 662200630 667216599 671691477 676283896 681272388 685912907 690747917 694592476
1703.1 694592476 697839797 701381385 704608023 707373321 709771156 711908758 714048803 715790331
1719.4 715790331 716915309 718008935 719584525 721491575 723491013 725359976 727368176 729555249
1735.7 729555249 731401622 733311117 735444665 737618566 739848793 742245674 745136321 748446584
1752 748446584 751429915 754128814 756715536 759046733 761371553 763524950 765305758 766867459 768286705
1770.4G68286705J436472J511335J390756J235365J147151J123608J127064J103222
1786.7G78361678R54747P92444R26197J066088R70662Q47340Q53717R26852R09031
1805.1G86608756Q42034P77781P86603P98702P71046P46608P32183O30438N12124N68687
1825.5G93774962O38128N90443N81384N54144M59791M49240M36246K87116J50263K68936
1845.9G98190653M31121M36783L53574K36869J74284J83940K75612L22580K36154O6042
1866.3H00907612K3126K92421M97401M29928L02195K63513K94745L88562M63844L86416
1886.7H04249763K35916K41995L28063L41952L17097K09451J10507J21712J79232J65641
1907.1H06501329J08778R4772R7990J01805J28090J73211J28567R8765J92285K51651
$$ plain form
1770.4 768286705 769723177 771234512 772625268 773860633 775007784 776131392 777258456 778361678
1786.7 778361678 779316425 780108869 781035066 782101154 783071816 783919156 784772873 785699725 786608756
1805.1 786608756 787450790 788228571 789015174 789813876 790584922 791331530 792063713 792694151 793206275 793774962
1825.5 793774962 794413090 795003533 795584917 796139061 796598852 797048092 797484338 797771454 797921717 798190653
1845.9 798190653 798621774 799058557 799412131 799649000 799823284 800007224 800282836 800605416 800841570 800907612
1866.3 800907612 800930738 801223159 801720560 802150488 802452683 802716196 803010941 803399503 803863347 804249763
1886.7 804249763 804485679 804727674 805055737 805397689 805714786 805924237 806034744 806156456 806335688 806501329
1907.1 806501329 806610107 806704879 806802869 806904674 807032764 807205975 807334542 807433307 807625592 807877243
1927.5H07877243K17199J30892L7312K3663J14620J61350J12831J07706J58548J91927
1947.9H09133291K47717K93791K44081J43409J12832J97530K75552K23160J00434P7784
1968.3H11049581J54554K24293K41041J60694N5492L9160J04845J66476J45018M0233
1988.7H12381387n3466l5286Q8215J40548N0366o8963j37627j36733j24633j70231
2009H11933577k62380l36051l69608l52085l35574m67837p40945p81178l54827J79
2029.4H07933271j11461l84211n02467m34101l16322k68459l07560l40283k88725j82331
2049.8H04797351q6844o1512q5771p1346k325P3075J29760J18255K7597j3471N5731
2072.3H04880500J12235Q3149J8179Q107O4730J27137J45614J06931P9751J02699J61230
$$ plain form
1927.5 807877243 808094442 808225334 808262646 808286309 808400929 808562279 808675110 808782816 808941364 809133291
1947.9 809133291 809381008 809674799 809918880 810062289 810175121 810372651 810648203 810871363 810971797 811049581
1968.3 811049581 811204135 811428428 811669469 811830163 811885655 811924815 812029660 812196136 812341154 812381387
1988.7 812381387 812327921 812292635 812380850 812521398 812571764 812502801 812365174 812228441 812103808 811933577
2009 811933577 811671197 811335146 810965538 810613453 810277879 809810042 809069097 808287919 807933092 807933271
2029.4 807933271 807821810 807437599 806935132 806501031 806184709 805916250 805608690 805268407 804979682 804797351
2049.8 804797351 804710507 804648995 804563224 804491878 804489553 804562628 804692388 804810643 804838240 804824769 804880500
2072.3 804880500 804992735 805075884 805094063 805102170 805166900 805294037 805439651 805546582 805626333 805729032 805890262
2094.7H05890262K14040K22147J61409R1136J12712J55807J42872J17302R8109R8646
2115.1H07304442J33991J12295K0981m0471l9339J4245O8903O2883J5557R53O318L6300
2139.6H07697058R5784Q5652k38k4438N4717J28031J40488J34349J68741K43365L15488
2162H09038997L48687L44872L51310M07934N05388N60343N11825M33326M36783M82082
2182.4H13421547M97461M84288M63366M45008M23134M38928M49002L92973L45052L79979
2202.8H17740738M57883M79758M45843M16636L87669L73065M10200M23312L43442K62618
2223.2H21741164K84254L58165L70979K99871K20299K28107L17812L51131K51829J25408
2243.6H24549019R2030J90139L22640L27825K06948J04546J20759K16007K96176K82585
$$ plain form
2094.7 805890262 806104302 806326449 806487858 806578994 806691706 806847513 806990385 807107687 807205796 807304442
2115.1 807304442 807438433 807550728 807571709 807531238 807491899 807506144 807575047 807637930 807653487 807654440 807660758 807697058
2139.6 807697058 807792842 807878494 807878256 807853818 807908535 808036566 808177054 808311403 808480144 808723509 809038997
2162 809038997 809387684 809732556 810083866 810491800 810997188 811557531 812069356 812502682 812939465 813421547
2182.4 813421547 813919008 814403296 814866662 815311670 815734804 816173732 816622734 817015707 817360759 817740738
2202.8 817740738 818198621 818678379 819124222 819540858 819928527 820301592 820711792 821135104 821478546 821741164
2223.2 821741164 822025418 822383583 822754562 823054433 823274732 823502839 823820651 824171782 824423611 824549019
2243.6 824549019 824641049 824831188 825153828 825481653 825688601 825793147 825913906 826129913 826426089 826708674
2264H26708674K05994J59383J64926K31564L06308K74360J53661Q9407J67906L16799
2284.4H28778982L42786J99557Q4042J35303K63274L00884K20477J26124J37329K67565
2304.8H30856323M22836M76121L37303J49548J81735M28438O09040N33521L01302J64032
2325.2H34460199K08914L09050K49982K742j72377j43051K0743L0279m12107j072228
2345.6H33482146j024961j62542P90834J231969J001298N02885L7312k63631n47290
2363.9H35048020q32498j075268j257896j236380j068890r28759r06289r42588q44955
2382.3H25954497n85377l31521k16127k44617l12209l10123k08140j26481k03431l79204
2402.7H23037267m74692m07397k88666k64287l74674m98891n28932n02408m68611m88818
$$ plain form
2264 826708674 826914668 827074051 827238977 827470541 827776849 828051209 828204870 828294277 828462183 828778982
2284.4 828778982 829121768 829321325 829405367 829540670 829803944 830104828 830325305 830451429 830588758 830856323
2304.8 830856323 831279159 831755280 832092583 832242131 832423866 832852304 833461344 833994865 834296167 834460199
2325.2 834460199 834669113 834978163 835228145 835230887 835058510 834915459 834936202 834966481 834554374 833482146
2345.6 833482146 832457185 832294643 833085477 834317446 835318744 835821629 835858941 835595310 835048020
2363.9 835048020 834215522 833140254 831882358 830645978 829577088 828648329 827742040 826799452 825954497
2382.3 825954497 825369120 825037599 824821472 824576855 824264646 823954523 823746383 823619902 823416471 823037267
2402.7 823037267 822562575 822155178 821866512 821602225 821227551 820728660 820199728 819697320 819228709 818739891
2423.1H18739891n83768o67274o55413n46813m59909n45979p05361p10606n86391n16534
2443.5H12761843n66065o69479p46489p33912o30021n03779m85837n95629o64711o00815
2463.9H06565106n15103n26667n74946n96822o02960n56410m70578m47214n03600n53488
2484.3H01217318n32210m56810l92676l70204l88980l91603l54230l22163k91765l08513
2504.7G97408164l87550l96073l20553k75195l01361m00365n13434n46396m73678l90291
2525.1G93403268m38869o06716p05063o42300n51402n49496o40809p51078p69556o87361
2545.5G87060618o18517o44386o93977p09474o96003o34015n65708n76436o59406p16508
2565.8G80546188o75261n91576n76138o58691p55012p16627n52297m48524m90427o01113
$$ plain form
2423.1 818739891 818156123 817488849 816833436 816286623 815826714 815280735 814575374 813864768 813278377 812761843
2443.5 812761843 812195778 811526299 810779810 810045898 809415877 808912098 808426261 807830632 807165921 806565106
2463.9 806565106 806050003 805523336 804948390 804351568 803748608 803192198 802721620 802274406 801770806 801217318
2484.3 801217318 800685108 800228298 799835622 799465418 799076438 798684835 798330605 798008442 797716677 797408164
2504.7 797408164 797020614 796624541 796303988 796028793 795727432 795327067 794813633 794267237 793793559 793403268
2525.1 793403268 792964399 792357683 791652620 791010320 790458918 789909422 789268613 788517535 787747979 787060618
2545.5 787060618 786442101 785797715 785103738 784394264 783698261 783064246 782498538 781922102 781262696 780546188
2565.8 780546188 779870927 779279351 778703213 778044522 777289510 776572883 776020586 775572062 775081635 774480522
2586.2G74480522o53208n80310m47810l61622l93033n07593n58853n12600m60565m91559
2606.6G69513369o39022p93278q19445p48515p21633p99239r64582j151562j189231
2625G61686862j055062j009047j156271j314759j344025j251340j131535j131475j292228
2643.4G51001120j410902j351595j212001j116872j169264j318514j349151j200080
2659.7G40872741j046002j027644j125097j229644j206934j033426q92758r41336j058460
2678G31311440j084327j002312q97407q71838r18626j005471j087785j065671r83656
2696.4G22394347j008093j121402j214921j245618j171291j083315j134216j273573
2712.7G13141918j301229j168251j019657r60528j031638j138866j098513r24587q00729
$$ plain form
2586.2 774480522 773827314 773247004 772799194 772437572 772044539 771536946 770978093 770465493 770004928 769513369
2606.6 769513369 768874347 768081069 767261624 766513109 765791476 764992237 764027655 762876093 761686862
2625 761686862 760631800 759622753 758466482 757151723 755807698 754556358 753424823 752293348 751001120
2643.4 751001120 749590218 748238623 747026622 745909750 744740486 743421972 742072821 740872741
2659.7 740872741 739826739 738799095 737673998 736444354 735237420 734203994 733311236 732369900 731311440
2678 731311440 730227113 729224801 728327394 727455556 726536930 725531459 724443674 723378003 722394347
2696.4 722394347 721386254 720264852 719049931 717804313 716633022 715549707 714415491 713141918
2712.7 713141918 711840689 710672438 709652781 708692253 707660615 706521749 705423236 704498649 703697920
2731.1G03697920q24332q98958r15527q74460p89284p03454p32363q79883r37641p80344
2751.4F95361674n93424n92232p15077p70747o95110n79595n60642o71505p91669q47996
2771.8F88543677q28206p46131p75516r58026j102507j125991j092494j087725j208901
2790.2F79618180j430273j572490j567543j516878j543462j689077j885652j989544
2806.5F66423261j976251j974166k045452k186835k324105k383768k390266k411246
2822.8F48731172k518296k699733k848089k895236k912461l009975l205240l458440
2839.1F25183702l698946l877997m061639m245341m290640m108668l720820l293216
2855.5E93886435l047943l137112l550052m085005m594147n090237n565047n930006
$$ plain form
2731.1 703697920 702873588 701974630 701059103 700184643 699395359 698691905 697959542 697079659 696142018 695361674
2751.4 695361674 694768250 694176018 693460941 692690194 691995084 691415489 690854847 690183342 689391673 688543677
2771.8 688543677 687715471 686969340 686193824 685235798 684133291 683007300 681914806 680827081 679618180
2790.2 679618180 678187907 676615417 675047874 673530996 671987534 670298457 668412805 666423261
2806.5 666423261 664447010 662472844 660427392 658240557 655916452 653532684 651142418 648731172
2822.8 648731172 646212876 643513143 640665054 637769818 634857357 631847382 628642142 625183702
2839.1 625183702 621484756 617606759 613545120 609299779 605009139 600900471 597179651 593886435
2855.5 593886435 590838492 587701380 584151328 580066323 575472176 570381939 564816892 558886886
2871.8E58886886o124258o121815n871653n401492m811466m130006l367424k572298
2888.1E20486474j834154j269877r36151q34643q73447r23872j054466j349508j721800
2906.5E09688556k127111k587616l094733l645092m130393m326106m180163l767699
2922.8D81829643l137976k333522j410603m15921P63237K125949L401726M441917N254031
2941.1D90518481N831420O190866O407798O550610O590783O526113O451905O400883
2957.4E41468859O317615O096602N676806N235612M958212M737437M520238M361868
2973.8E83373249M198074M070342L993868L814102L516614L187001K831638K507805
2990.1F11492693K256096J984536J648248J239419Q21769N20885K65121m9114l61979
$$ plain form
2871.8 558886886 552762628 546640813 540769160 535367668 530556202 526426196 523058772 520486474
2888.1 520486474 518652320 517382443 516446292 515611649 514738202 513814330 512759864 511410356 509688556
2906.5 509688556 507561445 504973829 501879096 498234004 494103611 489777505 485597342 481829643
2922.8 481829643 478691667 476358145 474947542 474531621 475294858 477420807 480822533 485264450 490518481
2941.1 490518481 496349901 502540767 508948565 515499175 522089958 528616071 535067976 541468859
2957.4 541468859 547786474 553883076 559559882 564795494 569753706 574491143 579011381 583373249
2973.8 583373249 587571323 591641665 595635533 599449635 602966249 606153250 608984888 611492693
2990.1 611492693 613748789 615733325 617381573 618620992 619442761 619963646 620228767 620179653 619817674
3008.4F19817674o37114r13679j201630j475752j694381j885891k064824k203882k311706
3026.8F05428815k355516k383709k476633k667486k827883k758801k694905k842486
3043.1E84421396l011822l093064l068328l013492l063381l158688l220201l202855
3059.4E59589565l106475l040195l040492l130078l274918l304601l176093k999723
3075.7E34516990k951562l113866l262401l251671l232658l204585l154456l223121
3092.1E09122670l301740l210783l043443l032476l181874l204197l040612k966136
3108.4D84141409l053397l034114k900929k900749k974600l061443l196627l193736
3124.7D59825814l028929k921015k942920k985239k908916k742111k683610k835512
$$ plain form
3008.4 619817674 619180560 618266881 617065251 615589499 613895118 612009227 609944403 607740521 605428815
3026.8 605428815 603073299 600689590 598212957 595545471 592717588 589958787 587263882 584421396
3043.1 584421396 581409574 578316510 575248182 572234690 569171309 566012621 562792420 559589565
3059.4 559589565 556483090 553442895 550402403 547272325 543997407 540692806 537516713 534516990
3075.7 534516990 531565428 528451562 525189161 521937490 518704832 515500247 512345791 509122670
3092.1 509122670 505820930 502610147 499566704 496534228 493352354 490148157 487107545 484141409
3108.4 484141409 481088012 478053898 475152969 472252220 469277620 466216177 463019550 459825814
3124.7 459825814 456796885 453875870 450932950 447947711 445038795 442296684 439613074 436777562
3141D36777562k948761k853781k736807k625167k527654k599329k748460k767801k688587
3159.4D12281215k609879k534151k463400k425522k426952k412081k370715k343982
3175.7C92694533k316386k269595k250374k230137k157480k099991k095878k098054
3192C75176638k084583k060741k014637j952946j881808j825512j831680j858741j812518
3210.3C57853472j735419j705855j679182j638621j606345j596481j603216j538425
3226.7C44749928j416058j322239j290977j431078j586050j518816j386761j293272
3243C33504677j194269j192867j328975j354844j157641j025379j101166j157880j112222
3261.3C22879434j073569j034528r14336p76738q31514r84401j041740j031816r71764
$$ plain form
3141 436777562 433828801 430975020 428238213 425613046 423085392 420486063 417737603 414969802 412281215
3159.4 412281215 409671336 407137185 404673785 402248263 399821311 397409230 395038515 392694533
3175.7 392694533 390378147 388108552 385858178 383628041 381470561 379370570 377274692 375176638
3192 375176638 373092055 371031314 369016677 367063731 365181923 363356411 361524731 359665990 357853472
3210.3 357853472 356118053 354412198 352733016 351094395 349488050 347891569 346288353 344749928
3226.7 344749928 343333870 342011631 340720654 339289576 337703526 336184710 334797949 333504677
3243 333504677 332310408 331117541 329788566 328433722 327276081 326250702 325149536 323991656 322879434
3261.3 322879434 321805865 320771337 319857001 319080263 318248749 317264348 316222608 315190792 314219028
3279.7C14219028r32694r03755q14945p33584o65366o60569p68572q67367r21249r08286
3300.1C06042641p75784o21915o28173q49545j095951j120388r51469q43972q58367
3318.4B98297077q69751q05169p59005q87365j025170r85115q95679p69228o26922
3336.8B90673673p12454q95918r24319r41723q88586o90133p22319r84966j058311
3355.2B82854944r17285p95037p74771p43955n89997n21838p45535j063198j079947
3373.5B75623381q10027o37412o43313p04348o64711m94301k77430q3059j87546n33283
3393.9B70587951n71191k20567j7256l24637o85304n14627j69456o8157j33098k92778
3414.3B67590880l41177j37686o259o2018L5286K52485K98738J93358K66731M35620
$$ plain form
3279.7 314219028 313286334 312382579 311567634 310834050 310168684 309508115 308739543 307872176 306950927 306042641
3300.1 306042641 305266857 304644942 304016769 303167224 302071273 300950885 299999416 299155444 298297077
3318.4 298297077 297427326 296622157 295863152 294975787 293950617 292965502 292069823 291300595 290673673
3336.8 290673673 289961219 289065301 288140982 287199259 286310673 285620540 284898221 283913255 282854944
3355.2 282854944 281937659 281142622 280367851 279623896 279033899 278512061 277766526 276703328 275623381
3373.5 275623381 274813354 274175942 273532629 272828281 272163570 271669269 271391839 271308780 271121234 270587951
3393.9 270587951 270016760 269796193 269778937 269454300 268768996 268254369 268084913 268016756 267883658 267590880
3414.3 267590880 267249703 267112017 267105758 267043740 267079026 267331511 267630249 267823607 268090338 268525958
3434.7B68525958K51323j04129q4311K51979M76241N06907M84646M95285N27113O15716
3455.1B71946728P56771Q23676O99371O50585R37849J125157Q41946M49568M45127
3473.4B78676778P20322J004905J039445P84308P56055R92477R97335R12129J007706
3491.8B86891460J081139J120001J110435J072168J085252R81867Q57711R59814J230269
3510.2B96390116J479149J383811J068235J041800J302748J548201J385302J030117
3526.5C06629479J068473J361787J587391J720607J653552J484901J617998J854211
3542.8C18978399J805484J564920J541555J701683J835793J978666K149254K323478
3559.1C33879232K374679K218217K097279K537071L077269K950847K749533K931982
$$ plain form
3434.7 268525958 268777281 268673152 268588841 268840820 269317061 269823968 270308614 270803899 271331012 271946728
3455.1 271946728 272703499 273527175 274226546 274877131 275814980 276940137 277782083 278231651 278676778
3473.4 278676778 279397100 280402005 281441450 282225758 282981813 283974290 284971625 285883754 286891460
3491.8 286891460 287972599 289092600 290203035 291275203 292360455 293342322 294200033 295159847 296390116
3510.2 296390116 297869265 299253076 300321311 301363111 302665859 304214060 305599362 306629479
3526.5 306629479 307697952 309059739 310647130 312367737 314021289 315506190 317124188 318978399
3542.8 318978399 320783883 322348803 323890358 325592041 327427834 329406500 331555754 333879232
3559.1 333879232 336253911 338472128 340569407 343106478 346183747 349134594 351884127 354816109
3575.4C54816109L194630L360629L500998L507197L313452L306806L721804L796845
3591.7C82518470L658504L814190M103184M185945M178762M082591L838926L922671
3608.1D14303243M220158M310846M398913M308670M272819M710734M704982M218846
3624.4D49449211L735215L872633M782378M798115M471063M305661M206091M267723
3640.7D83888090M304498M072040L734857M000455M757882M538655M048467M337191
3657E17682135M492939L989935L658235L684103L462732L181636L538490L398537K978087
3675.4E50066829L415167L599763L438771L331423L090083K737224K419055K536773
3691.7E74635088K794564K751172K494693K126932J950979K223015K364456K008975
$$ plain form
3575.4 354816109 358010739 361371368 364872366 368379563 371693015 374999821 378721625 382518470
3591.7 382518470 386176974 389991164 394094348 398280293 402459055 406541646 410380572 414303243
3608.1 414303243 418523401 422834247 427233160 431541830 435814649 440525383 445230365 449449211
3624.4 449449211 453184426 457057059 461839437 466637552 471108615 475414276 479620367 483888090
3640.7 483888090 488192588 492264628 495999485 499999940 504757822 509296477 513344944 517682135
3657 517682135 522175074 526165009 529823244 533507347 536970079 540151715 543690205 547088742 550066829
3675.4 550066829 553481996 557081759 560520530 563851953 566942036 569679260 572098315 574635088
3691.7 574635088 577429652 580180824 582675517 584802449 586753428 588976443 591340899 593349874
3708E93349874J462996J464069K128601K282083J970172J720548J624405J538575J616537
3726.4F09157860J847685J674294J247347J028478J364648J833916J608193P48753
3742.7F20511174N28336J431942J242578O66499J320958J824081J434922J035571J205981
3761F31202042J365364J207649J038135R22799J059651J258075J211465J082003R21130
3779.4F41268313Q44359Q19564R21726J109064J087904R69291Q20756P33971Q51989
3797.7F49426937O40452M61817R06765Q16643P77722J224577J205922O66618L77357
3816.1F56504810O95586N19693M96447R00567Q73088Q51274P90060O71267P24197N40971
3836.5F63567960K44499M69207P88749R52959R67204P44641J31547p20024J06633J422823
$$ plain form
3708 593349874 594812870 596276939 598405540 600687623 602657795 604378343 606002748 607541323 609157860
3726.4 609157860 611005545 612679839 613927186 614955664 616320312 618154228 619762421 620511174
3742.7 620511174 621039510 622471452 623714030 624380529 625701487 627525568 628960490 629996061 631202042
3761 631202042 632567406 633775055 634813190 635735989 636795640 638053715 639265180 640347183 641268313
3779.4 641268313 642112672 642932236 643853962 644963026 646050930 647020221 647840977 648574948 649426937
3797.7 649426937 650067389 650529206 651435971 652252614 653030336 654254913 655460835 656127453 656504810
3816.1 656504810 657200396 657720089 658216536 659117103 659990191 660841465 661631525 662302792 663026989 663567960
3836.5 663567960 663812459 664281666 665070415 666023374 666990578 667735219 667866766 667146742 667253375 668676198
3856.9F68676198J230061O09755K46227M76956O56486L44217L89874N95212O86109
3875.2F73911095P30812L87669L64184N99086M69864N19752M53055K19465M52339O21498
3895.6F78728819L06249N6028J42693L01183N50627O61135N13971L94583L10600J51336
3916F82117224J28209K99514L12686J95503K59280L11554J97351K51710M01795L45290
3936.4F84820116K79069K33471J54138K35855K52843J71006K88427L76165K68697J67430
3956.8F87247217J89960K13623K19226K59697K17021J58906K05457K61485K72513K15113
3977.2F89460218J22905J77622L15189K80201R0480M5121J71781J76727J20402K09927
3997.6F91170573
$$ plain form
3856.9 668676198 669906259 670516014 670762241 671239197 671895683 672239900 672629774 673224986 673911095
3875.2 673911095 674641907 675029576 675393760 675992846 676462710 676982462 677435517 677654982 678107321 678728819
3895.6 678728819 679035068 679091096 679233789 679534972 680085599 680746734 681260705 681655288 681965888 682117224
3916 682117224 682245433 682544947 682857633 683053136 683312416 683623970 683821321 684073031 684474826 684820116
3936.4 684820116 685099185 685332656 685486794 685722649 685975492 686146498 686434925 686811090 687079787 687247217
3956.8 687247217 687437177 687650800 687870026 688129723 688346744 688505650 688711107 688972592 689245105 689460218
3977.2 689460218 689583123 689760745 690075934 690356135 690446615 690491736 690663517 690840244 690960646 691170573
3997.6 691170573
##END=$$ End of the data block
