##TITLE=$$ Begin of the data block
##JCAMP-DX=5.00 $$ ACD/SpecManager v 10.08
##SPECTROMETER/DATA SYSTEM=Alpha
##DATE=26 Dec 2014 10:25:20
##DATA TYPE=INFRARED SPECTRUM
##DATA CLASS=XYDATA
##ORIGIN=
##OWNER=
##NPOINTS=1765
##FIRSTX=399.76428223
##LASTX=3997.64306641
##MAXX=3997.64306641
##MINX=399.76428223
##MAXY=0.83658493
##MINY=0.19461060
##XFACTOR=1.0000000000
##YFACTOR=1.000000000000000e-9
##FIRSTY=0.52780133
##DELTAX=2.03961372
##XUNITS=1/CM
##YUNITS=ARBITRARY UNITS
##XYDATA=(X++(Y..Y))
399.8 527801335 522375345 518203259 515752494 514998853 515757442 517611504 519480467 520653069 521366954
418.1 521366954 520874858 518633664 515644014 512741208 510289431 507965207 505106986 501456559 498285025
436.5 498285025 497726530 500305533 505008996 510089040 514264941 517615855 520548582 522828996 523710310
454.8 523710310 523049116 521590054 520260990 518828571 516443968 512804449 508639991 504828870 501524210
473.2 501524210 498742551 496348858 494162887 492530853 491970509 492234200 492322832 491773188 490906924
491.5 490906924 489944875 488869011 487414360 485124469 482163966 479367912 476982862 474321008 470680296
509.9 470680296 466001213 461034000 456398755 451910287 447464883 443380207 440088242 438153118
526.2 438153118 437802404 438493490 439632475 441378623 444782019 450420588 457132727 462836802 466292828
544.6 466292828 467716783 467938244 467538804 466378450 463822901 459871322 455253839 450400651 444954097
562.9 444954097 438311726 430415452 422298461 415681571 411696941 410470277 411665618 415126830
579.3 415126830 420942754 428619772 436850876 444362193 450155497 453929842 456189424 457408458
595.6 457408458 457737386 457386971 456712574 456136405 456103742 456683010 457684070 459013730 460684121
613.9 460684121 463038594 466458052 470730603 475241572 479583025 483819157 487990558 491773248
630.2 491773248 494944572 497416973 499228537 500695169 502237558 503921330 505442619 506604612
646.6 506604612 507457316 508347929 509649098 511208355 512568414 513521016 514239192 515111089 516371608
664.9 516371608 518249810 520271242 521412909 522602618 524398148 526516259 528530300 530198812
681.2 530198812 531555474 532767713 533915937 534798384 534932733 533934653 531958997 529410303 526436388
699.6 526436388 523025990 519474149 516456723 514753699 514866829 516686082 519786596 523909271 528948486
717.9 528948486 534950018 541778862 548919261 555809140 562035322 567596138 572692215 577209473
734.3 577209473 580757141 583049655 584227264 584559560 583949029 581975639 578389466 573416948 567744255
752.6 567744255 562107980 556762934 551607430 546924770 543527722 542272151 543703735 547781467
768.9 547781467 553986490 561818659 570969105 581039369 591256499 600591421 608278453 614354968
785.3 614354968 619557023 624492884 629177332 633458138 637481034 641747713 646634042 651857555
801.6 651857555 656581819 660133719 662602365 664631069 666698575 668648064 669987261 670357347 669867933
819.9 669867933 668924451 667568922 665284157 661545396 656364918 650293589 643992424 637799442 631740034
838.3 631740034 625784278 620188296 615367591 611392140 607812226 604005933 599671006 594923556
854.6 594923556 590126395 586039245 584239662 586522341 593372762 603793919 616451502 629871249
870.9 629871249 642157257 651663840 657807589 660776556 660706699 657666147 652069628 644842744 637168646
889.3 637168646 629883051 623203516 616962612 610972524 605226934 599676371 593887329 587149262
905.6 587149262 579017460 569615424 559311271 548430383 537312806 526491523 516890526 509567678
921.9 509567678 504970670 502665341 501878083 502168775 503566504 506227255 510184884 515237808 520957112
940.3 520957112 526620865 530854046 531867504 528488994 520681024 509157658 494935662 479001909
956.6 479001909 461923122 443830192 424758703 404819131 384174138 362999916 341456681
970.9 341456681 319765419 298339158 277779192 258767724 242003530 228015140 216947049
985.1 216947049 208617628 202718064 198914021 196774438 195847288 195779726 196271360 196998566 197651669
1003.5 197651669 197955012 197703466 196913898 195862174 194966987 194610596 195026264 196234465 198190972
1021.8 198190972 200873211 204185024 207932711 211889595 215794593 219261736 221965566 223840281
1038.2 223840281 225084156 226052001 227080017 228393883 230285540 233171001 237422213 243212879
1054.5 243212879 250425249 258888423 268615663 279591739 290889561 299919516 303075641 298306018
1070.8 298306018 287562490 275737166 266908616 262264222 261149496 262661040 266130626 271028131
1087.1 271028131 276973695 283666641 290660739 297280371 302770555 306628197 308830738 310005128
1103.4 310005128 311218917 313395977 316885293 321402818 326311439 330997378 335028648 338193327
1119.8 338193327 340631843 342790961 345319778 348868489 353544474 358484387 362197965 363318413
1136.1 363318413 361083478 355557591 347593874 338431507 329184771 320704550 313627690 308346689
1152.4 308346689 304984599 303497404 303815752 305956781 310083598 316406757 325079620 336063623
1168.7 336063623 349050045 363560110 379113406 395217866 411366969 427143484 442229897
1183 442229897 456321269 469006538 479783267 488257587 494409531 498629093 501506805 503607571
1199.3 503607571 505393386 507236838 509512067 512633860 516797543 521813154 527290344 532778084
1215.6 532778084 537795961 541889668 544653535 545867980 545656264 544424891 542651355 540693820
1231.9 540693820 538712084 536754251 534971774 533645511 533023834 533198059 534112155 535640836 537647426
1250.3 537647426 539986551 542405486 544518411 546043575 547116101 548193872 549668312 551628053
1266.6 551628053 553816617 555884719 557589829 558732152 559193850 558952987 558102548 556973517 555938542
1285 555938542 555042028 554018378 552617371 550788462 548691392 546548486 544416487 542215049 539916277
1303.3 539916277 537596047 535416842 533568561 532040238 530561805 528919697 527153730 525352538
1319.6 525352538 523244917 520159304 515652239 509980619 503880918 498120487 493176460 489207357
1336 489207357 486307085 484688103 484362990 484829187 485479951 485848695 485731870 485263675 484633952 483842641
1356.4 483842641 482712924 481160313 479440570 478147447 477397382 476917416 476731569 476970077 477731794
1374.7 477731794 478870630 480124056 481414676 482985348 485452861 489389718 493919879 497383595
1391 497383595 499425679 500140846 499813259 498862147 497633457 496077955 493957669 491660893 489550084
1409.4 489550084 487648070 486048281 484735698 483558983 482780844 482837021 483575761 484693676 485959262
1427.7 485959262 487424523 489206284 491234988 493732244 496524632 498804748 500785053 502575994
1444.1 502575994 503958583 504630446 504408360 503503382 502245247 500523388 499049902 499165624 500441194
1462.4 500441194 503206134 507727802 513276398 520474672 531020224 542606652 552604914 561623394
1478.7 561623394 570294857 578597188 585824847 592358768 599106550 605789483 611028910 615446150
1495 615446150 620085061 624437034 628070414 631101608 634036899 637501717 640399694 642586470 644668758
1513.4 644668758 646752000 648882508 650737405 652433932 654132843 655734718 657269955 658450842
1529.7 658450842 659250379 659861445 660488009 661021709 661284685 661120057 660833955 660622299 660437465 660169303
1550.1 660169303 659693182 658926964 657969415 656542897 655007005 654306531 653484404 652364254 651134014
1568.5 651134014 650019586 649392366 648699582 647459865 646393895 645725906 645098567 644380212 643374205
1586.8 643374205 642051935 640549064 639027357 637438536 635610700 633404434 630749464 627832711
1603.2 627832711 624878228 621771932 618193924 614332497 610572517 606423974 601688564 598025382
1619.5 598025382 594775915 590742350 586874366 583515644 580438495 577976704 575675786 572967052
1635.8 572967052 571212530 570694745 570610106 570723534 571173012 572329342 573751390 575783074 579416871
1654.1 579416871 582669318 585511565 588893652 593271732 598123550 602411568 606978536 612485886
1670.5 612485886 617697656 623209238 629256487 634485662 639132738 644454598 651699007 658014476
1686.8 658014476 662966788 667976856 672468543 677075624 682052195 686654031 691453934 695303023
1703.1 695303023 698554039 702061236 705263138 708023965 710416436 712561131 714692235 716392517
1719.4 716392517 717490792 718573272 720152736 722075403 724077940 725939453 727939963 730099142
1735.7 730099142 731919408 733822227 735965252 738150477 740368843 742740035 745604694 748893142
1752 748893142 751860023 754541874 757140577 759516954 761893034 764084458 765869737 767409205 768823862
1770.4 768823862 770288229 771791995 773118734 774297059 775437534 776578963 777717233 778825641
1786.7 778825641 779794276 780608356 781536400 782588303 783552349 784391224 785234571 786182106 787124515
1805.1 787124515 787980020 788754582 789512038 790274560 791034102 791792750 792539179 793177187 793697357 794258475
1825.5 794258475 794880331 795475960 796062350 796595931 797035515 797489166 797939718 798240960 798424125 798731983
1845.9 798731983 799149573 799534500 799851894 800078809 800266147 800478399 800763249 801071167 801302850 801400185
1866.3 801400185 801484168 801801085 802263319 802653730 802941740 803225517 803559542 803952575 804385364 804754138
1886.7 804754138 804974735 805197656 805538535 805888534 806179762 806376755 806502163 806646705 806847751 807011127
1907.1 807011127 807080984 807147741 807267487 807408512 807572663 807770371 807886720 807954431 808130443 808378637
1927.5 808378637 808594048 808727860 808772027 808809817 808955371 809139490 809239149 809313834 809450209 809642136
1947.9 809642136 809887350 810159743 810404599 810584784 810721934 810910881 811178982 811410964 811521411 811624467
1968.3 811624467 811811149 812029660 812225997 812344074 812386036 812436283 812559068 812724173 812853038 812897861
1988.7 812897861 812870085 812848747 812914431 813016593 813065529 813031375 812916279 812794209 812714756 812603176 812353253
2011.1 812353253 811979353 811577678 811216474 810862362 810378015 809654236 808899343 808553040 808533907 808401644
2031.5 808401644 808047295 807587147 807151318 806822956 806578040 806307137 805956185 805612862 805404544 805348814
2051.9 805348814 805343986 805299878 805232704 805215180 805281818 805408359 805516303 805550218 805540442 805552244 805633008
2074.3 805633008 805760443 805836499 805857062 805889368 805958688 806093752 806248009 806353807 806448579 806602299
2094.7 806602299 806815684 807035625 807201624 807307243 807430148 807606757 807780325 807894588 807962060 808040917
2115.1 808040917 808156490 808262944 808311224 808299661 808277309 808302343 808376729 808447480 808449507 808421433 808445334
2137.5 808445334 808508158 808571219 808631122 808656394 808673918 808761656 808899701 809047997 809183300 809310317 809488475
2160 809488475 809775293 810150743 810513258 810841739 811233521 811721444 812241256 812739134 813199699 813696742
2180.4 813696742 814264894 814811289 815273166 815671921 816051722 816449463 816918135 817423940 817839563 818136156
2200.8 818136156 818439245 818870723 819389880 819878042 820315957 820738614 821172118 821626008 822020710 822304070
2221.2 822304070 822545171 822836816 823198736 823583364 823901236 824101329 824301481 824598908 824925184 825194895
2241.6 825194895 825398207 825560629 825730860 826000273 826322317 826521218 826607227 826735139 826972544 827308297
2262 827308297 827625275 827809453 827928185 828094363 828355193 828665078 828899503 829031110 829144299 829310656
2282.3 829310656 829570293 829865694 830090225 830260813 830467463 830726087 830996990 831236303 831390738 831513047
2302.7 831513047 831741691 832113504 832519472 832826257 833030105 833255529 833644867 834189892 834673584 834937036
2323.1 834937036 835087299 835325003 835713923 836009860 835944235 835698128 835568249 835570157 835522175 835128903
2343.5 835128903 834181905 833245635 833068609 833771884 834926128 835924685 836502433 836584926 836236596 835570633
2363.9 835570633 834674895 833647311 832503617 831324816 830278516 829373598 828505933 827640951 826861918
2382.3 826861918 826293588 825980783 825804114 825580537 825261652 824933887 824696064 824526131 824304640 823960841
2402.7 823960841 823541522 823155701 822826684 822504699 822114229 821598291 821021616 820516825 820104957 819675565
2423.1 819675565 819136679 818499804 817848742 817273617 816786349 816262186 815605521 814898849 814273000 813731253
2443.5 813731253 813159645 812471926 811703563 811009228 810466290 809995413 809487641 808871746 808171809 807516217
2463.9 807516217 806990683 806533039 806016564 805400193 804781437 804242551 803771496 803307593 802785695 802212536
2484.3 802212536 801662862 801206112 800843358 800520062 800156832 799737215 799346685 799038291 798778951 798477173
2504.7 798477173 798079431 797669947 797336221 797055960 796751201 796347678 795861185 795363009 794909120 794500887
2525.1 794500887 794033945 793412864 792709529 792084754 791552901 790985823 790293574 789512455 788761377 788090229
2545.5 788090229 787470818 786855102 786183894 785461962 784750223 784109533 783551931 782995045 782348871 781627834
2565.8 781627834 780938029 780338109 779761732 779135108 778445244 777756393 777184188 776714504 776206851 775600553
2586.2 775600553 774951041 774364352 773935556 773618996 773234904 772695541 772093654 771556437 771104336 770629346
2606.6 770629346 770006180 769214392 768377483 767621756 766916931 766135812 765159369 763996780 762832046
2625 762832046 761793971 760788918 759640813 758301497 756917357 755672753 754563272 753416240 752129555
2643.4 752129555 750753999 749401033 748191953 747115552 745973110 744664371 743326664 742125452
2659.7 742125452 741069138 740032613 738894522 737661004 736461520 735428154 734530985 733595014 732550025
2678 732550025 731469631 730457604 729582191 728753746 727818787 726764858 725679159 724640369 723670244
2696.4 723670244 722679436 721555710 720317364 719080508 717917621 716782808 715599597 714340866
2712.7 714340866 713057995 711877525 710850835 709911644 708928108 707804441 706664681 705703795 704919517
2731.1 704919517 704157531 703284919 702321172 701413333 700651765 699957013 699170589 698247254 697351873 696661651
2751.4 696661651 696105480 695501983 694784701 693988502 693235874 692645490 692123055 691472828 690696359 689899206
2771.8 689899206 689111173 688326478 687497795 686538339 685432673 684285402 683181703 682079017 680884361
2790.2 680884361 679515243 677969873 676386595 674874365 673362911 671689808 669787884 667780995
2806.5 667780995 665826917 663919628 661899865 659660280 657283485 654905677 652536929 650108039
2822.8 650108039 647563457 644850850 642002046 639124811 636222720 633188665 629940629 626466513
2839.1 626466513 622794449 618945837 614906967 610675931 606366158 602209926 598441601 595142901
2855.5 595142901 592106462 588944256 585353613 581236184 576610386 571517944 565991044 560066581
2871.8 560066581 553894162 547715783 541790068 536349118 531546533 527445257 524062634 521455109
2888.1 521455109 519613087 518333793 517359734 516485572 515573621 514611185 513559520 512253761 510554075
2906.5 510554075 508405328 505804598 502724707 499084741 494933009 490569800 486348361 482549369
2922.8 482549369 479406297 477070689 475630611 475212157 476023793 478199631 481637269 486087918 491312355
2941.1 491312355 497094214 503252983 509665787 516248643 522886872 529421806 535837948 542250752
2957.4 542250752 548640132 554814637 560564339 565833330 570765018 575477540 580022454 584443688
2973.8 584443688 588709891 592836738 596868098 600718260 604258180 607432842 610270202 612851501
2990.1 612851501 615178704 617185652 618857443 620128512 620976686 621527791 621825814 621817887 621509075
3008.4 621509075 620930433 620037794 618801713 617320597 615655184 613776684 611737490 609574974 607279718
3026.8 607279718 604938328 602553725 600040495 597367585 594587207 591875374 589217484 586382449
3043.1 586382449 583324552 580194473 577130675 574115396 571056068 567936957 564742565 561501086
3059.4 561501086 558340430 555305660 552306294 549182475 545858681 542518973 539381802 536435902
3075.7 536435902 533474267 530291021 526956499 523685336 520499527 517328262 514119506 510823011
3092.1 510823011 507517874 504349828 501336515 498304904 495118052 491922766 488874048 485869318
3108.4 485869318 482772589 479692072 476759970 473872572 470916867 467835933 464618742 461424083
3124.7 461424083 458373934 455428004 452490658 449513644 446606934 443860322 441155851 438317955
3141 438317955 435375273 432475805 429679215 427029014 424485981 421872824 419095308 416293293 413613260
3159.4 413613260 411019534 408457130 405947745 403488427 401032090 398593277 396225274 393921375
3175.7 393921375 391630292 389338046 387057215 384812564 382621437 380483508 378396958 376331806
3192 376331806 374244809 372129321 370052069 368064135 366174549 364353418 362508684 360609144 358759493
3210.3 358759493 357040733 355379641 353705466 352029800 350375563 348745465 347136110 345591187
3226.7 345591187 344149768 342805535 341491550 340041131 338451773 336925149 335539609 334278077
3243 334278077 333121300 331935227 330574840 329169750 327957928 326910675 325815707 324628592 323493898
3261.3 323493898 322459191 321473718 320566773 319776654 318958431 317967594 316875756 315792829 314778835
3279.7 314778835 313861877 313005894 312175781 311392158 310691029 310035318 309307367 308438629 307464242 306526870
3300.1 306526870 305797517 305243611 304609507 303718060 302632213 301524162 300532728 299666703 298851460
3318.4 298851460 298021942 297201127 296425343 295525342 294469297 293503791 292671412 291907847 291217417
3336.8 291217417 290448308 289499670 288506538 287537307 286685735 286058962 285358965 284313351 283170879
3355.2 283170879 282259136 281542569 280789971 279996186 279370248 278838962 278078854 277030230 275989056
3373.5 275989056 275192887 274568647 273959279 273267061 272579670 272076428 271819770 271721154 271460891 270866871
3393.9 270866871 270283997 270111293 270142972 269800395 269074082 268528521 268367052 268352300 268238395 267903060
3414.3 267903060 267524391 267377079 267380059 267333031 267325759 267521709 267862737 268142879 268430740 268861949
3434.7 268861949 269151628 269102812 269010037 269177347 269603223 270114303 270597398 271101683 271642745 272228926
3455.1 272228926 272935718 273720652 274378598 275015026 275983185 277164370 278062701 278543830 279000461
3473.4 279000461 279730111 280756921 281802803 282561153 283292353 284261525 285223305 286084205 287059337
3491.8 287059337 288190246 289373517 290482938 291567326 292682290 293664485 294549733 295559466 296776056
3510.2 296776056 298190504 299555570 300636947 301656276 302949935 304531813 305951715 307026774
3526.5 307026774 308162242 309560478 311108023 312788129 314473212 315989912 317578822 319383591
3542.8 319383591 321178973 322785586 324384868 326128006 327989668 330007911 332209110 334555238
3559.1 334555238 336919546 339137048 341268986 343828201 346896499 349873394 352645129 355546951
3575.4 355546951 358711869 362093538 365644038 369195461 372543782 375847250 379562736 383394271
3591.7 383394271 387096882 390946567 395050228 399214417 403402388 407531440 411415517 415318012
3608.1 415318012 419490486 423843563 428332180 432683915 436964989 441653758 446308821 450494438
3624.4 450494438 454216450 458111197 462961257 467783719 472256452 476596236 480814189 485036522
3640.7 485036522 489290535 493341655 497095317 501201093 506059647 510573268 514564514 518878222
3657 518878222 523384273 527421057 531095505 534727395 538125753 541303694 544912994 548389971 551411271
3675.4 551411271 554810464 558365166 561753631 565062046 568167865 570914090 573347032 575907648
3691.7 575907648 578686833 581390321 583833098 585955858 587980092 590221167 592481554 594426692
3708 594426692 595914245 597388148 599550188 601909220 603942931 605674148 607276201 608758807 610261858
3726.4 610261858 612040401 613747597 615069330 616153181 617548287 619403303 621044159 621858299
3742.7 621858299 622393727 623740673 624933541 625577271 626877248 628669024 630061865 631156445 632504761
3761 632504761 633909166 635066330 636109054 637058675 638083398 639330983 640570104 641629040 642492712
3779.4 642492712 643337369 644181907 645079613 646150529 647233486 648214340 649083853 649876595 650658488
3797.7 650658488 651163936 651631832 652676582 653607547 654366910 655505300 656661689 657320619 657712877
3816.1 657712877 658402503 658896565 659404457 660375595 661309779 662169158 662973464 663701177 664418280 664808452
3836.5 664808452 664867699 665248752 666065037 667098582 668132007 668928206 669102848 668464720 668654859
3854.8 668654859 670048714 671265543 671915472 672117054 672473073 673047781 673337102 673729777 674431086
3873.2 674431086 675229371 675966024 676291645 676639557 677255869 677716255 678220868 678637862 678838551 679365516
3893.6 679365516 680062175 680371106 680366695 680402219 680604339 681143522 681872666 682465732 682923853 683247447
3914 683247447 683362365 683507264 683865070 684167206 684317768 684596121 684985340 685229361 685454607 685837090
3934.4 685837090 686215758 686493158 686635196 686696947 686915815 687201440 687422514 687708855 688021898 688293457
3954.8 688293457 688534558 688764691 688987255 689223766 689486265 689686954 689853549 690055132 690233529 690408230
3975.2 690408230 690645933 690886796 691117167 691352189 691509008 691598654 691769898 692040145 692247212 692380726
3995.6 692380726 692575991
3997.6 692575991
##END=$$ End of the data block
